harmony-dev mailing list archives

Site index · List index
Message view « Date » · « Thread »
Top « Date » · « Thread »
From Tim Ellison <t.p.elli...@gmail.com>
Subject Re: [continuum] BUILD FAILURE: Classlib/linux.ia32 Build/Test
Date Tue, 02 Jan 2007 14:49:13 GMT
The failure reported here is a timeout in :

org.apache.harmony.security.tests.provider.cert.X509CRLImplTest

I'm looking into it.
Tim


nomail@hursley.ibm.com wrote:
> Online report : http://people.apache.org/~hindessm/continuum/classlib/linux.ia32/2007/01/02/20070102-142146.failure.log.gz
> Build statistics:
>   State: Failed
>   Previous State: Ok
>   Started at: Tue, 2 Jan 2007 13:07:37 +0000
>   Finished at: Tue, 2 Jan 2007 14:21:43 +0000
>   Total time: 1h 14m 6s
>   Build Trigger: Schedule
>   Exit code: 1
>   Building machine hostname: hy2
>   Operating system : Linux(unknown)
>   Java version : 1.5.0_06(Sun Microsystems Inc.)
> 
> Changes
>                             classlib/modules/luni/src/test/java/tests/api/java/net/URITest.java
>             classlib/modules/luni/src/test/java/tests/api/java/io/ObjectInputStreamTest.java
>             classlib/modules/luni/src/test/java/org/apache/harmony/luni/tests/pkg1/TestClass.java
>             classlib/modules/luni/src/test/java/org/apache/harmony/luni/tests/pkg2/TestClass.java
>             classlib/modules/luni/src/main/java/java/net/URI.java
>             classlib/modules/luni/src/main/java/java/io/ObjectInputStream.java
>         
> ****************************************************************************
> Output:
> ****************************************************************************
> Buildfile: build.xml
> 
> build:
>    [delete] Deleting directory /home/hybld/continuum-working-directory/6/classlib/deploy
>      [echo] Classlib revision is 491789
>      [echo] Post process: true
>      [echo] JAPI: true
>      [echo] Building with reference jdk/javac
>      [exec] Buildfile: build.xml
> 
>      [exec] -init-hdk-for-clean:
>      [exec]     [mkdir] Created dir: /home/hybld/continuum-working-directory/6/classlib/deploy/build/ant
>      [exec]      [copy] Copying 1 file to /home/hybld/continuum-working-directory/6/classlib/deploy/build/ant
> 
>      [exec] clean-java:
> 
>      [exec] -modules-clean-bin:
> 
>      [exec] clean:
>      [exec]    [delete] Deleting 30 files from /home/hybld/continuum-working-directory/6/classlib/build/classes
>      [exec]    [delete] Deleting 12 files from /home/hybld/continuum-working-directory/6/classlib/modules/accessibility/bin/test
> 
>      [exec] clean:
>      [exec]    [delete] Deleting 13 files from /home/hybld/continuum-working-directory/6/classlib/build/classes
> 
>      [exec] clean:
>      [exec]    [delete] Deleting 35 files from /home/hybld/continuum-working-directory/6/classlib/build/classes
>      [exec]    [delete] Deleting 1 files from /home/hybld/continuum-working-directory/6/classlib/modules/applet/bin/test
> 
>      [exec] clean:
>      [exec]    [delete] Deleting 78 files from /home/hybld/continuum-working-directory/6/classlib/build/classes
>      [exec]    [delete] Deleting 49 files from /home/hybld/continuum-working-directory/6/classlib/modules/archive/bin/test
> 
>      [exec] clean-native-includes:
>      [exec]    [delete] /home/hybld/continuum-working-directory/6/classlib/deploy/include
not found.
> 
>      [exec] clean:
>      [exec]    [delete] Deleting 113 files from /home/hybld/continuum-working-directory/6/classlib/build/classes
>      [exec]    [delete] Deleting 226 files from /home/hybld/continuum-working-directory/6/classlib/modules/auth/bin/test
> 
>      [exec] clean:
>      [exec]    [delete] Deleting 901 files from /home/hybld/continuum-working-directory/6/classlib/build/classes
>      [exec]    [delete] Deleting 589 files from /home/hybld/continuum-working-directory/6/classlib/modules/awt/bin/test
> 
>      [exec] clean:
>      [exec]    [delete] Deleting 107 files from /home/hybld/continuum-working-directory/6/classlib/build/classes
>      [exec]    [delete] Deleting 238 files from /home/hybld/continuum-working-directory/6/classlib/modules/beans/bin/test
> 
>      [exec] clean:
>      [exec]    [delete] Deleting 125 files from /home/hybld/continuum-working-directory/6/classlib/build/classes
>      [exec]    [delete] /home/hybld/continuum-working-directory/6/classlib/modules/concurrent/bin/test
not found.
> 
>      [exec] clean:
>      [exec]    [delete] Deleting 48 files from /home/hybld/continuum-working-directory/6/classlib/build/classes
>      [exec]    [delete] Deleting 91 files from /home/hybld/continuum-working-directory/6/classlib/modules/crypto/bin/test
> 
>      [exec] clean:
>      [exec]    [delete] Deleting 87 files from /home/hybld/continuum-working-directory/6/classlib/build/classes
> 
>      [exec] clean:
>      [exec]    [delete] Deleting 9 files from /home/hybld/continuum-working-directory/6/classlib/build/classes
>      [exec]    [delete] Deleting 20 files from /home/hybld/continuum-working-directory/6/classlib/modules/instrument/bin/test
> 
>      [exec] clean:
>      [exec]    [delete] Deleting 154 files from /home/hybld/continuum-working-directory/6/classlib/build/classes
>      [exec]    [delete] Deleting 163 files from /home/hybld/continuum-working-directory/6/classlib/modules/jndi/bin/test
> 
>      [exec] clean:
>      [exec]    [delete] Deleting 15 files from /home/hybld/continuum-working-directory/6/classlib/build/classes
>      [exec]    [delete] Deleting 2 files from /home/hybld/continuum-working-directory/6/classlib/modules/lang-management/bin/test
> 
>      [exec] clean:
>      [exec]    [delete] Deleting 34 files from /home/hybld/continuum-working-directory/6/classlib/build/classes
>      [exec]    [delete] Deleting 99 files from /home/hybld/continuum-working-directory/6/classlib/modules/logging/bin/test
> 
>      [exec] clean:
>      [exec]    [delete] Deleting 963 files from /home/hybld/continuum-working-directory/6/classlib/build/classes
>      [exec]    [delete] Deleting 897 files from /home/hybld/continuum-working-directory/6/classlib/modules/luni/bin/test
> 
>      [exec] clean-native-includes:
>      [exec]    [delete] /home/hybld/continuum-working-directory/6/classlib/deploy/include
not found.
>      [exec]    [delete] /home/hybld/continuum-working-directory/6/classlib/deploy/jdk/include
not found.
> 
>      [exec] clean:
>      [exec]    [delete] Deleting 29 files from /home/hybld/continuum-working-directory/6/classlib/build/classes
> 
>      [exec] clean:
>      [exec]    [delete] Deleting 14 files from /home/hybld/continuum-working-directory/6/classlib/build/classes
>      [exec]    [delete] Deleting 25 files from /home/hybld/continuum-working-directory/6/classlib/modules/math/bin/test
> 
>      [exec] clean:
>      [exec]    [delete] Deleting 14 files from /home/hybld/continuum-working-directory/6/classlib/build/classes
>      [exec]    [delete] Deleting 1 files from /home/hybld/continuum-working-directory/6/classlib/modules/misc/bin/test
> 
>      [exec] clean:
>      [exec]    [delete] Deleting 146 files from /home/hybld/continuum-working-directory/6/classlib/build/classes
>      [exec]    [delete] Deleted 5 directories from /home/hybld/continuum-working-directory/6/classlib/build/classes
>      [exec]    [delete] Deleting 156 files from /home/hybld/continuum-working-directory/6/classlib/modules/nio/bin/test
>      [exec]    [delete] Deleted 19 directories from /home/hybld/continuum-working-directory/6/classlib/modules/nio/bin/test
> 
>      [exec] clean:
>      [exec]    [delete] Deleting 20 files from /home/hybld/continuum-working-directory/6/classlib/build/classes
>      [exec]    [delete] Deleting 77 files from /home/hybld/continuum-working-directory/6/classlib/modules/nio_char/bin/test
> 
>      [exec] clean:
> 
>      [exec] clean-native-includes:
>      [exec]    [delete] /home/hybld/continuum-working-directory/6/classlib/deploy/include
not found.
> 
>      [exec] clean:
>      [exec]    [delete] Deleting 32 files from /home/hybld/continuum-working-directory/6/classlib/build/classes
>      [exec]    [delete] Deleting 34 files from /home/hybld/continuum-working-directory/6/classlib/modules/prefs/bin/test
> 
>      [exec] clean:
>      [exec]    [delete] Deleting 205 files from /home/hybld/continuum-working-directory/6/classlib/build/classes
>      [exec]    [delete] Deleting 60 files from /home/hybld/continuum-working-directory/6/classlib/modules/print/bin/test
> 
>      [exec] clean:
>      [exec]    [delete] Deleting 177 files from /home/hybld/continuum-working-directory/6/classlib/build/classes
>      [exec]    [delete] Deleting 13 files from /home/hybld/continuum-working-directory/6/classlib/modules/regex/bin/test
> 
>      [exec] clean:
>      [exec]    [delete] Deleting 230 files from /home/hybld/continuum-working-directory/6/classlib/build/classes
>      [exec]    [delete] Deleting 53 files from /home/hybld/continuum-working-directory/6/classlib/modules/rmi/bin/test
> 
>      [exec] clean:
>      [exec]    [delete] Deleting 428 files from /home/hybld/continuum-working-directory/6/classlib/build/classes
>      [exec]    [delete] Deleting 618 files from /home/hybld/continuum-working-directory/6/classlib/modules/security/bin/test
> 
>      [exec] clean:
>      [exec]    [delete] Deleting 2 files from /home/hybld/continuum-working-directory/6/classlib/build/classes
> 
>      [exec] clean:
>      [exec]    [delete] Deleting 72 files from /home/hybld/continuum-working-directory/6/classlib/build/classes
>      [exec]    [delete] Deleting 53 files from /home/hybld/continuum-working-directory/6/classlib/modules/sound/bin/test
> 
>      [exec] clean:
>      [exec]    [delete] Deleting 74 files from /home/hybld/continuum-working-directory/6/classlib/build/classes
>      [exec]    [delete] Deleting 54 files from /home/hybld/continuum-working-directory/6/classlib/modules/sql/bin/test
> 
>      [exec] clean:
>      [exec]    [delete] Deleting 5 files from /home/hybld/continuum-working-directory/6/classlib/build/classes
> 
>      [exec] clean:
>      [exec]    [delete] Deleting 1591 files from /home/hybld/continuum-working-directory/6/classlib/build/classes
>      [exec]    [delete] Deleting 1502 files from /home/hybld/continuum-working-directory/6/classlib/modules/swing/bin/test
> 
>      [exec] clean:
>      [exec]    [delete] Deleting 40 files from /home/hybld/continuum-working-directory/6/classlib/build/classes
>      [exec]    [delete] Deleting 32 files from /home/hybld/continuum-working-directory/6/classlib/modules/text/bin/test
> 
>      [exec] clean:
>      [exec]    [delete] Deleting 34 files from /home/hybld/continuum-working-directory/6/classlib/build/classes
>      [exec]    [delete] Deleting 4 files from /home/hybld/continuum-working-directory/6/classlib/modules/tools/bin/test
> 
>      [exec] clean:
>      [exec]    [delete] Deleting 123 files from /home/hybld/continuum-working-directory/6/classlib/build/classes
>      [exec]    [delete] Deleting 54 files from /home/hybld/continuum-working-directory/6/classlib/modules/x-net/bin/test
> 
> ...
> 
>      [exec]     [junit] Tests run: 1, Failures: 0, Errors: 0, Time elapsed: 0.004 sec
>      [exec]     [junit] Tests run: 1, Failures: 0, Errors: 0, Time elapsed: 0.004 sec
>      [exec]     [junit] Tests run: 1, Failures: 0, Errors: 0, Time elapsed: 0.007 sec
>      [exec]     [junit] Tests run: 1, Failures: 0, Errors: 1, Time elapsed: 0 sec
>      [exec]     [junit] Tests FAILED (timeout)
>      [exec]      [echo] Running SECURITY impl injected tests
>      [exec]     [junit] Running org.apache.harmony.security.DefaultPolicyScannerTest
>      [exec]     [junit] Tests run: 4, Failures: 0, Errors: 0, Time elapsed: 0.332 sec
>      [exec]     [junit] Tests run: 5, Failures: 0, Errors: 0, Time elapsed: 0.15 sec
>      [exec]     [junit] Tests run: 1, Failures: 0, Errors: 0, Time elapsed: 0.036 sec
> 
> ...
> 
>      [exec] gen-report:
> 
>      [exec] check-test-result:
> 
>      [exec] BUILD FAILED
>      [exec] /home/hybld/continuum-working-directory/6/classlib/build.xml:167: The following
error occurred while executing this line:
>      [exec] /home/hybld/continuum-working-directory/6/classlib/make/build-test.xml:133:
There were test crashes: /home/hybld/continuum-working-directory/6/classlib/build/test_report/TEST-org.apache.harmony.security.tests.provider.cert.X509CRLImplTest.xml
> 
>      [exec] Total time: 57 minutes 20 seconds
>      [exec] Result: 1
>      [echo] Tests.failed is set to true
> 
> japi:
> 
>      [exec] Processing class java.lang,Object:+
>      [exec] Processing package java.lang,:==========================================================================+-++++++++++++++++++++++++-+++++++++++++++++++++++++++++++++++++++++++++++++--^+^+++++++++--++++++++++
> 
> ...
> 
>      [exec] Processing package java.lang.management,:==========================================================================+++++++++++++++
>      [exec] Processing package java.lang.ref,:==========================================================================+++++
>      [exec] Processing package java.lang.reflect,:==========================================================================+++++++++++++++++++++
>      [exec] Processing class ,java:
>      [exec] Failed to Japize java: java.lang.RuntimeException: NoClassDefFoundError:
java
>      [exec] java.lang.RuntimeException: NoClassDefFoundError: java
>      [exec] 	at net.wuffies.japi.ClassFile.forName(ClassFile.java:163)
>      [exec] 	at net.wuffies.japi.Japize.getClassWrapper(Japize.java:1425)
>      [exec] 	at net.wuffies.japi.Japize.japizeClass(Japize.java:748)
>      [exec] 	at net.wuffies.japi.Japize.processClass(Japize.java:516)
> 
> ...
> 
>      [exec] 	at net.wuffies.japi.Japize.doJapize(Japize.java:443)
>      [exec] 	at net.wuffies.japi.Japize.main(Japize.java:316)
> 
>      [exec] Processing class ,javax:
>      [exec] Failed to Japize javax: java.lang.RuntimeException: NoClassDefFoundError:
javax
>      [exec] java.lang.RuntimeException: NoClassDefFoundError: javax
>      [exec] 	at net.wuffies.japi.ClassFile.forName(ClassFile.java:163)
>      [exec] 	at net.wuffies.japi.Japize.getClassWrapper(Japize.java:1425)
>      [exec] 	at net.wuffies.japi.Japize.japizeClass(Japize.java:748)
>      [exec] 	at net.wuffies.japi.Japize.processClass(Japize.java:516)
> 
> ...
> 
>      [exec] 	at net.wuffies.japi.Japize.doJapize(Japize.java:443)
>      [exec] 	at net.wuffies.japi.Japize.main(Japize.java:316)
> 
>      [exec] Processing class ,org:
>      [exec] Failed to Japize org: java.lang.RuntimeException: NoClassDefFoundError: org
>      [exec] java.lang.RuntimeException: NoClassDefFoundError: org
>      [exec] 	at net.wuffies.japi.ClassFile.forName(ClassFile.java:163)
>      [exec] 	at net.wuffies.japi.Japize.getClassWrapper(Japize.java:1425)
>      [exec] 	at net.wuffies.japi.Japize.japizeClass(Japize.java:748)
>      [exec] 	at net.wuffies.japi.Japize.processClass(Japize.java:516)
> 
> ...
> 
> update-index:
> 
> test-result:
> 
> BUILD FAILED
> /home/hybld/continuum-working-directory/6/build.xml:193: There were test errors.
> 
> Total time: 74 minutes 5 seconds
> 
> ****************************************************************************
> 
> ...
> 

Mime
View raw message