harmony-dev mailing list archives

Site index · List index
Message view « Date » · « Thread »
Top « Date » · « Thread »
From "Elena Semukhina" <elena.semukh...@gmail.com>
Subject Re: [drlvm][testing] CC on win xp failed to run smoke tests
Date Mon, 11 Dec 2006 06:59:38 GMT
On 12/11/06, Stepan Mishura <stepan.mishura@gmail.com> wrote:
>
> On 12/11/06, Vladimir Ivanov wrote:
> >
> > It is reproduced on my PC too with window:
> >
> > "File: ...\ver_utils.cpp
> >
> > Line: 655
> >
> > Expression: class_get_verify_data_ptr( ctex -> m_class) == NULL"
> >
> >
> >
> > I suggest excluding this test while the reason of failure will
> > be investigated.
>
>
> I see pop-up window with error message during suite run but I can not
> understand which test failed. I've looked into
> build/win_ia32_msvc_debug/semis/vm/_cunit.tests but I don't see any info
> about failure.
>
> Here is log:
> [echo] ## Executing C unit test: test_native_basic
> [exec] Result: -1073741819
> [echo] INFO: TEST test_hythread_self_base start
> [echo] INFO: TEST test_hythread_self_base: PASSED
> [echo] INFO: TEST test_hythread_create start
> [echo] INFO: TEST test_hythread_create: PASSED
> [echo] INFO: TEST test_hythread_create_many start
> [echo] INFO: TEST test_hythread_create_many: PASSED
> [echo] INFO: TEST test_hythread_iterator start
> [echo] iterator size: 100
> [echo] INFO: TEST test_hythread_iterator: PASSED
> [echo] INFO: TEST test_hythread_iterator_default start
> [echo] default group iterator: 102
> [echo] INFO: TEST test_hythread_iterator_default: PASSED
> [echo] ## TEST FAILED
> ...
>
> So how I can understand which test failed to exclude it?


Stepan,

Vladimir's message was about smoke tests failure and there was a clear line
in his report:
  [exec]      [echo] *** FAILED **** : perf.SeveralThreads

You talk about the cunit tests. Possibly  the line
[exec] Result: -1073741819
 could be a hint?

Elena

Thanks,
> Stepan.
>
> thanks, Vladimir
> >
> >
> > On 12/11/06, Vladimir Ivanov wrote:
> > >
> > >  The CC under the winXP system failed to run 'perf.SeveralThreads'
> drlvm
> > > smoke test.
> > >
> > > Could somebody reproduce it?
> > >
> > >
> > >  Thanks, Vladimir
> > >
> > >      [exec] java_test_smoke_with_jit_or_interpreter:
> > >
> > >      [exec]      [echo] Using interpreter
> > >
> > >      [exec]      [echo]
> > >
> > >      [exec]      [echo]          ==================================
> > >
> > >      [exec]      [echo]          Smoke tests
> > >
> > >      [exec]      [echo]          ==================================
> > >
> > >      [exec]      [echo]
> > >
> > >      [exec]      [echo] Excluding Tests from
> > >
> >
> C:\cc.harmony\trunk\cc\projects\drlvm\trunk\build\make\excludes\exclude.drlvm_smoke.windows.x86.interpreter
> > >
> > >
> > >      [exec]      [echo]
> > >
> > >      [exec]      [echo] Check.java
> > >
> > >      [exec]      [echo] PerfCheck.java
> > >
> > >      [exec]      [echo] classloader/StressLoader.java
> > >
> > >      [exec]      [echo] gc/Mark.java
> > >
> > >      [exec]      [echo] gc/SynchronizedFinilazersTest.java
> > >
> > >      [exec]      [echo] init/ErrorInInitializer.java
> > >
> > >      [exec]      [echo] io/Integers.java
> > >
> > >      [exec]      [echo] stress/Stack.java
> > >
> > >      [exec]      [echo] thread/InfiniteFinalizer.java
> > >
> > >      [exec]      [echo]
> > >
> > >      [exec]      [echo]
> ------------------------------------------------
> > >
> > >      [exec]      [echo]
> > >
> > >      [exec]      [echo]   PASSED : Hi
> > >
> > >      [exec]      [echo]  PASSED : StackTest
> > >
> > > <…snip…>
> > >
> > >      [exec]      [echo]  PASSED : perf.MultiThreadsSimple
> > >
> > >      [exec]      [java] Java Result: 3
> > >
> > >      [exec]      [echo] *** FAILED **** : perf.SeveralThreads
> > >
> > >      [exec]      [echo]   PASSED : perf.StressCornerSize
> > >
> > >      [exec]      [echo]   PASSED : perf.StressCornerSize_a
> > >
> >
> >
>
>
> --
> Stepan Mishura
> Intel Enterprise Solutions Software Division
>
>


-- 
Thanks,
Elena

Mime
  • Unnamed multipart/alternative (inline, None, 0 bytes)
View raw message