harmony-dev mailing list archives

Site index · List index
Message view « Date » · « Thread »
Top « Date » · « Thread »
From "Vladimir Ivanov" <ivavladi...@gmail.com>
Subject [drlvm][testing] CC on SUSE9 64 bit failed to run cunit test
Date Tue, 12 Dec 2006 13:06:57 GMT
CC on SUSE9 64 bit failed to run cunit test. Execution log below. Could
somebody reproduce/ fix it?


Execution log:
     [exec]      [echo] ## Linking C unit test: test_ti_timing
     [exec]        [cc] 0 total files to be compiled.
     [exec]        [cc] Starting link
     [exec]      [echo] ## Executing C unit test: test_java_attrs
     [exec]      [exec] Result: 139
     [exec]      [echo] INFO: TEST test_jthread_get_priority start
     [exec]      [echo] ## TEST FAILED
     [exec]      [echo] ## Executing C unit test: test_java_basic
     [exec]      [exec] Result: 139
     [exec]      [echo] INFO: TEST test_jthread_attach start
     [exec]      [echo] ## TEST FAILED
     [exec]      [echo] ## Executing C unit test: test_java_identify
     [exec]      [exec] Result: 139
     [exec]      [echo] INFO: TEST test_jthread_self start
     [exec]      [echo] ## TEST FAILED
     [exec]      [echo] ## Executing C unit test: test_java_interrupt
     [exec]      [exec] Result: 139
     [exec]      [echo] INFO: TEST test_jthread_interrupt start
     [exec]      [echo] ## TEST FAILED
     [exec]      [echo] ## Executing C unit test: test_java_monitors
     [exec]      [exec] Result: 139
     [exec]      [echo] INFO: TEST test_jthread_monitor_init start
     [exec]      [echo] ## TEST FAILED
     [exec]      [echo] ## Executing C unit test: test_java_park
     [exec]      [exec] Result: 139
     [exec]      [echo] INFO: TEST test_jthread_park_unpark start
     [exec]      [echo] ## TEST FAILED
     [exec]      [echo] ## Executing C unit test: test_java_ptr_conv
     [exec]      [exec] Result: 139
     [exec]      [echo] INFO: TEST test_jthread_get_java_thread start
     [exec]      [echo] ## TEST FAILED
     [exec]      [echo] ## Executing C unit test: test_java_suspend
     [exec]      [exec] Result: 139
     [exec]      [echo] INFO: TEST test_jthread_suspend_resume start
     [exec]      [echo] ## TEST FAILED
     [exec]      [echo] ## Executing C unit test: test_native_basic
     [exec]      [exec] Result: 139
     [exec]      [echo] INFO: TEST test_hythread_self_base start
     [exec]      [echo] ## TEST FAILED
     [exec]      [echo] ## Executing C unit test: test_native_fat_monitor
     [exec]      [exec] Result: 139
     [exec]      [echo] INFO: TEST test_wait_signal start
     [exec]      [echo] ## TEST FAILED
     [exec]      [echo] ## Executing C unit test: test_native_suspend
     [exec]      [exec] Result: 139
     [exec]      [echo] INFO: TEST test_hythread_thread_suspend start
     [exec]      [echo] ## TEST FAILED
     [exec]      [echo] ## Executing C unit test: test_native_thin_monitor
     [exec]      [exec] Result: 139
     [exec]      [echo] INFO: TEST test_hythread_thin_monitor_enter start
     [exec]      [echo] ## TEST FAILED
     [exec]      [echo] ## Executing C unit test: test_ti_instrum
     [exec]      [exec] Result: 139
     [exec]      [echo] INFO: TEST test_jthread_get_all_threads start
     [exec]      [echo] ## TEST FAILED
     [exec]      [echo] ## Executing C unit test: test_ti_local_storage

     [exec]      [echo] ## TEST PASSED
     [exec]      [echo] ## Executing C unit test: test_ti_monitor_info
     [exec]      [exec] Result: 139
     [exec]      [echo] INFO: TEST test_jthread_get_contended_monitor start
     [exec]      [echo] ## TEST FAILED
     [exec]      [echo] ## Executing C unit test: test_ti_peak_count

     [exec]      [echo] ## TEST PASSED
     [exec]      [echo] ## Executing C unit test: test_ti_raw_monitors
     [exec]      [exec] Result: 139
     [exec]      [echo] INFO: TEST test_jthread_raw_monitor_create start
     [exec]      [echo] ## TEST FAILED
     [exec]      [echo] ## Executing C unit test: test_ti_state
     [exec]      [exec] Result: 139
     [exec]      [echo] INFO: TEST test_jthread_get_state_6 start
     [exec]      [echo] ## TEST FAILED
     [exec]      [echo] ## Executing C unit test: test_ti_timing

     [exec]      [echo] ## TEST PASSED
     [exec]      [echo] ## Please find tests and results at
/export/users/viv/trunk/cc/projects/drlvm/trunk/build/lnx_em64t_gcc_debug/semis/vm/_cunit.tests/

     [exec] BUILD FAILED
     [exec]
/export/users/viv/trunk/cc/projects/drlvm/trunk/build/make/build.xml:379:
The following error occurred while executing this line:
     [exec]
/export/users/viv/trunk/cc/projects/drlvm/trunk/build/make/build_component.xml:72:
The following error occurred while executing this line:
     [exec]
/export/users/viv/trunk/cc/projects/drlvm/trunk/build/lnx_em64t_gcc_debug/semis/build/targets/cunit.test.xml:136:
## SOME TESTS FAILED

Mime
  • Unnamed multipart/alternative (inline, None, 0 bytes)
View raw message