harmony-dev mailing list archives

Site index · List index
Message view « Date » · « Thread »
Top « Date » · « Thread »
From "Stepan Mishura" <stepan.mish...@gmail.com>
Subject Re: [build-test alert] BUILD FAILED Windows XP SP2 msvc debug: classlib over drlvm
Date Mon, 11 Dec 2006 16:32:24 GMT
On 12/11/06, Gregory Shimansky wrote:

> Stepan Mishura wrote:
> > It looks like commit r485644 (Applied HARMONY-2505 [drlvm] Class file
> > parser
> > improvements) is a cause of classlib test failures. I'm testing it now.
>
> If you see ClassFormatError like in HARMONY-2611, then the fix is ready.
> I hope to commit it soon.


Yes, I see:

    [junit] java.lang.ClassFormatError: junit/framework/TestListener : if
class is interface, no flags except ACC_ABSTRACT or ACC_PUBLIC can be set
    [junit]     at java.lang.VMClassRegistry.defineClass(Native Method)
    [junit]     at java.lang.ClassLoader.defineClass(Unknown Source)
    [junit]     at java.security.SecureClassLoader.defineClass(
SecureClassLoader.java:70)
    [junit]     at java.net.URLClassLoader.findClassImpl(URLClassLoader.java
:1137)
    [junit]     at java.net.URLClassLoader$4.run(URLClassLoader.java:619)
    [junit]     at java.net.URLClassLoader$4.run(URLClassLoader.java)
    [junit]     at java.security.AccessController.doPrivilegedImpl(Unknown
Source)
    [junit]     at java.security.AccessController.doPrivileged(Unknown
Source)
    [junit]     at java.net.URLClassLoader.findClass(URLClassLoader.java
:617)
    [junit]     at java.lang.ClassLoader.loadClass(Unknown Source)
    [junit]     at java.lang.ClassLoader$SystemClassLoader.loadClass(Unknown
Source)
    [junit]     at java.lang.ClassLoader.loadClass(Unknown Source)
    [junit]     at java.lang.VMClassRegistry.defineClass(Native Method)
    [junit]     at java.lang.ClassLoader.defineClass(Unknown Source)
    [junit]     at java.security.SecureClassLoader.defineClass(
SecureClassLoader.java:70)
    [junit]     at java.net.URLClassLoader.findClassImpl(URLClassLoader.java
:1137)
    [junit]     at java.net.URLClassLoader$4.run(URLClassLoader.java:619)
    [junit]     at java.net.URLClassLoader$4.run(URLClassLoader.java)
    [junit]     at java.security.AccessController.doPrivilegedImpl(Unknown
Source)
    [junit]     at java.security.AccessController.doPrivileged(Unknown
Source)
    [junit]     at java.net.URLClassLoader.findClass(URLClassLoader.java
:617)
    [junit]     at java.lang.ClassLoader.loadClass(Unknown Source)
    [junit]     at java.lang.ClassLoader$SystemClassLoader.loadClass(Unknown
Source)
    [junit]     at java.lang.ClassLoader.loadClass(Unknown Source)
    [junit] FAILED to invoke JVM.

Thanks,
Stepan.


> >
> > On 12/11/06, Alexey Petrenko  wrote:
> >
> >> Not reproducible on my Win2003Server...
> >>
> >> 2006/12/11, nomail@intel.com <nomail@intel.com>:
> >> > BUILD FAILED:
> >> >        Ant Error Message:
> >> > C:\cc.harmony\trunk\cc\projects\classlib\trunk\build.xml:167: The
> >> following error occurred while executing this line:
> >> C:\cc.harmony\trunk\cc\projects\classlib\trunk\make\build-test.xml:133:
> >> There were test failures.
> >> >
> >> > Date of build:  12/11/2006 19:35:34
> >> > Time to build:  16 minutes 11 seconds
> >> > Last changed:   12/11/2006 19:27:10
> >> > Last log entry: Makefiles are changed to use compiler options from
> the
> >> common place
> >>
> >
> >
> >
>
>
> --
> Gregory
>
>


-- 
Stepan Mishura
Intel Enterprise Solutions Software Division

Mime
  • Unnamed multipart/alternative (inline, None, 0 bytes)
View raw message