harmony-dev mailing list archives

Site index · List index
Message view « Date » · « Thread »
Top « Date » · « Thread »
From Naveen Neelakantam <neela...@uiuc.edu>
Subject [testing] Fwd: [build-test alert] BUILD FAILED lnx gcc debug: classlib over drlvm
Date Sat, 30 Dec 2006 18:36:37 GMT
I finally got CC running again on our RHEL4 box last night, and it  
completed but with a large number of errors.

I have a feeling some configuration has changed since the last time I  
ran CC.  Can anyone tell what is wrong from looking at the failure  
email?

You can also access our CC at http://frigga.cs.uiuc.edu:8080.

Thanks,
Naveen

Begin forwarded message:

> From: nomail@frigga.cs.uiuc.edu
> Date: December 29, 2006 3:18:28 PM CST
> To: neelakan@uiuc.edu
> Subject: [build-test alert] BUILD FAILED lnx gcc debug: classlib   
> over drlvm
>
> BUILD FAILED:
> 	Ant Error Message:
> /mounts/frigga/disks/0/shared-data/Harmony/nightlytest/trunk/cc/ 
> projects/classlib/trunk/build.xml:167: The following error occurred  
> while executing this line: /mounts/frigga/disks/0/shared-data/ 
> Harmony/nightlytest/trunk/cc/projects/classlib/trunk/make/build- 
> test.xml:289: Could not create task or type of type:  
> replaceregexp.  Ant could not find the task or a class this task  
> relies upon.  This is common and has a number of causes; the usual   
> solutions are to read the manual pages then download and install  
> needed JAR files, or fix the build file:   - You have misspelt  
> 'replaceregexp'.    Fix: check your spelling.  - The task needs an  
> external JAR file to execute      and this is not found at the  
> right place in the classpath.    Fix: check the documentation for  
> dependencies.    Fix: declare the task.  - The task is an Ant  
> optional task and the JAR file and/or libraries      implementing  
> the functionality were not found at the time you      yourself  
> built your installation of Ant!
>   from the Ant sources.    Fix: Look in the ANT_HOME/lib for the  
> 'ant-' JAR corresponding to the      task and make sure it contains  
> more than merely a META-INF/MANIFEST.MF.      If all it contains is  
> the manifest, then rebuild Ant with the needed      libraries  
> present in /mounts/frigga/disks/0/shared-data/Harmony/nightlytest/ 
> trunk/cc/lib/optional/ , or alternatively,      download a pre- 
> built release version from apache.org  - The build file was written  
> for a later version of Ant    Fix: upgrade to at least the latest  
> release version of Ant  - The task is not an Ant core or optional  
> task       and needs to be declared using <taskdef>.  - You are  
> attempting to use a task defined using      <presetdef> or  
> <macrodef> but have spelt wrong or not     defined it at the point  
> of use  Remember that for JAR files to be visible to Ant tasks  
> implemented in ANT_HOME/lib, the files must be in the same  
> directory or on the classpath  Please neither file bug reports on  
> this problem, nor e!
>  mail the Ant mailing lists, until all of these causes have been  
> explor
> ed, as this is not an Ant bug.
>
> Date of build:	12/29/2006 14:37:23
> Time to build:	40 minutes 41 seconds
> Last changed:	12/29/2006 14:35:41
> Last log entry:	Apply patch HARMONY-2413 ([luni]  
> java.net.Authenticator.getRequestorType returns null while RI  
> returns valid result)
>
>
> ***********************************************************
> Errors/Warnings:	(220)
>
> Tests FAILED (timeout)
> Tests FAILED
>
> ***********************************************************
> Unit Tests: (14295)
>
> error: testDefaultEditor_propertyChange javax.swing.JSpinnerTest
> error: testDefaultEditor_stateChange javax.swing.JSpinnerTest
> error: testDefaultEditor_LayoutSizes javax.swing.JSpinnerTest
> error: testNumberEditor_NumberEditor javax.swing.JSpinnerTest
> error: testNumberEditor_formatter javax.swing.JSpinnerTest
> error: testNumberEditor_getModel javax.swing.JSpinnerTest
> error: testDateEditor_DateEditor javax.swing.JSpinnerTest
> error: testDateEditor_formatter javax.swing.JSpinnerTest
> error: testListEditor_ListEditor javax.swing.JSpinnerTest
> error: testListEditor_formatter javax.swing.JSpinnerTest
> error: testAddNull javax.swing.JTabbedPaneRTest
> error: testRemoveAll javax.swing.JTabbedPaneTest
> error: testUpdateUI javax.swing.JTabbedPaneTest
> error: testGetTabCount javax.swing.JTabbedPaneTest
> error: testGetTabRunCount javax.swing.JTabbedPaneTest
> error: testFireStateChanged javax.swing.JTabbedPaneTest
> error: testJTabbedPane javax.swing.JTabbedPaneTest
> error: testJTabbedPaneint javax.swing.JTabbedPaneTest
> error: testJTabbedPaneintint javax.swing.JTabbedPaneTest
> error: testRemoveTabAt javax.swing.JTabbedPaneTest
> error: testRemoveComponent javax.swing.JTabbedPaneTest
> error: testRemoveint javax.swing.JTabbedPaneTest
> error: testSetGetSelectedIndex javax.swing.JTabbedPaneTest
> error: testSetGetTabLayoutPolicy javax.swing.JTabbedPaneTest
> error: testSetGetTabPlacement javax.swing.JTabbedPaneTest
> error: testIndexAtLocation javax.swing.JTabbedPaneTest
> error: testSetGetDisplayedMnemonicIndexAt javax.swing.JTabbedPaneTest
> error: testSetGetMnemonicAt javax.swing.JTabbedPaneTest
> error: testSetIsEnabledAt javax.swing.JTabbedPaneTest
> error: testAddComponent javax.swing.JTabbedPaneTest
> error: testAddComponentint javax.swing.JTabbedPaneTest
> error: testAddComponentObject javax.swing.JTabbedPaneTest
> error: testAddComponentObjectint javax.swing.JTabbedPaneTest
> error: testAddStringComponent javax.swing.JTabbedPaneTest
> error: testAddRemoveChangeListener javax.swing.JTabbedPaneTest
> error: testAddTabStringComponent javax.swing.JTabbedPaneTest
> error: testAddTabStringIconComponent javax.swing.JTabbedPaneTest
> error: testAddTabStringIconComponentString javax.swing.JTabbedPaneTest
> error: testCreateChangeListener javax.swing.JTabbedPaneTest
> error: testGetAccessibleContext javax.swing.JTabbedPaneTest
> error: testGetBoundsAt javax.swing.JTabbedPaneTest
> error: testGetChangeListeners javax.swing.JTabbedPaneTest
> error: testSetTitleAt javax.swing.JTabbedPaneTest
> error: testGetTitleAt javax.swing.JTabbedPaneTest
> error: testGetToolTipTextMouseEvent javax.swing.JTabbedPaneTest
> error: testGetUIClassID javax.swing.JTabbedPaneTest
> error: testIndexOfComponent javax.swing.JTabbedPaneTest
> error: testIndexOfTabIcon javax.swing.JTabbedPaneTest
> error: testIndexOfTabString javax.swing.JTabbedPaneTest
> error: testInsertTab javax.swing.JTabbedPaneTest
> error: testParamString javax.swing.JTabbedPaneTest
> error: testSetBackgroundAt javax.swing.JTabbedPaneTest
> error: testGetBackgroundAt javax.swing.JTabbedPaneTest
> error: testSetForegroundAt javax.swing.JTabbedPaneTest
> error: testGetForegroundAt javax.swing.JTabbedPaneTest
> error: testSetGetComponentAt javax.swing.JTabbedPaneTest
> error: testSetGetDisabledIconAt javax.swing.JTabbedPaneTest
> error: testSetGetIconAt javax.swing.JTabbedPaneTest
> error: testSetGetModel javax.swing.JTabbedPaneTest
> error: testSetGetSelectedComponentComponent  
> javax.swing.JTabbedPaneTest
> error: testSetGetToolTipTextAt javax.swing.JTabbedPaneTest
> error: testSetGetUI javax.swing.JTabbedPaneTest
> error: testSelectAllClearSelection javax.swing.JTableRTest
> error: testReplaceSelection_AtTheBeginningOfParagraph  
> javax.swing.JTextPaneRTest
> error: testReplaceSelection_WithSelection javax.swing.JTextPaneRTest
> error: testReplaceSelection_WithNoSelection javax.swing.JTextPaneRTest
> error: testJTextPane javax.swing.JTextPaneTest
> error: testGetUIClassID javax.swing.JTextPaneTest
> error: testSetDocument javax.swing.JTextPaneTest
> error: testSetStyledDocument javax.swing.JTextPaneTest
> error: testGetStyledEditorKit javax.swing.JTextPaneTest
> error: testCreateDefaultEditorKit javax.swing.JTextPaneTest
> error: testSetEditorKit javax.swing.JTextPaneTest
> error: testGetStyle javax.swing.JTextPaneTest
> error: testAddStyle javax.swing.JTextPaneTest
> error: testRemoveStyle javax.swing.JTextPaneTest
> error: testGetLogicalStyle javax.swing.JTextPaneTest
> error: testSetLogicalStyle javax.swing.JTextPaneTest
> error: testGetParagraphAttributes javax.swing.JTextPaneTest
> error: testSetParagraphAttributes javax.swing.JTextPaneTest
> error: testGetCharacterAttributes javax.swing.JTextPaneTest
> error: testSetCharacterAttributes javax.swing.JTextPaneTest
> error: testGetInputAttributes javax.swing.JTextPaneTest
> error: testInsertComponent javax.swing.JTextPaneTest
> error: testInsertIcon javax.swing.JTextPaneTest
> error: testReplaceSelection javax.swing.JTextPaneTest
> error: testParamString javax.swing.JTextPaneTest
> error: testSetPressed javax.swing.JToggleButtonModelTest
> error: testToggleButtonModel javax.swing.JToggleButtonModelTest
> error: testDefaultButtonModel javax.swing.JToggleButtonModelTest
> error: testGetListeners javax.swing.JToggleButtonModelTest
> error: testRemoveChangeListener javax.swing.JToggleButtonModelTest
> error: testAddChangeListener javax.swing.JToggleButtonModelTest
> error: testGetChangeListeners javax.swing.JToggleButtonModelTest
> error: testSetGroup javax.swing.JToggleButtonModelTest
> error: testGetGroup javax.swing.JToggleButtonModelTest
> error: testSetActionCommand javax.swing.JToggleButtonModelTest
> error: testGetActionCommand javax.swing.JToggleButtonModelTest
> error: testGetSelectedObjects javax.swing.JToggleButtonModelTest
> error: testRemoveItemListener javax.swing.JToggleButtonModelTest
> error: testAddItemListener javax.swing.JToggleButtonModelTest
> error: testGetItemListeners javax.swing.JToggleButtonModelTest
> error: testFireItemStateChanged javax.swing.JToggleButtonModelTest
> error: testFireActionPerformed1 javax.swing.JToggleButtonModelTest
> error: testFireActionPerformed2 javax.swing.JToggleButtonModelTest
> error: testFireStateChanged javax.swing.JToggleButtonModelTest
> error: testRemoveActionListener javax.swing.JToggleButtonModelTest
> error: testAddActionListener javax.swing.JToggleButtonModelTest
> error: testGetActionListeners javax.swing.JToggleButtonModelTest
> error: testSetSelected javax.swing.JToggleButtonModelTest
> error: testSetRollover javax.swing.JToggleButtonModelTest
> error: testSetEnabled1 javax.swing.JToggleButtonModelTest
> error: testSetEnabled2 javax.swing.JToggleButtonModelTest
> error: testSetArmed javax.swing.JToggleButtonModelTest
> error: testSetMnemonic javax.swing.JToggleButtonModelTest
> error: testIsSelected javax.swing.JToggleButtonModelTest
> error: testIsRollover javax.swing.JToggleButtonModelTest
> error: testIsPressed javax.swing.JToggleButtonModelTest
> error: testIsEnabled javax.swing.JToggleButtonModelTest
> error: testIsArmed javax.swing.JToggleButtonModelTest
> error: testGetMnemonic javax.swing.JToggleButtonModelTest
> error: testWriteObject javax.swing.JToggleButtonModelTest
> error: testReadObject javax.swing.JToggleButtonModelTest
> error: testGetAccessibleContext javax.swing.JToggleButtonTest
> error: testParamString javax.swing.JToggleButtonTest
> error: testGetUIClassID javax.swing.JToggleButtonTest
> error: testUpdateUI javax.swing.JToggleButtonTest
> error: testJToggleButtonStringIconboolean  
> javax.swing.JToggleButtonTest
> error: testJToggleButtonStringIcon javax.swing.JToggleButtonTest
> error: testJToggleButtonIconboolean javax.swing.JToggleButtonTest
> error: testJToggleButtonIcon javax.swing.JToggleButtonTest
> error: testJToggleButtonAction javax.swing.JToggleButtonTest
> error: testJToggleButtonStringboolean javax.swing.JToggleButtonTest
> error: testJToggleButtonString javax.swing.JToggleButtonTest
> error: testJToggleButton javax.swing.JToggleButtonTest
> error: testSetAction1 javax.swing.JToggleButtonTest
> error: testGetAccessibleContext javax.swing.JToolBarTest
> error: testAddImpl javax.swing.JToolBarTest
> error: testSetLayout javax.swing.JToolBarTest
> error: testGetUIClassID javax.swing.JToolBarTest
> error: testPaintBorder javax.swing.JToolBarTest
> error: testUpdateUI javax.swing.JToolBarTest
> error: testJToolBar javax.swing.JToolBarTest
> error: testJToolBarint javax.swing.JToolBarTest
> error: testJToolBarString javax.swing.JToolBarTest
> error: testJToolBarStringint javax.swing.JToolBarTest
> error: testSetGetUI javax.swing.JToolBarTest
> error: testGetComponentIndex javax.swing.JToolBarTest
> error: testGetComponentAtIndex javax.swing.JToolBarTest
> error: testSetGetMargin javax.swing.JToolBarTest
> error: testSetIsBorderPainted javax.swing.JToolBarTest
> error: testSetIsFloatable javax.swing.JToolBarTest
> error: testSetGetOrientation javax.swing.JToolBarTest
> error: testSetIsRollover javax.swing.JToolBarTest
> error: testAddSeparator javax.swing.JToolBarTest
> error: testAddSeparatorDimension javax.swing.JToolBarTest
> error: testAddAction javax.swing.JToolBarTest
> error: testCreateActionComponent javax.swing.JToolBarTest
> error: testCreateActionChangeListener javax.swing.JToolBarTest
> error: testFocusable javax.swing.JToolBar_SeparatorRTest
> error: testGetMaximumSize javax.swing.JToolBar_SeparatorTest
> error: testGetMinimumSize javax.swing.JToolBar_SeparatorTest
> error: testGetPreferredSize javax.swing.JToolBar_SeparatorTest
> error: testGetUIClassID javax.swing.JToolBar_SeparatorTest
> error: testSeparator javax.swing.JToolBar_SeparatorTest
> error: testSeparatorDimension javax.swing.JToolBar_SeparatorTest
> error: testSetGetSeparatorSize javax.swing.JToolBar_SeparatorTest
> error: testGetUIClassID javax.swing.JToolTipTest
> error: testGetUI javax.swing.JToolTipTest
> error: testSetGetTipText javax.swing.JToolTipTest
> error: testSetGetComponent javax.swing.JToolTipTest
> error: testTreeSelectionRedirector javax.swing.JTreeTest
> error: testJTree javax.swing.JTreeTest
> error: testJTreeTreeModel javax.swing.JTreeTest
> error: testJTreeTreeNodeBoolean javax.swing.JTreeTest
> error: testJTreeTreeNode javax.swing.JTreeTest
> error: testJTreeObjectArray javax.swing.JTreeTest
> error: testJTreeVector javax.swing.JTreeTest
> error: testJTreeHashtable javax.swing.JTreeTest
> error: testGetAccessibleContext javax.swing.JTreeTest
> error: testGetToolTipTextMouseEvent javax.swing.JTreeTest
> error: testGetUIClassID javax.swing.JTreeTest
> error: testSetAddRemoveSelectionInterval javax.swing.JTreeTest
> error: testAddRemoveSelectionPathPathsRowRows javax.swing.JTreeTest
> error: testAddGetRemoveTreeExpansionListener javax.swing.JTreeTest
> error: testAddGetRemoveTreeSelectionListener javax.swing.JTreeTest
> error: testAddGetRemoveTreeWillExpandListener javax.swing.JTreeTest
> error: testClearSelection javax.swing.JTreeTest
> error: testClearToggledPaths javax.swing.JTreeTest
> error: testConvertValueToText javax.swing.JTreeTest
> error: testCreateTreeModel javax.swing.JTreeTest
> error: testCreateTreeModelListener javax.swing.JTreeTest
> error: testTreeModelHandler javax.swing.JTreeTest
> error: testExpandCollapsePathRow javax.swing.JTreeTest
> error: testHasBeenExpanded javax.swing.JTreeTest
> error: testFireTreeExpandedCollapsedWillExpandCollapse  
> javax.swing.JTreeTest
> error: testFireValueChanged javax.swing.JTreeTest
> error: testGetSetAnchorSelectionPath javax.swing.JTreeTest
> error: testGetClosestPathForLocation javax.swing.JTreeTest
> error: testGetClosestRowForLocation javax.swing.JTreeTest
> error: testGetDefaultTreeModel javax.swing.JTreeTest
> error: testGetDescendantToggledPaths javax.swing.JTreeTest
> error: testGetDragEnabled javax.swing.JTreeTest
> error: testGetExpandedDescendants javax.swing.JTreeTest
> error: testGetSetExpandsSelectedPaths javax.swing.JTreeTest
> error: testGetSetInvokesStopCellEditing javax.swing.JTreeTest
> error: testGetLastSelectedPathComponent javax.swing.JTreeTest
> error: testGetLeadSelectionRow javax.swing.JTreeTest
> error: testGetMinMaxSelectionRow javax.swing.JTreeTest
> error: testGetNextMatch javax.swing.JTreeTest
> error: testGetPathBetweenRows javax.swing.JTreeTest
> error: testGetPathBounds javax.swing.JTreeTest
> error: testGetRowBounds javax.swing.JTreeTest
> error: testGetPathForLocation javax.swing.JTreeTest
> error: testGetRowForLocation javax.swing.JTreeTest
> error: testGetRowForPath javax.swing.JTreeTest
> error: testGetPathForRow javax.swing.JTreeTest
> error: testGetRowCount javax.swing.JTreeTest
> error: testGetSetRowHeight javax.swing.JTreeTest
> error: testGetSetScrollsOnExpand javax.swing.JTreeTest
> error: testGetSelectionCount javax.swing.JTreeTest
> error: testGetSelectionModel javax.swing.JTreeTest
> error: testGetSetSelectionPaths javax.swing.JTreeTest
> error: testGetSetShowsRootHandles javax.swing.JTreeTest
> error: testGetToggleClickCount javax.swing.JTreeTest
> error: testGetUI javax.swing.JTreeTest
> error: testIsSetEditable javax.swing.JTreeTest
> error: testIsExpanded javax.swing.JTreeTest
> error: testIsFixedRowHeight javax.swing.JTreeTest
> error: testIsLargeModel javax.swing.JTreeTest
> error: testIsPathEditable javax.swing.JTreeTest
> error: testSetIsRootVisible javax.swing.JTreeTest
> error: testIsPathSelected javax.swing.JTreeTest
> error: testIsRowSelected javax.swing.JTreeTest
> error: testIsSelectionEmpty javax.swing.JTreeTest
> error: testIsVisible javax.swing.JTreeTest
> error: testMakeVisible javax.swing.JTreeTest
> error: testRemoveDescendantSelectedPaths javax.swing.JTreeTest
> error: testRemoveDescendantToggledPaths javax.swing.JTreeTest
> error: testSetCellEditor javax.swing.JTreeTest
> error: testGetCellEditor javax.swing.JTreeTest
> error: testSetCellRenderer javax.swing.JTreeTest
> error: testGetCellRenderer javax.swing.JTreeTest
> error: testSetExpandedState javax.swing.JTreeTest
> error: testGetSetLeadSelectionPath javax.swing.JTreeTest
> error: testGetSetModel javax.swing.JTreeTest
> error: testSetSelectionModel javax.swing.JTreeTest
> error: testGetSetSelectionPath javax.swing.JTreeTest
> error: testGetSetSelectionRow javax.swing.JTreeTest
> error: testGetSetSelectionRows javax.swing.JTreeTest
> error: testSetUITreeUI javax.swing.JTreeTest
> error: testGetSetVisibleRowCount javax.swing.JTreeTest
> error: testIsEditingStartEditingAtPathGetEditingPath  
> javax.swing.JTreeTest
> error: testGetPreferredScrollableViewportSize javax.swing.JTreeTest
> error: testGetScrollableBlockIncrement javax.swing.JTreeTest
> error: testGetScrollableUnitIncrement javax.swing.JTreeTest
> error: testGetScrollableTracksViewportHeight javax.swing.JTreeTest
> error: testGetScrollableTracksViewportWidth javax.swing.JTreeTest
> error: testScrollRowPathToVisible javax.swing.JTreeTest
> error: testDynamicUtilTreeNode  
> javax.swing.JTree_DynamicUtilTreeNodeTest
> error: testCreateChildren javax.swing.JTree_DynamicUtilTreeNodeTest
> error: testIsLeaf javax.swing.JTree_DynamicUtilTreeNodeTest
> error: testGetChildCount javax.swing.JTree_DynamicUtilTreeNodeTest
> error: testGetChildAt javax.swing.JTree_DynamicUtilTreeNodeTest
> error: testChildren javax.swing.JTree_DynamicUtilTreeNodeTest
> error: testLoadChildren javax.swing.JTree_DynamicUtilTreeNodeTest
> error: testEmptySelectionModel  
> javax.swing.JTree_EmptySelectionModelTest
> error: testSharedInstance javax.swing.JTree_EmptySelectionModelTest
> error: testSetAddRemoveSelectionPaths  
> javax.swing.JTree_EmptySelectionModelTest
> error: testGetKeyStrokeString javax.swing.KeyStrokeTest
> error: testGetKeyStrokeCharacterint javax.swing.KeyStrokeTest
> error: testGetKeyStrokeForEvent javax.swing.KeyStrokeTest
> error: testGetKeyStrokeintintboolean javax.swing.KeyStrokeTest
> error: testGetKeyStrokeintint javax.swing.KeyStrokeTest
> error: testGetKeyStrokecharboolean javax.swing.KeyStrokeTest
> error: testGetKeyStrokechar javax.swing.KeyStrokeTest
> error: testToString javax.swing.LookAndFeelTest
> error: testMakeComponentInputMap javax.swing.LookAndFeelTest
> error: testMakeIcon javax.swing.LookAndFeelTest
> error: testMakeInputMap javax.swing.LookAndFeelTest
> error: testMakeKeyBindings javax.swing.LookAndFeelTest
> error: testMakeKeyBindingsFromErrorArray javax.swing.LookAndFeelTest
> error: testGetDefaults javax.swing.LookAndFeelTest
> error: testInstallColors javax.swing.LookAndFeelTest
> error: testInstallErrorColors javax.swing.LookAndFeelTest
> error: testInstallColorAndFonts javax.swing.LookAndFeelTest
> error: testInstallUninstallBorder javax.swing.LookAndFeelTest
> error: testLoadKeyBindings javax.swing.LookAndFeelTest
> error: testGetDesktopPropertyValue javax.swing.LookAndFeelTest
> error: testGetSupportsWindowsDecorations javax.swing.LookAndFeelTest
> error: testInstallProperty javax.swing.LookAndFeelTest
> error: testIsComponentPartOfCurrentMenu  
> javax.swing.MenuSelectionManagerRTest
> error: testMenuSelectionManager javax.swing.MenuSelectionManagerTest
> error: testAddGetRemoveChangeListener  
> javax.swing.MenuSelectionManagerTest
> error: testComponentForPoint javax.swing.MenuSelectionManagerTest
> error: testDefaultManager javax.swing.MenuSelectionManagerTest
> error: testFireStateChanged javax.swing.MenuSelectionManagerTest
> error: testIsComponentPartOfCurrentMenu  
> javax.swing.MenuSelectionManagerTest
> error: testProcessKeyEvent javax.swing.MenuSelectionManagerTest
> error: testProcessMouseEvent javax.swing.MenuSelectionManagerTest
> error: testSetGetClearSelectedPath  
> javax.swing.MenuSelectionManagerTest
> error: testSetSelectedPath javax.swing.MenuSelectionManagerTest
> error: testGetPreferredLayoutSize javax.swing.ScrollPaneLayoutTest
> error: testDefaultLayout javax.swing.ScrollPaneLayoutTest
> error: testSetHorizontalPolicy javax.swing.ScrollPaneLayoutTest
> error: testSetVerticalPolicy javax.swing.ScrollPaneLayoutTest
> error: testGetViewport javax.swing.ScrollPaneLayoutTest
> error: testGetHorizontalScrollbar javax.swing.ScrollPaneLayoutTest
> error: testGetVerticalScrollbar javax.swing.ScrollPaneLayoutTest
> error: testGetCorner javax.swing.ScrollPaneLayoutTest
> error: testGetRowHeader javax.swing.ScrollPaneLayoutTest
> error: testGetColumnHeader javax.swing.ScrollPaneLayoutTest
> error: testSyncWithScrollPane javax.swing.ScrollPaneLayoutTest
> error: testGetViewportBorderBounds javax.swing.ScrollPaneLayoutTest
> error: testRemoveLayoutComponent javax.swing.ScrollPaneLayoutTest
> error: testAddSingletonLayoutComponent  
> javax.swing.ScrollPaneLayoutTest
> error: testMinimumLayoutSize javax.swing.ScrollPaneLayoutTest
> error: testSizeRequirementsintintintfloat  
> javax.swing.SizeRequirementsTest
> error: testSizeRequirementsfloat javax.swing.SizeRequirementsTest
> error: testSizeRequirements javax.swing.SizeRequirementsTest
> error: testToString javax.swing.SizeRequirementsTest
> failure: testGetTiledSizeRequirements javax.swing.SizeRequirementsTest
> failure: testGetAlignedSizeRequirements  
> javax.swing.SizeRequirementsTest
> failure:  
> testCalculateTiledPositionsintSizeRequirementsSizeRequirementsArrayint 
> ArrayintArrayboolean javax.swing.SizeRequirementsTest
> failure:  
> testCalculateTiledPositionsintSizeRequirementsSizeRequirementsArrayint 
> ArrayintArray javax.swing.SizeRequirementsTest
> failure:  
> testCalculateAlignedPositionsintSizeRequirementsSizeRequirementsArrayi 
> ntArrayintArrayboolean javax.swing.SizeRequirementsTest
> failure:  
> testCalculateAlignedPositionsintSizeRequirementsSizeRequirementsArrayi 
> ntArrayintArray javax.swing.SizeRequirementsTest
> failure: testAdjustSizes javax.swing.SizeRequirementsTest
> failure: testWriteObject javax.swing.SizeRequirementsTest
> failure: testReadObject javax.swing.SizeRequirementsTest
> failure: testSpringLayout javax.swing.SpringLayoutTest
> failure: testRemoveLayoutComponent javax.swing.SpringLayoutTest
> failure: testGetLayoutAlignmentX javax.swing.SpringLayoutTest
> failure: testGetLayoutAlignmentY javax.swing.SpringLayoutTest
> failure: testGetConstraints_ForComponent javax.swing.SpringLayoutTest
> failure: testTimer javax.swing.TimerTest
> failure: testGetListeners javax.swing.TimerTest
> failure: testRemoveActionListener javax.swing.TimerTest
> failure: testAddActionListener javax.swing.TimerTest
> failure: testGetActionListeners javax.swing.TimerTest
> failure: testIsRepeats javax.swing.TimerTest
> failure: testSetCoalesce javax.swing.TimerTest
> failure: testIsCoalesce javax.swing.TimerTest
> failure: testGetInitialDelay javax.swing.TimerTest
> failure: testGetDelay javax.swing.TimerTest
> failure: testGetLogTimers javax.swing.TimerTest
> failure: test_hashCode  
> org.apache.harmony.text.tests.java.text.DateFormatSymbolsTest
> Unit Test Error Details:	(347)
>
> Test: testDefaultEditor_propertyChangeClass:  
> javax.swing.JSpinnerTestjava.lang.OutOfMemoryError: Failed to  
> create new thread
> 	at java.lang.Thread.start(Unknown Source)
> 	at org.apache.harmony.awt.wtk.ShutdownThread.start 
> (ShutdownThread.java:58)
> 	at org.apache.harmony.awt.wtk.ShutdownWatchdog.keepAlive 
> (ShutdownWatchdog.java:76)
> 	at org.apache.harmony.awt.wtk.ShutdownWatchdog.checkShutdown 
> (ShutdownWatchdog.java:64)
> 	at org.apache.harmony.awt.wtk.ShutdownWatchdog.setAwtQueueEmpty 
> (ShutdownWatchdog.java)
> 	at java.awt.EventQueueCore.postEvent(EventQueueCore.java:90)
> 	at java.awt.EventQueue.postEvent(EventQueue.java:116)
> 	at java.awt.EventQueue.invokeLater(EventQueue.java:51)
> 	at javax.swing.SwingUtilities.invokeLater(SwingUtilities.java)
> 	at javax.swing.JFormattedTextField 
> $DocumentListenerImpl.insertUpdate(JFormattedTextField.java:299)
> 	at javax.swing.text.AbstractDocument.fireInsertUpdate 
> (AbstractDocument.java:1245)
> 	at javax.swing.text.AbstractDocument.doInsert 
> (AbstractDocument.java:1358)
> 	at javax.swing.text.PlainDocument.doInsert(PlainDocument.java:185)
> 	at javax.swing.text.AbstractDocument.doReplace 
> (AbstractDocument.java:1410)
> 	at javax.swing.text.AbstractDocument$1.replace(AbstractDocument.java)
> 	at javax.swing.text.DefaultFormatter.replaceImpl 
> (DefaultFormatter.java:102)
> 	at javax.swing.text.DefaultFormatter$DocumentFilterImpl.replace 
> (DefaultFormatter.java:72)
> 	at javax.swing.text.AbstractDocument.replace(AbstractDocument.java: 
> 1192)
> 	at javax.swing.text.JTextComponent.setText(JTextComponent.java:1558)
> 	at javax.swing.JFormattedTextField$AbstractFormatter.updateText 
> (JFormattedTextField.java:109)
> 	at javax.swing.JFormattedTextField$AbstractFormatter.install 
> (JFormattedTextField.java:100)
> 	at javax.swing.text.InternationalFormatter.install 
> (InternationalFormatter.java)
> 	at javax.swing.JFormattedTextField.setFormatter 
> (JFormattedTextField.java:474)
> 	at javax.swing.JFormattedTextField.updateFormatter 
> (JFormattedTextField.java:578)
> 	at javax.swing.JFormattedTextField.setFormatterFactory 
> (JFormattedTextField.java:487)
> 	at javax.swing.JSpinner$NumberEditor.initTextField(JSpinner.java:544)
> 	at javax.swing.JSpinner$NumberEditor.<init>(JSpinner.java:519)
> 	at javax.swing.JSpinner.createEditor(JSpinner.java:613)
> 	at javax.swing.JSpinner.<init>(JSpinner.java:584)
> 	at javax.swing.JSpinner.<init>(JSpinner.java:590)
> 	at javax.swing.JSpinnerTest.setUp(JSpinnerTest.java:51)
> 	at javax.swing.BasicSwingTestCase.runBareSuper 
> (BasicSwingTestCase.java)
> 	at javax.swing.BasicSwingTestCase.runBareImpl 
> (BasicSwingTestCase.java)
> 	at javax.swing.BasicSwingTestCase$1.run(BasicSwingTestCase.java)
> 	at java.lang.Thread.run(Unknown Source)
>
> Test: testDefaultEditor_stateChangeClass:  
> javax.swing.JSpinnerTestjava.lang.OutOfMemoryError: Failed to  
> create new thread
> 	at java.lang.Thread.start(Unknown Source)
> 	at javax.swing.BasicSwingTestCase.runBare(BasicSwingTestCase.java: 
> 133)
>
> Test: testDefaultEditor_LayoutSizesClass:  
> javax.swing.JSpinnerTestjava.lang.OutOfMemoryError: Failed to  
> create new thread
> 	at java.lang.Thread.start(Unknown Source)
> 	at javax.swing.BasicSwingTestCase.runBare(BasicSwingTestCase.java: 
> 133)
>
> Test: testNumberEditor_NumberEditorClass:  
> javax.swing.JSpinnerTestjava.lang.OutOfMemoryError: Failed to  
> create new thread
> 	at java.lang.Thread.start(Unknown Source)
> 	at javax.swing.BasicSwingTestCase.runBare(BasicSwingTestCase.java: 
> 133)
>
> Test: testNumberEditor_formatterClass:  
> javax.swing.JSpinnerTestjava.lang.OutOfMemoryError: Failed to  
> create new thread
> 	at java.lang.Thread.start(Unknown Source)
> 	at javax.swing.BasicSwingTestCase.runBare(BasicSwingTestCase.java: 
> 133)
>
> Test: testNumberEditor_getModelClass:  
> javax.swing.JSpinnerTestjava.lang.OutOfMemoryError: Failed to  
> create new thread
> 	at java.lang.Thread.start(Unknown Source)
> 	at javax.swing.BasicSwingTestCase.runBare(BasicSwingTestCase.java: 
> 133)
>
> Test: testDateEditor_DateEditorClass:  
> javax.swing.JSpinnerTestjava.lang.OutOfMemoryError: Failed to  
> create new thread
> 	at java.lang.Thread.start(Unknown Source)
> 	at javax.swing.BasicSwingTestCase.runBare(BasicSwingTestCase.java: 
> 133)
>
> Test: testDateEditor_formatterClass:  
> javax.swing.JSpinnerTestjava.lang.OutOfMemoryError: Failed to  
> create new thread
> 	at java.lang.Thread.start(Unknown Source)
> 	at javax.swing.BasicSwingTestCase.runBare(BasicSwingTestCase.java: 
> 133)
>
> Test: testListEditor_ListEditorClass:  
> javax.swing.JSpinnerTestjava.lang.OutOfMemoryError: Failed to  
> create new thread
> 	at java.lang.Thread.start(Unknown Source)
> 	at javax.swing.BasicSwingTestCase.runBare(BasicSwingTestCase.java: 
> 133)
>
> Test: testListEditor_formatterClass:  
> javax.swing.JSpinnerTestjava.lang.OutOfMemoryError: Failed to  
> create new thread
> 	at java.lang.Thread.start(Unknown Source)
> 	at javax.swing.BasicSwingTestCase.runBare(BasicSwingTestCase.java: 
> 133)
>
> Test: testAddNullClass:  
> javax.swing.JTabbedPaneRTestjava.lang.OutOfMemoryError: Failed to  
> create new thread
> 	at java.lang.Thread.start(Unknown Source)
> 	at javax.swing.BasicSwingTestCase.runBare(BasicSwingTestCase.java: 
> 133)
>
> Test: testRemoveAllClass:  
> javax.swing.JTabbedPaneTestjava.lang.OutOfMemoryError: Failed to  
> create new thread
> 	at java.lang.Thread.start(Unknown Source)
> 	at javax.swing.BasicSwingTestCase.runBare(BasicSwingTestCase.java: 
> 133)
>
> Test: testUpdateUIClass:  
> javax.swing.JTabbedPaneTestjava.lang.OutOfMemoryError: Failed to  
> create new thread
> 	at java.lang.Thread.start(Unknown Source)
> 	at javax.swing.BasicSwingTestCase.runBare(BasicSwingTestCase.java: 
> 133)
>
> Test: testGetTabCountClass:  
> javax.swing.JTabbedPaneTestjava.lang.OutOfMemoryError: Failed to  
> create new thread
> 	at java.lang.Thread.start(Unknown Source)
> 	at javax.swing.BasicSwingTestCase.runBare(BasicSwingTestCase.java: 
> 133)
>
> Test: testGetTabRunCountClass:  
> javax.swing.JTabbedPaneTestjava.lang.OutOfMemoryError: Failed to  
> create new thread
> 	at java.lang.Thread.start(Unknown Source)
> 	at javax.swing.BasicSwingTestCase.runBare(BasicSwingTestCase.java: 
> 133)
>
> Test: testFireStateChangedClass:  
> javax.swing.JTabbedPaneTestjava.lang.OutOfMemoryError: Failed to  
> create new thread
> 	at java.lang.Thread.start(Unknown Source)
> 	at javax.swing.BasicSwingTestCase.runBare(BasicSwingTestCase.java: 
> 133)
>
> Test: testJTabbedPaneClass:  
> javax.swing.JTabbedPaneTestjava.lang.OutOfMemoryError: Failed to  
> create new thread
> 	at java.lang.Thread.start(Unknown Source)
> 	at javax.swing.BasicSwingTestCase.runBare(BasicSwingTestCase.java: 
> 133)
>
> Test: testJTabbedPaneintClass:  
> javax.swing.JTabbedPaneTestjava.lang.OutOfMemoryError: Failed to  
> create new thread
> 	at java.lang.Thread.start(Unknown Source)
> 	at javax.swing.BasicSwingTestCase.runBare(BasicSwingTestCase.java: 
> 133)
>
> Test: testJTabbedPaneintintClass:  
> javax.swing.JTabbedPaneTestjava.lang.OutOfMemoryError: Failed to  
> create new thread
> 	at java.lang.Thread.start(Unknown Source)
> 	at javax.swing.BasicSwingTestCase.runBare(BasicSwingTestCase.java: 
> 133)
>
> Test: testRemoveTabAtClass:  
> javax.swing.JTabbedPaneTestjava.lang.OutOfMemoryError: Failed to  
> create new thread
> 	at java.lang.Thread.start(Unknown Source)
> 	at javax.swing.BasicSwingTestCase.runBare(BasicSwingTestCase.java: 
> 133)
>
> Test: testRemoveComponentClass:  
> javax.swing.JTabbedPaneTestjava.lang.OutOfMemoryError: Failed to  
> create new thread
> 	at java.lang.Thread.start(Unknown Source)
> 	at javax.swing.BasicSwingTestCase.runBare(BasicSwingTestCase.java: 
> 133)
>
> Test: testRemoveintClass:  
> javax.swing.JTabbedPaneTestjava.lang.OutOfMemoryError: Failed to  
> create new thread
> 	at java.lang.Thread.start(Unknown Source)
> 	at javax.swing.BasicSwingTestCase.runBare(BasicSwingTestCase.java: 
> 133)
>
> Test: testSetGetSelectedIndexClass:  
> javax.swing.JTabbedPaneTestjava.lang.OutOfMemoryError: Failed to  
> create new thread
> 	at java.lang.Thread.start(Unknown Source)
> 	at javax.swing.BasicSwingTestCase.runBare(BasicSwingTestCase.java: 
> 133)
>
> Test: testSetGetTabLayoutPolicyClass:  
> javax.swing.JTabbedPaneTestjava.lang.OutOfMemoryError: Failed to  
> create new thread
> 	at java.lang.Thread.start(Unknown Source)
> 	at javax.swing.BasicSwingTestCase.runBare(BasicSwingTestCase.java: 
> 133)
>
> Test: testSetGetTabPlacementClass:  
> javax.swing.JTabbedPaneTestjava.lang.OutOfMemoryError: Failed to  
> create new thread
> 	at java.lang.Thread.start(Unknown Source)
> 	at javax.swing.BasicSwingTestCase.runBare(BasicSwingTestCase.java: 
> 133)
>
> Test: testIndexAtLocationClass:  
> javax.swing.JTabbedPaneTestjava.lang.OutOfMemoryError: Failed to  
> create new thread
> 	at java.lang.Thread.start(Unknown Source)
> 	at javax.swing.BasicSwingTestCase.runBare(BasicSwingTestCase.java: 
> 133)
>
> Test: testSetGetDisplayedMnemonicIndexAtClass:  
> javax.swing.JTabbedPaneTestjava.lang.OutOfMemoryError: Failed to  
> create new thread
> 	at java.lang.Thread.start(Unknown Source)
> 	at javax.swing.BasicSwingTestCase.runBare(BasicSwingTestCase.java: 
> 133)
>
> Test: testSetGetMnemonicAtClass:  
> javax.swing.JTabbedPaneTestjava.lang.OutOfMemoryError: Failed to  
> create new thread
> 	at java.lang.Thread.start(Unknown Source)
> 	at javax.swing.BasicSwingTestCase.runBare(BasicSwingTestCase.java: 
> 133)
>
> Test: testSetIsEnabledAtClass:  
> javax.swing.JTabbedPaneTestjava.lang.OutOfMemoryError: Failed to  
> create new thread
> 	at java.lang.Thread.start(Unknown Source)
> 	at javax.swing.BasicSwingTestCase.runBare(BasicSwingTestCase.java: 
> 133)
>
> Test: testAddComponentClass:  
> javax.swing.JTabbedPaneTestjava.lang.OutOfMemoryError: Failed to  
> create new thread
> 	at java.lang.Thread.start(Unknown Source)
> 	at javax.swing.BasicSwingTestCase.runBare(BasicSwingTestCase.java: 
> 133)
>
> Test: testAddComponentintClass:  
> javax.swing.JTabbedPaneTestjava.lang.OutOfMemoryError: Failed to  
> create new thread
> 	at java.lang.Thread.start(Unknown Source)
> 	at javax.swing.BasicSwingTestCase.runBare(BasicSwingTestCase.java: 
> 133)
>
> Test: testAddComponentObjectClass:  
> javax.swing.JTabbedPaneTestjava.lang.OutOfMemoryError: Failed to  
> create new thread
> 	at java.lang.Thread.start(Unknown Source)
> 	at javax.swing.BasicSwingTestCase.runBare(BasicSwingTestCase.java: 
> 133)
>
> Test: testAddComponentObjectintClass:  
> javax.swing.JTabbedPaneTestjava.lang.OutOfMemoryError: Failed to  
> create new thread
> 	at java.lang.Thread.start(Unknown Source)
> 	at javax.swing.BasicSwingTestCase.runBare(BasicSwingTestCase.java: 
> 133)
>
> Test: testAddStringComponentClass:  
> javax.swing.JTabbedPaneTestjava.lang.OutOfMemoryError: Failed to  
> create new thread
> 	at java.lang.Thread.start(Unknown Source)
> 	at javax.swing.BasicSwingTestCase.runBare(BasicSwingTestCase.java: 
> 133)
>
> Test: testAddRemoveChangeListenerClass:  
> javax.swing.JTabbedPaneTestjava.lang.OutOfMemoryError: Failed to  
> create new thread
> 	at java.lang.Thread.start(Unknown Source)
> 	at javax.swing.BasicSwingTestCase.runBare(BasicSwingTestCase.java: 
> 133)
>
> Test: testAddTabStringComponentClass:  
> javax.swing.JTabbedPaneTestjava.lang.OutOfMemoryError: Failed to  
> create new thread
> 	at java.lang.Thread.start(Unknown Source)
> 	at javax.swing.BasicSwingTestCase.runBare(BasicSwingTestCase.java: 
> 133)
>
> Test: testAddTabStringIconComponentClass:  
> javax.swing.JTabbedPaneTestjava.lang.OutOfMemoryError: Failed to  
> create new thread
> 	at java.lang.Thread.start(Unknown Source)
> 	at javax.swing.BasicSwingTestCase.runBare(BasicSwingTestCase.java: 
> 133)
>
> Test: testAddTabStringIconComponentStringClass:  
> javax.swing.JTabbedPaneTestjava.lang.OutOfMemoryError: Failed to  
> create new thread
> 	at java.lang.Thread.start(Unknown Source)
> 	at javax.swing.BasicSwingTestCase.runBare(BasicSwingTestCase.java: 
> 133)
>
> Test: testCreateChangeListenerClass:  
> javax.swing.JTabbedPaneTestjava.lang.OutOfMemoryError: Failed to  
> create new thread
> 	at java.lang.Thread.start(Unknown Source)
> 	at javax.swing.BasicSwingTestCase.runBare(BasicSwingTestCase.java: 
> 133)
>
> Test: testGetAccessibleContextClass:  
> javax.swing.JTabbedPaneTestjava.lang.OutOfMemoryError: Failed to  
> create new thread
> 	at java.lang.Thread.start(Unknown Source)
> 	at javax.swing.BasicSwingTestCase.runBare(BasicSwingTestCase.java: 
> 133)
>
> Test: testGetBoundsAtClass:  
> javax.swing.JTabbedPaneTestjava.lang.OutOfMemoryError: Failed to  
> create new thread
> 	at java.lang.Thread.start(Unknown Source)
> 	at javax.swing.BasicSwingTestCase.runBare(BasicSwingTestCase.java: 
> 133)
>
> Test: testGetChangeListenersClass:  
> javax.swing.JTabbedPaneTestjava.lang.OutOfMemoryError: Failed to  
> create new thread
> 	at java.lang.Thread.start(Unknown Source)
> 	at javax.swing.BasicSwingTestCase.runBare(BasicSwingTestCase.java: 
> 133)
>
> Test: testSetTitleAtClass:  
> javax.swing.JTabbedPaneTestjava.lang.OutOfMemoryError: Failed to  
> create new thread
> 	at java.lang.Thread.start(Unknown Source)
> 	at javax.swing.BasicSwingTestCase.runBare(BasicSwingTestCase.java: 
> 133)
>
> Test: testGetTitleAtClass:  
> javax.swing.JTabbedPaneTestjava.lang.OutOfMemoryError: Failed to  
> create new thread
> 	at java.lang.Thread.start(Unknown Source)
> 	at javax.swing.BasicSwingTestCase.runBare(BasicSwingTestCase.java: 
> 133)
>
> Test: testGetToolTipTextMouseEventClass:  
> javax.swing.JTabbedPaneTestjava.lang.OutOfMemoryError: Failed to  
> create new thread
> 	at java.lang.Thread.start(Unknown Source)
> 	at javax.swing.BasicSwingTestCase.runBare(BasicSwingTestCase.java: 
> 133)
>
> Test: testGetUIClassIDClass:  
> javax.swing.JTabbedPaneTestjava.lang.OutOfMemoryError: Failed to  
> create new thread
> 	at java.lang.Thread.start(Unknown Source)
> 	at javax.swing.BasicSwingTestCase.runBare(BasicSwingTestCase.java: 
> 133)
>
> Test: testIndexOfComponentClass:  
> javax.swing.JTabbedPaneTestjava.lang.OutOfMemoryError: Failed to  
> create new thread
> 	at java.lang.Thread.start(Unknown Source)
> 	at javax.swing.BasicSwingTestCase.runBare(BasicSwingTestCase.java: 
> 133)
>
> Test: testIndexOfTabIconClass:  
> javax.swing.JTabbedPaneTestjava.lang.OutOfMemoryError: Failed to  
> create new thread
> 	at java.lang.Thread.start(Unknown Source)
> 	at javax.swing.BasicSwingTestCase.runBare(BasicSwingTestCase.java: 
> 133)
>
> Test: testIndexOfTabStringClass:  
> javax.swing.JTabbedPaneTestjava.lang.OutOfMemoryError: Failed to  
> create new thread
> 	at java.lang.Thread.start(Unknown Source)
> 	at javax.swing.BasicSwingTestCase.runBare(BasicSwingTestCase.java: 
> 133)
>
> Test: testInsertTabClass:  
> javax.swing.JTabbedPaneTestjava.lang.OutOfMemoryError: Failed to  
> create new thread
> 	at java.lang.Thread.start(Unknown Source)
> 	at javax.swing.BasicSwingTestCase.runBare(BasicSwingTestCase.java: 
> 133)
>
> Test: testParamStringClass:  
> javax.swing.JTabbedPaneTestjava.lang.OutOfMemoryError: Failed to  
> create new thread
> 	at java.lang.Thread.start(Unknown Source)
> 	at javax.swing.BasicSwingTestCase.runBare(BasicSwingTestCase.java: 
> 133)
>
> Test: testSetBackgroundAtClass:  
> javax.swing.JTabbedPaneTestjava.lang.OutOfMemoryError: Failed to  
> create new thread
> 	at java.lang.Thread.start(Unknown Source)
> 	at javax.swing.BasicSwingTestCase.runBare(BasicSwingTestCase.java: 
> 133)
>
> Test: testGetBackgroundAtClass:  
> javax.swing.JTabbedPaneTestjava.lang.OutOfMemoryError: Failed to  
> create new thread
> 	at java.lang.Thread.start(Unknown Source)
> 	at javax.swing.BasicSwingTestCase.runBare(BasicSwingTestCase.java: 
> 133)
>
> Test: testSetForegroundAtClass:  
> javax.swing.JTabbedPaneTestjava.lang.OutOfMemoryError: Failed to  
> create new thread
> 	at java.lang.Thread.start(Unknown Source)
> 	at javax.swing.BasicSwingTestCase.runBare(BasicSwingTestCase.java: 
> 133)
>
> Test: testGetForegroundAtClass:  
> javax.swing.JTabbedPaneTestjava.lang.OutOfMemoryError: Failed to  
> create new thread
> 	at java.lang.Thread.start(Unknown Source)
> 	at javax.swing.BasicSwingTestCase.runBare(BasicSwingTestCase.java: 
> 133)
>
> Test: testSetGetComponentAtClass:  
> javax.swing.JTabbedPaneTestjava.lang.OutOfMemoryError: Failed to  
> create new thread
> 	at java.lang.Thread.start(Unknown Source)
> 	at javax.swing.BasicSwingTestCase.runBare(BasicSwingTestCase.java: 
> 133)
>
> Test: testSetGetDisabledIconAtClass:  
> javax.swing.JTabbedPaneTestjava.lang.OutOfMemoryError: Failed to  
> create new thread
> 	at java.lang.Thread.start(Unknown Source)
> 	at javax.swing.BasicSwingTestCase.runBare(BasicSwingTestCase.java: 
> 133)
>
> Test: testSetGetIconAtClass:  
> javax.swing.JTabbedPaneTestjava.lang.OutOfMemoryError: Failed to  
> create new thread
> 	at java.lang.Thread.start(Unknown Source)
> 	at javax.swing.BasicSwingTestCase.runBare(BasicSwingTestCase.java: 
> 133)
>
> Test: testSetGetModelClass:  
> javax.swing.JTabbedPaneTestjava.lang.OutOfMemoryError: Failed to  
> create new thread
> 	at java.lang.Thread.start(Unknown Source)
> 	at javax.swing.BasicSwingTestCase.runBare(BasicSwingTestCase.java: 
> 133)
>
> Test: testSetGetSelectedComponentComponentClass:  
> javax.swing.JTabbedPaneTestjava.lang.OutOfMemoryError: Failed to  
> create new thread
> 	at java.lang.Thread.start(Unknown Source)
> 	at javax.swing.BasicSwingTestCase.runBare(BasicSwingTestCase.java: 
> 133)
>
> Test: testSetGetToolTipTextAtClass:  
> javax.swing.JTabbedPaneTestjava.lang.OutOfMemoryError: Failed to  
> create new thread
> 	at java.lang.Thread.start(Unknown Source)
> 	at javax.swing.BasicSwingTestCase.runBare(BasicSwingTestCase.java: 
> 133)
>
> Test: testSetGetUIClass:  
> javax.swing.JTabbedPaneTestjava.lang.OutOfMemoryError: Failed to  
> create new thread
> 	at java.lang.Thread.start(Unknown Source)
> 	at javax.swing.BasicSwingTestCase.runBare(BasicSwingTestCase.java: 
> 133)
>
> Test: testSelectAllClearSelectionClass:  
> javax.swing.JTableRTestjava.lang.OutOfMemoryError: Failed to create  
> new thread
> 	at java.lang.Thread.start(Unknown Source)
> 	at javax.swing.BasicSwingTestCase.runBare(BasicSwingTestCase.java: 
> 133)
>
> Test: testReplaceSelection_AtTheBeginningOfParagraphClass:  
> javax.swing.JTextPaneRTestjava.lang.OutOfMemoryError: Failed to  
> create new thread
> 	at java.lang.Thread.start(Unknown Source)
> 	at javax.swing.BasicSwingTestCase.runBare(BasicSwingTestCase.java: 
> 133)
>
> Test: testReplaceSelection_WithSelectionClass:  
> javax.swing.JTextPaneRTestjava.lang.OutOfMemoryError: Failed to  
> create new thread
> 	at java.lang.Thread.start(Unknown Source)
> 	at javax.swing.BasicSwingTestCase.runBare(BasicSwingTestCase.java: 
> 133)
>
> Test: testReplaceSelection_WithNoSelectionClass:  
> javax.swing.JTextPaneRTestjava.lang.OutOfMemoryError: Failed to  
> create new thread
> 	at java.lang.Thread.start(Unknown Source)
> 	at javax.swing.BasicSwingTestCase.runBare(BasicSwingTestCase.java: 
> 133)
>
> Test: testJTextPaneClass:  
> javax.swing.JTextPaneTestjava.lang.OutOfMemoryError: Failed to  
> create new thread
> 	at java.lang.Thread.start(Unknown Source)
> 	at javax.swing.BasicSwingTestCase.runBare(BasicSwingTestCase.java: 
> 133)
>
> Test: testGetUIClassIDClass:  
> javax.swing.JTextPaneTestjava.lang.OutOfMemoryError: Failed to  
> create new thread
> 	at java.lang.Thread.start(Unknown Source)
> 	at javax.swing.BasicSwingTestCase.runBare(BasicSwingTestCase.java: 
> 133)
>
> Test: testSetDocumentClass:  
> javax.swing.JTextPaneTestjava.lang.OutOfMemoryError: Failed to  
> create new thread
> 	at java.lang.Thread.start(Unknown Source)
> 	at javax.swing.BasicSwingTestCase.runBare(BasicSwingTestCase.java: 
> 133)
>
> Test: testSetStyledDocumentClass:  
> javax.swing.JTextPaneTestjava.lang.OutOfMemoryError: Failed to  
> create new thread
> 	at java.lang.Thread.start(Unknown Source)
> 	at javax.swing.BasicSwingTestCase.runBare(BasicSwingTestCase.java: 
> 133)
>
> Test: testGetStyledEditorKitClass:  
> javax.swing.JTextPaneTestjava.lang.OutOfMemoryError: Failed to  
> create new thread
> 	at java.lang.Thread.start(Unknown Source)
> 	at javax.swing.BasicSwingTestCase.runBare(BasicSwingTestCase.java: 
> 133)
>
> Test: testCreateDefaultEditorKitClass:  
> javax.swing.JTextPaneTestjava.lang.OutOfMemoryError: Failed to  
> create new thread
> 	at java.lang.Thread.start(Unknown Source)
> 	at javax.swing.BasicSwingTestCase.runBare(BasicSwingTestCase.java: 
> 133)
>
> Test: testSetEditorKitClass:  
> javax.swing.JTextPaneTestjava.lang.OutOfMemoryError: Failed to  
> create new thread
> 	at java.lang.Thread.start(Unknown Source)
> 	at javax.swing.BasicSwingTestCase.runBare(BasicSwingTestCase.java: 
> 133)
>
> Test: testGetStyleClass:  
> javax.swing.JTextPaneTestjava.lang.OutOfMemoryError: Failed to  
> create new thread
> 	at java.lang.Thread.start(Unknown Source)
> 	at javax.swing.BasicSwingTestCase.runBare(BasicSwingTestCase.java: 
> 133)
>
> Test: testAddStyleClass:  
> javax.swing.JTextPaneTestjava.lang.OutOfMemoryError: Failed to  
> create new thread
> 	at java.lang.Thread.start(Unknown Source)
> 	at javax.swing.BasicSwingTestCase.runBare(BasicSwingTestCase.java: 
> 133)
>
> Test: testRemoveStyleClass:  
> javax.swing.JTextPaneTestjava.lang.OutOfMemoryError: Failed to  
> create new thread
> 	at java.lang.Thread.start(Unknown Source)
> 	at javax.swing.BasicSwingTestCase.runBare(BasicSwingTestCase.java: 
> 133)
>
> Test: testGetLogicalStyleClass:  
> javax.swing.JTextPaneTestjava.lang.OutOfMemoryError: Failed to  
> create new thread
> 	at java.lang.Thread.start(Unknown Source)
> 	at javax.swing.BasicSwingTestCase.runBare(BasicSwingTestCase.java: 
> 133)
>
> Test: testSetLogicalStyleClass:  
> javax.swing.JTextPaneTestjava.lang.OutOfMemoryError: Failed to  
> create new thread
> 	at java.lang.Thread.start(Unknown Source)
> 	at javax.swing.BasicSwingTestCase.runBare(BasicSwingTestCase.java: 
> 133)
>
> Test: testGetParagraphAttributesClass:  
> javax.swing.JTextPaneTestjava.lang.OutOfMemoryError: Failed to  
> create new thread
> 	at java.lang.Thread.start(Unknown Source)
> 	at javax.swing.BasicSwingTestCase.runBare(BasicSwingTestCase.java: 
> 133)
>
> Test: testSetParagraphAttributesClass:  
> javax.swing.JTextPaneTestjava.lang.OutOfMemoryError: Failed to  
> create new thread
> 	at java.lang.Thread.start(Unknown Source)
> 	at javax.swing.BasicSwingTestCase.runBare(BasicSwingTestCase.java: 
> 133)
>
> Test: testGetCharacterAttributesClass:  
> javax.swing.JTextPaneTestjava.lang.OutOfMemoryError: Failed to  
> create new thread
> 	at java.lang.Thread.start(Unknown Source)
> 	at javax.swing.BasicSwingTestCase.runBare(BasicSwingTestCase.java: 
> 133)
>
> Test: testSetCharacterAttributesClass:  
> javax.swing.JTextPaneTestjava.lang.OutOfMemoryError: Failed to  
> create new thread
> 	at java.lang.Thread.start(Unknown Source)
> 	at javax.swing.BasicSwingTestCase.runBare(BasicSwingTestCase.java: 
> 133)
>
> Test: testGetInputAttributesClass:  
> javax.swing.JTextPaneTestjava.lang.OutOfMemoryError: Failed to  
> create new thread
> 	at java.lang.Thread.start(Unknown Source)
> 	at javax.swing.BasicSwingTestCase.runBare(BasicSwingTestCase.java: 
> 133)
>
> Test: testInsertComponentClass:  
> javax.swing.JTextPaneTestjava.lang.OutOfMemoryError: Failed to  
> create new thread
> 	at java.lang.Thread.start(Unknown Source)
> 	at javax.swing.BasicSwingTestCase.runBare(BasicSwingTestCase.java: 
> 133)
>
> Test: testInsertIconClass:  
> javax.swing.JTextPaneTestjava.lang.OutOfMemoryError: Failed to  
> create new thread
> 	at java.lang.Thread.start(Unknown Source)
> 	at javax.swing.BasicSwingTestCase.runBare(BasicSwingTestCase.java: 
> 133)
>
> Test: testReplaceSelectionClass:  
> javax.swing.JTextPaneTestjava.lang.OutOfMemoryError: Failed to  
> create new thread
> 	at java.lang.Thread.start(Unknown Source)
> 	at javax.swing.BasicSwingTestCase.runBare(BasicSwingTestCase.java: 
> 133)
>
> Test: testParamStringClass:  
> javax.swing.JTextPaneTestjava.lang.OutOfMemoryError: Failed to  
> create new thread
> 	at java.lang.Thread.start(Unknown Source)
> 	at javax.swing.BasicSwingTestCase.runBare(BasicSwingTestCase.java: 
> 133)
>
> Test: testSetPressedClass:  
> javax.swing.JToggleButtonModelTestjava.lang.OutOfMemoryError:  
> Failed to create new thread
> 	at java.lang.Thread.start(Unknown Source)
> 	at javax.swing.BasicSwingTestCase.runBare(BasicSwingTestCase.java: 
> 133)
>
> Test: testToggleButtonModelClass:  
> javax.swing.JToggleButtonModelTestjava.lang.OutOfMemoryError:  
> Failed to create new thread
> 	at java.lang.Thread.start(Unknown Source)
> 	at javax.swing.BasicSwingTestCase.runBare(BasicSwingTestCase.java: 
> 133)
>
> Test: testDefaultButtonModelClass:  
> javax.swing.JToggleButtonModelTestjava.lang.OutOfMemoryError:  
> Failed to create new thread
> 	at java.lang.Thread.start(Unknown Source)
> 	at javax.swing.BasicSwingTestCase.runBare(BasicSwingTestCase.java: 
> 133)
>
> Test: testGetListenersClass:  
> javax.swing.JToggleButtonModelTestjava.lang.OutOfMemoryError:  
> Failed to create new thread
> 	at java.lang.Thread.start(Unknown Source)
> 	at javax.swing.BasicSwingTestCase.runBare(BasicSwingTestCase.java: 
> 133)
>
> Test: testRemoveChangeListenerClass:  
> javax.swing.JToggleButtonModelTestjava.lang.OutOfMemoryError:  
> Failed to create new thread
> 	at java.lang.Thread.start(Unknown Source)
> 	at javax.swing.BasicSwingTestCase.runBare(BasicSwingTestCase.java: 
> 133)
>
> Test: testAddChangeListenerClass:  
> javax.swing.JToggleButtonModelTestjava.lang.OutOfMemoryError:  
> Failed to create new thread
> 	at java.lang.Thread.start(Unknown Source)
> 	at javax.swing.BasicSwingTestCase.runBare(BasicSwingTestCase.java: 
> 133)
>
> Test: testGetChangeListenersClass:  
> javax.swing.JToggleButtonModelTestjava.lang.OutOfMemoryError:  
> Failed to create new thread
> 	at java.lang.Thread.start(Unknown Source)
> 	at javax.swing.BasicSwingTestCase.runBare(BasicSwingTestCase.java: 
> 133)
>
> Test: testSetGroupClass:  
> javax.swing.JToggleButtonModelTestjava.lang.OutOfMemoryError:  
> Failed to create new thread
> 	at java.lang.Thread.start(Unknown Source)
> 	at javax.swing.BasicSwingTestCase.runBare(BasicSwingTestCase.java: 
> 133)
>
> Test: testGetGroupClass:  
> javax.swing.JToggleButtonModelTestjava.lang.OutOfMemoryError:  
> Failed to create new thread
> 	at java.lang.Thread.start(Unknown Source)
> 	at javax.swing.BasicSwingTestCase.runBare(BasicSwingTestCase.java: 
> 133)
>
> Test: testSetActionCommandClass:  
> javax.swing.JToggleButtonModelTestjava.lang.OutOfMemoryError:  
> Failed to create new thread
> 	at java.lang.Thread.start(Unknown Source)
> 	at javax.swing.BasicSwingTestCase.runBare(BasicSwingTestCase.java: 
> 133)
>
> Test: testGetActionCommandClass:  
> javax.swing.JToggleButtonModelTestjava.lang.OutOfMemoryError:  
> Failed to create new thread
> 	at java.lang.Thread.start(Unknown Source)
> 	at javax.swing.BasicSwingTestCase.runBare(BasicSwingTestCase.java: 
> 133)
>
> Test: testGetSelectedObjectsClass:  
> javax.swing.JToggleButtonModelTestjava.lang.OutOfMemoryError:  
> Failed to create new thread
> 	at java.lang.Thread.start(Unknown Source)
> 	at javax.swing.BasicSwingTestCase.runBare(BasicSwingTestCase.java: 
> 133)
>
> Test: testRemoveItemListenerClass:  
> javax.swing.JToggleButtonModelTestjava.lang.OutOfMemoryError:  
> Failed to create new thread
> 	at java.lang.Thread.start(Unknown Source)
> 	at javax.swing.BasicSwingTestCase.runBare(BasicSwingTestCase.java: 
> 133)
>
> Test: testAddItemListenerClass:  
> javax.swing.JToggleButtonModelTestjava.lang.OutOfMemoryError:  
> Failed to create new thread
> 	at java.lang.Thread.start(Unknown Source)
> 	at javax.swing.BasicSwingTestCase.runBare(BasicSwingTestCase.java: 
> 133)
>
> Test: testGetItemListenersClass:  
> javax.swing.JToggleButtonModelTestjava.lang.OutOfMemoryError:  
> Failed to create new thread
> 	at java.lang.Thread.start(Unknown Source)
> 	at javax.swing.BasicSwingTestCase.runBare(BasicSwingTestCase.java: 
> 133)
>
> Test: testFireItemStateChangedClass:  
> javax.swing.JToggleButtonModelTestjava.lang.OutOfMemoryError:  
> Failed to create new thread
> 	at java.lang.Thread.start(Unknown Source)
> 	at javax.swing.BasicSwingTestCase.runBare(BasicSwingTestCase.java: 
> 133)
>
> Test: testFireActionPerformed1Class:  
> javax.swing.JToggleButtonModelTestjava.lang.OutOfMemoryError:  
> Failed to create new thread
> 	at java.lang.Thread.start(Unknown Source)
> 	at javax.swing.BasicSwingTestCase.runBare(BasicSwingTestCase.java: 
> 133)
>
> Test: testFireActionPerformed2Class:  
> javax.swing.JToggleButtonModelTestjava.lang.OutOfMemoryError:  
> Failed to create new thread
> 	at java.lang.Thread.start(Unknown Source)
> 	at javax.swing.BasicSwingTestCase.runBare(BasicSwingTestCase.java: 
> 133)
>
> Test: testFireStateChangedClass:  
> javax.swing.JToggleButtonModelTestjava.lang.OutOfMemoryError:  
> Failed to create new thread
> 	at java.lang.Thread.start(Unknown Source)
> 	at javax.swing.BasicSwingTestCase.runBare(BasicSwingTestCase.java: 
> 133)
>
> Test: testRemoveActionListenerClass:  
> javax.swing.JToggleButtonModelTestjava.lang.OutOfMemoryError:  
> Failed to create new thread
> 	at java.lang.Thread.start(Unknown Source)
> 	at javax.swing.BasicSwingTestCase.runBare(BasicSwingTestCase.java: 
> 133)
>
> Test: testAddActionListenerClass:  
> javax.swing.JToggleButtonModelTestjava.lang.OutOfMemoryError:  
> Failed to create new thread
> 	at java.lang.Thread.start(Unknown Source)
> 	at javax.swing.BasicSwingTestCase.runBare(BasicSwingTestCase.java: 
> 133)
>
> Test: testGetActionListenersClass:  
> javax.swing.JToggleButtonModelTestjava.lang.OutOfMemoryError:  
> Failed to create new thread
> 	at java.lang.Thread.start(Unknown Source)
> 	at javax.swing.BasicSwingTestCase.runBare(BasicSwingTestCase.java: 
> 133)
>
> Test: testSetSelectedClass:  
> javax.swing.JToggleButtonModelTestjava.lang.OutOfMemoryError:  
> Failed to create new thread
> 	at java.lang.Thread.start(Unknown Source)
> 	at javax.swing.BasicSwingTestCase.runBare(BasicSwingTestCase.java: 
> 133)
>
> Test: testSetRolloverClass:  
> javax.swing.JToggleButtonModelTestjava.lang.OutOfMemoryError:  
> Failed to create new thread
> 	at java.lang.Thread.start(Unknown Source)
> 	at javax.swing.BasicSwingTestCase.runBare(BasicSwingTestCase.java: 
> 133)
>
> Test: testSetEnabled1Class:  
> javax.swing.JToggleButtonModelTestjava.lang.OutOfMemoryError:  
> Failed to create new thread
> 	at java.lang.Thread.start(Unknown Source)
> 	at javax.swing.BasicSwingTestCase.runBare(BasicSwingTestCase.java: 
> 133)
>
> Test: testSetEnabled2Class:  
> javax.swing.JToggleButtonModelTestjava.lang.OutOfMemoryError:  
> Failed to create new thread
> 	at java.lang.Thread.start(Unknown Source)
> 	at javax.swing.BasicSwingTestCase.runBare(BasicSwingTestCase.java: 
> 133)
>
> Test: testSetArmedClass:  
> javax.swing.JToggleButtonModelTestjava.lang.OutOfMemoryError:  
> Failed to create new thread
> 	at java.lang.Thread.start(Unknown Source)
> 	at javax.swing.BasicSwingTestCase.runBare(BasicSwingTestCase.java: 
> 133)
>
> Test: testSetMnemonicClass:  
> javax.swing.JToggleButtonModelTestjava.lang.OutOfMemoryError:  
> Failed to create new thread
> 	at java.lang.Thread.start(Unknown Source)
> 	at javax.swing.BasicSwingTestCase.runBare(BasicSwingTestCase.java: 
> 133)
>
> Test: testIsSelectedClass:  
> javax.swing.JToggleButtonModelTestjava.lang.OutOfMemoryError:  
> Failed to create new thread
> 	at java.lang.Thread.start(Unknown Source)
> 	at javax.swing.BasicSwingTestCase.runBare(BasicSwingTestCase.java: 
> 133)
>
> Test: testIsRolloverClass:  
> javax.swing.JToggleButtonModelTestjava.lang.OutOfMemoryError:  
> Failed to create new thread
> 	at java.lang.Thread.start(Unknown Source)
> 	at javax.swing.BasicSwingTestCase.runBare(BasicSwingTestCase.java: 
> 133)
>
> Test: testIsPressedClass:  
> javax.swing.JToggleButtonModelTestjava.lang.OutOfMemoryError:  
> Failed to create new thread
> 	at java.lang.Thread.start(Unknown Source)
> 	at javax.swing.BasicSwingTestCase.runBare(BasicSwingTestCase.java: 
> 133)
>
> Test: testIsEnabledClass:  
> javax.swing.JToggleButtonModelTestjava.lang.OutOfMemoryError:  
> Failed to create new thread
> 	at java.lang.Thread.start(Unknown Source)
> 	at javax.swing.BasicSwingTestCase.runBare(BasicSwingTestCase.java: 
> 133)
>
> Test: testIsArmedClass:  
> javax.swing.JToggleButtonModelTestjava.lang.OutOfMemoryError:  
> Failed to create new thread
> 	at java.lang.Thread.start(Unknown Source)
> 	at javax.swing.BasicSwingTestCase.runBare(BasicSwingTestCase.java: 
> 133)
>
> Test: testGetMnemonicClass:  
> javax.swing.JToggleButtonModelTestjava.lang.OutOfMemoryError:  
> Failed to create new thread
> 	at java.lang.Thread.start(Unknown Source)
> 	at javax.swing.BasicSwingTestCase.runBare(BasicSwingTestCase.java: 
> 133)
>
> Test: testWriteObjectClass:  
> javax.swing.JToggleButtonModelTestjava.lang.OutOfMemoryError:  
> Failed to create new thread
> 	at java.lang.Thread.start(Unknown Source)
> 	at javax.swing.BasicSwingTestCase.runBare(BasicSwingTestCase.java: 
> 133)
>
> Test: testReadObjectClass:  
> javax.swing.JToggleButtonModelTestjava.lang.OutOfMemoryError:  
> Failed to create new thread
> 	at java.lang.Thread.start(Unknown Source)
> 	at javax.swing.BasicSwingTestCase.runBare(BasicSwingTestCase.java: 
> 133)
>
> Test: testGetAccessibleContextClass:  
> javax.swing.JToggleButtonTestjava.lang.OutOfMemoryError: Failed to  
> create new thread
> 	at java.lang.Thread.start(Unknown Source)
> 	at javax.swing.BasicSwingTestCase.runBare(BasicSwingTestCase.java: 
> 133)
>
> Test: testParamStringClass:  
> javax.swing.JToggleButtonTestjava.lang.OutOfMemoryError: Failed to  
> create new thread
> 	at java.lang.Thread.start(Unknown Source)
> 	at javax.swing.BasicSwingTestCase.runBare(BasicSwingTestCase.java: 
> 133)
>
> Test: testGetUIClassIDClass:  
> javax.swing.JToggleButtonTestjava.lang.OutOfMemoryError: Failed to  
> create new thread
> 	at java.lang.Thread.start(Unknown Source)
> 	at javax.swing.BasicSwingTestCase.runBare(BasicSwingTestCase.java: 
> 133)
>
> Test: testUpdateUIClass:  
> javax.swing.JToggleButtonTestjava.lang.OutOfMemoryError: Failed to  
> create new thread
> 	at java.lang.Thread.start(Unknown Source)
> 	at javax.swing.BasicSwingTestCase.runBare(BasicSwingTestCase.java: 
> 133)
>
> Test: testJToggleButtonStringIconbooleanClass:  
> javax.swing.JToggleButtonTestjava.lang.OutOfMemoryError: Failed to  
> create new thread
> 	at java.lang.Thread.start(Unknown Source)
> 	at javax.swing.BasicSwingTestCase.runBare(BasicSwingTestCase.java: 
> 133)
>
> Test: testJToggleButtonStringIconClass:  
> javax.swing.JToggleButtonTestjava.lang.OutOfMemoryError: Failed to  
> create new thread
> 	at java.lang.Thread.start(Unknown Source)
> 	at javax.swing.BasicSwingTestCase.runBare(BasicSwingTestCase.java: 
> 133)
>
> Test: testJToggleButtonIconbooleanClass:  
> javax.swing.JToggleButtonTestjava.lang.OutOfMemoryError: Failed to  
> create new thread
> 	at java.lang.Thread.start(Unknown Source)
> 	at javax.swing.BasicSwingTestCase.runBare(BasicSwingTestCase.java: 
> 133)
>
> Test: testJToggleButtonIconClass:  
> javax.swing.JToggleButtonTestjava.lang.OutOfMemoryError: Failed to  
> create new thread
> 	at java.lang.Thread.start(Unknown Source)
> 	at javax.swing.BasicSwingTestCase.runBare(BasicSwingTestCase.java: 
> 133)
>
> Test: testJToggleButtonActionClass:  
> javax.swing.JToggleButtonTestjava.lang.OutOfMemoryError: Failed to  
> create new thread
> 	at java.lang.Thread.start(Unknown Source)
> 	at javax.swing.BasicSwingTestCase.runBare(BasicSwingTestCase.java: 
> 133)
>
> Test: testJToggleButtonStringbooleanClass:  
> javax.swing.JToggleButtonTestjava.lang.OutOfMemoryError: Failed to  
> create new thread
> 	at java.lang.Thread.start(Unknown Source)
> 	at javax.swing.BasicSwingTestCase.runBare(BasicSwingTestCase.java: 
> 133)
>
> Test: testJToggleButtonStringClass:  
> javax.swing.JToggleButtonTestjava.lang.OutOfMemoryError: Failed to  
> create new thread
> 	at java.lang.Thread.start(Unknown Source)
> 	at javax.swing.BasicSwingTestCase.runBare(BasicSwingTestCase.java: 
> 133)
>
> Test: testJToggleButtonClass:  
> javax.swing.JToggleButtonTestjava.lang.OutOfMemoryError: Failed to  
> create new thread
> 	at java.lang.Thread.start(Unknown Source)
> 	at javax.swing.BasicSwingTestCase.runBare(BasicSwingTestCase.java: 
> 133)
>
> Test: testSetAction1Class:  
> javax.swing.JToggleButtonTestjava.lang.OutOfMemoryError: Failed to  
> create new thread
> 	at java.lang.Thread.start(Unknown Source)
> 	at javax.swing.BasicSwingTestCase.runBare(BasicSwingTestCase.java: 
> 133)
>
> Test: testGetAccessibleContextClass:  
> javax.swing.JToolBarTestjava.lang.OutOfMemoryError: Failed to  
> create new thread
> 	at java.lang.Thread.start(Unknown Source)
> 	at javax.swing.BasicSwingTestCase.runBare(BasicSwingTestCase.java: 
> 133)
>
> Test: testAddImplClass:  
> javax.swing.JToolBarTestjava.lang.OutOfMemoryError: Failed to  
> create new thread
> 	at java.lang.Thread.start(Unknown Source)
> 	at javax.swing.BasicSwingTestCase.runBare(BasicSwingTestCase.java: 
> 133)
>
> Test: testSetLayoutClass:  
> javax.swing.JToolBarTestjava.lang.OutOfMemoryError: Failed to  
> create new thread
> 	at java.lang.Thread.start(Unknown Source)
> 	at javax.swing.BasicSwingTestCase.runBare(BasicSwingTestCase.java: 
> 133)
>
> Test: testGetUIClassIDClass:  
> javax.swing.JToolBarTestjava.lang.OutOfMemoryError: Failed to  
> create new thread
> 	at java.lang.Thread.start(Unknown Source)
> 	at javax.swing.BasicSwingTestCase.runBare(BasicSwingTestCase.java: 
> 133)
>
> Test: testPaintBorderClass:  
> javax.swing.JToolBarTestjava.lang.OutOfMemoryError: Failed to  
> create new thread
> 	at java.lang.Thread.start(Unknown Source)
> 	at javax.swing.BasicSwingTestCase.runBare(BasicSwingTestCase.java: 
> 133)
>
> Test: testUpdateUIClass:  
> javax.swing.JToolBarTestjava.lang.OutOfMemoryError: Failed to  
> create new thread
> 	at java.lang.Thread.start(Unknown Source)
> 	at javax.swing.BasicSwingTestCase.runBare(BasicSwingTestCase.java: 
> 133)
>
> Test: testJToolBarClass:  
> javax.swing.JToolBarTestjava.lang.OutOfMemoryError: Failed to  
> create new thread
> 	at java.lang.Thread.start(Unknown Source)
> 	at javax.swing.BasicSwingTestCase.runBare(BasicSwingTestCase.java: 
> 133)
>
> Test: testJToolBarintClass:  
> javax.swing.JToolBarTestjava.lang.OutOfMemoryError: Failed to  
> create new thread
> 	at java.lang.Thread.start(Unknown Source)
> 	at javax.swing.BasicSwingTestCase.runBare(BasicSwingTestCase.java: 
> 133)
>
> Test: testJToolBarStringClass:  
> javax.swing.JToolBarTestjava.lang.OutOfMemoryError: Failed to  
> create new thread
> 	at java.lang.Thread.start(Unknown Source)
> 	at javax.swing.BasicSwingTestCase.runBare(BasicSwingTestCase.java: 
> 133)
>
> Test: testJToolBarStringintClass:  
> javax.swing.JToolBarTestjava.lang.OutOfMemoryError: Failed to  
> create new thread
> 	at java.lang.Thread.start(Unknown Source)
> 	at javax.swing.BasicSwingTestCase.runBare(BasicSwingTestCase.java: 
> 133)
>
> Test: testSetGetUIClass:  
> javax.swing.JToolBarTestjava.lang.OutOfMemoryError: Failed to  
> create new thread
> 	at java.lang.Thread.start(Unknown Source)
> 	at javax.swing.BasicSwingTestCase.runBare(BasicSwingTestCase.java: 
> 133)
>
> Test: testGetComponentIndexClass:  
> javax.swing.JToolBarTestjava.lang.OutOfMemoryError: Failed to  
> create new thread
> 	at java.lang.Thread.start(Unknown Source)
> 	at javax.swing.BasicSwingTestCase.runBare(BasicSwingTestCase.java: 
> 133)
>
> Test: testGetComponentAtIndexClass:  
> javax.swing.JToolBarTestjava.lang.OutOfMemoryError: Failed to  
> create new thread
> 	at java.lang.Thread.start(Unknown Source)
> 	at javax.swing.BasicSwingTestCase.runBare(BasicSwingTestCase.java: 
> 133)
>
> Test: testSetGetMarginClass:  
> javax.swing.JToolBarTestjava.lang.OutOfMemoryError: Failed to  
> create new thread
> 	at java.lang.Thread.start(Unknown Source)
> 	at javax.swing.BasicSwingTestCase.runBare(BasicSwingTestCase.java: 
> 133)
>
> Test: testSetIsBorderPaintedClass:  
> javax.swing.JToolBarTestjava.lang.OutOfMemoryError: Failed to  
> create new thread
> 	at java.lang.Thread.start(Unknown Source)
> 	at javax.swing.BasicSwingTestCase.runBare(BasicSwingTestCase.java: 
> 133)
>
> Test: testSetIsFloatableClass:  
> javax.swing.JToolBarTestjava.lang.OutOfMemoryError: Failed to  
> create new thread
> 	at java.lang.Thread.start(Unknown Source)
> 	at javax.swing.BasicSwingTestCase.runBare(BasicSwingTestCase.java: 
> 133)
>
> Test: testSetGetOrientationClass:  
> javax.swing.JToolBarTestjava.lang.OutOfMemoryError: Failed to  
> create new thread
> 	at java.lang.Thread.start(Unknown Source)
> 	at javax.swing.BasicSwingTestCase.runBare(BasicSwingTestCase.java: 
> 133)
>
> Test: testSetIsRolloverClass:  
> javax.swing.JToolBarTestjava.lang.OutOfMemoryError: Failed to  
> create new thread
> 	at java.lang.Thread.start(Unknown Source)
> 	at javax.swing.BasicSwingTestCase.runBare(BasicSwingTestCase.java: 
> 133)
>
> Test: testAddSeparatorClass:  
> javax.swing.JToolBarTestjava.lang.OutOfMemoryError: Failed to  
> create new thread
> 	at java.lang.Thread.start(Unknown Source)
> 	at javax.swing.BasicSwingTestCase.runBare(BasicSwingTestCase.java: 
> 133)
>
> Test: testAddSeparatorDimensionClass:  
> javax.swing.JToolBarTestjava.lang.OutOfMemoryError: Failed to  
> create new thread
> 	at java.lang.Thread.start(Unknown Source)
> 	at javax.swing.BasicSwingTestCase.runBare(BasicSwingTestCase.java: 
> 133)
>
> Test: testAddActionClass:  
> javax.swing.JToolBarTestjava.lang.OutOfMemoryError: Failed to  
> create new thread
> 	at java.lang.Thread.start(Unknown Source)
> 	at javax.swing.BasicSwingTestCase.runBare(BasicSwingTestCase.java: 
> 133)
>
> Test: testCreateActionComponentClass:  
> javax.swing.JToolBarTestjava.lang.OutOfMemoryError: Failed to  
> create new thread
> 	at java.lang.Thread.start(Unknown Source)
> 	at javax.swing.BasicSwingTestCase.runBare(BasicSwingTestCase.java: 
> 133)
>
> Test: testCreateActionChangeListenerClass:  
> javax.swing.JToolBarTestjava.lang.OutOfMemoryError: Failed to  
> create new thread
> 	at java.lang.Thread.start(Unknown Source)
> 	at javax.swing.BasicSwingTestCase.runBare(BasicSwingTestCase.java: 
> 133)
>
> Test: testFocusableClass:  
> javax.swing.JToolBar_SeparatorRTestjava.lang.OutOfMemoryError:  
> Failed to create new thread
> 	at java.lang.Thread.start(Unknown Source)
> 	at javax.swing.BasicSwingTestCase.runBare(BasicSwingTestCase.java: 
> 133)
>
> Test: testGetMaximumSizeClass:  
> javax.swing.JToolBar_SeparatorTestjava.lang.OutOfMemoryError:  
> Failed to create new thread
> 	at java.lang.Thread.start(Unknown Source)
> 	at javax.swing.BasicSwingTestCase.runBare(BasicSwingTestCase.java: 
> 133)
>
> Test: testGetMinimumSizeClass:  
> javax.swing.JToolBar_SeparatorTestjava.lang.OutOfMemoryError:  
> Failed to create new thread
> 	at java.lang.Thread.start(Unknown Source)
> 	at javax.swing.BasicSwingTestCase.runBare(BasicSwingTestCase.java: 
> 133)
>
> Test: testGetPreferredSizeClass:  
> javax.swing.JToolBar_SeparatorTestjava.lang.OutOfMemoryError:  
> Failed to create new thread
> 	at java.lang.Thread.start(Unknown Source)
> 	at javax.swing.BasicSwingTestCase.runBare(BasicSwingTestCase.java: 
> 133)
>
> Test: testGetUIClassIDClass:  
> javax.swing.JToolBar_SeparatorTestjava.lang.OutOfMemoryError:  
> Failed to create new thread
> 	at java.lang.Thread.start(Unknown Source)
> 	at javax.swing.BasicSwingTestCase.runBare(BasicSwingTestCase.java: 
> 133)
>
> Test: testSeparatorClass:  
> javax.swing.JToolBar_SeparatorTestjava.lang.OutOfMemoryError:  
> Failed to create new thread
> 	at java.lang.Thread.start(Unknown Source)
> 	at javax.swing.BasicSwingTestCase.runBare(BasicSwingTestCase.java: 
> 133)
>
> Test: testSeparatorDimensionClass:  
> javax.swing.JToolBar_SeparatorTestjava.lang.OutOfMemoryError:  
> Failed to create new thread
> 	at java.lang.Thread.start(Unknown Source)
> 	at javax.swing.BasicSwingTestCase.runBare(BasicSwingTestCase.java: 
> 133)
>
> Test: testSetGetSeparatorSizeClass:  
> javax.swing.JToolBar_SeparatorTestjava.lang.OutOfMemoryError:  
> Failed to create new thread
> 	at java.lang.Thread.start(Unknown Source)
> 	at javax.swing.BasicSwingTestCase.runBare(BasicSwingTestCase.java: 
> 133)
>
> Test: testGetUIClassIDClass:  
> javax.swing.JToolTipTestjava.lang.OutOfMemoryError: Failed to  
> create new thread
> 	at java.lang.Thread.start(Unknown Source)
> 	at javax.swing.BasicSwingTestCase.runBare(BasicSwingTestCase.java: 
> 133)
>
> Test: testGetUIClass:  
> javax.swing.JToolTipTestjava.lang.OutOfMemoryError: Failed to  
> create new thread
> 	at java.lang.Thread.start(Unknown Source)
> 	at javax.swing.BasicSwingTestCase.runBare(BasicSwingTestCase.java: 
> 133)
>
> Test: testSetGetTipTextClass:  
> javax.swing.JToolTipTestjava.lang.OutOfMemoryError: Failed to  
> create new thread
> 	at java.lang.Thread.start(Unknown Source)
> 	at javax.swing.BasicSwingTestCase.runBare(BasicSwingTestCase.java: 
> 133)
>
> Test: testSetGetComponentClass:  
> javax.swing.JToolTipTestjava.lang.OutOfMemoryError: Failed to  
> create new thread
> 	at java.lang.Thread.start(Unknown Source)
> 	at javax.swing.BasicSwingTestCase.runBare(BasicSwingTestCase.java: 
> 133)
>
> Test: testTreeSelectionRedirectorClass:  
> javax.swing.JTreeTestjava.lang.OutOfMemoryError: Failed to create  
> new thread
> 	at java.lang.Thread.start(Unknown Source)
> 	at javax.swing.BasicSwingTestCase.runBare(BasicSwingTestCase.java: 
> 133)
>
> Test: testJTreeClass:  
> javax.swing.JTreeTestjava.lang.OutOfMemoryError: Failed to create  
> new thread
> 	at java.lang.Thread.start(Unknown Source)
> 	at javax.swing.BasicSwingTestCase.runBare(BasicSwingTestCase.java: 
> 133)
>
> Test: testJTreeTreeModelClass:  
> javax.swing.JTreeTestjava.lang.OutOfMemoryError: Failed to create  
> new thread
> 	at java.lang.Thread.start(Unknown Source)
> 	at javax.swing.BasicSwingTestCase.runBare(BasicSwingTestCase.java: 
> 133)
>
> Test: testJTreeTreeNodeBooleanClass:  
> javax.swing.JTreeTestjava.lang.OutOfMemoryError: Failed to create  
> new thread
> 	at java.lang.Thread.start(Unknown Source)
> 	at javax.swing.BasicSwingTestCase.runBare(BasicSwingTestCase.java: 
> 133)
>
> Test: testJTreeTreeNodeClass:  
> javax.swing.JTreeTestjava.lang.OutOfMemoryError: Failed to create  
> new thread
> 	at java.lang.Thread.start(Unknown Source)
> 	at javax.swing.BasicSwingTestCase.runBare(BasicSwingTestCase.java: 
> 133)
>
> Test: testJTreeObjectArrayClass:  
> javax.swing.JTreeTestjava.lang.OutOfMemoryError: Failed to create  
> new thread
> 	at java.lang.Thread.start(Unknown Source)
> 	at javax.swing.BasicSwingTestCase.runBare(BasicSwingTestCase.java: 
> 133)
>
> Test: testJTreeVectorClass:  
> javax.swing.JTreeTestjava.lang.OutOfMemoryError: Failed to create  
> new thread
> 	at java.lang.Thread.start(Unknown Source)
> 	at javax.swing.BasicSwingTestCase.runBare(BasicSwingTestCase.java: 
> 133)
>
> Test: testJTreeHashtableClass:  
> javax.swing.JTreeTestjava.lang.OutOfMemoryError: Failed to create  
> new thread
> 	at java.lang.Thread.start(Unknown Source)
> 	at javax.swing.BasicSwingTestCase.runBare(BasicSwingTestCase.java: 
> 133)
>
> Test: testGetAccessibleContextClass:  
> javax.swing.JTreeTestjava.lang.OutOfMemoryError: Failed to create  
> new thread
> 	at java.lang.Thread.start(Unknown Source)
> 	at javax.swing.BasicSwingTestCase.runBare(BasicSwingTestCase.java: 
> 133)
>
> Test: testGetToolTipTextMouseEventClass:  
> javax.swing.JTreeTestjava.lang.OutOfMemoryError: Failed to create  
> new thread
> 	at java.lang.Thread.start(Unknown Source)
> 	at javax.swing.BasicSwingTestCase.runBare(BasicSwingTestCase.java: 
> 133)
>
> Test: testGetUIClassIDClass:  
> javax.swing.JTreeTestjava.lang.OutOfMemoryError: Failed to create  
> new thread
> 	at java.lang.Thread.start(Unknown Source)
> 	at javax.swing.BasicSwingTestCase.runBare(BasicSwingTestCase.java: 
> 133)
>
> Test: testSetAddRemoveSelectionIntervalClass:  
> javax.swing.JTreeTestjava.lang.OutOfMemoryError: Failed to create  
> new thread
> 	at java.lang.Thread.start(Unknown Source)
> 	at javax.swing.BasicSwingTestCase.runBare(BasicSwingTestCase.java: 
> 133)
>
> Test: testAddRemoveSelectionPathPathsRowRowsClass:  
> javax.swing.JTreeTestjava.lang.OutOfMemoryError: Failed to create  
> new thread
> 	at java.lang.Thread.start(Unknown Source)
> 	at javax.swing.BasicSwingTestCase.runBare(BasicSwingTestCase.java: 
> 133)
>
> Test: testAddGetRemoveTreeExpansionListenerClass:  
> javax.swing.JTreeTestjava.lang.OutOfMemoryError: Failed to create  
> new thread
> 	at java.lang.Thread.start(Unknown Source)
> 	at javax.swing.BasicSwingTestCase.runBare(BasicSwingTestCase.java: 
> 133)
>
> Test: testAddGetRemoveTreeSelectionListenerClass:  
> javax.swing.JTreeTestjava.lang.OutOfMemoryError: Failed to create  
> new thread
> 	at java.lang.Thread.start(Unknown Source)
> 	at javax.swing.BasicSwingTestCase.runBare(BasicSwingTestCase.java: 
> 133)
>
> Test: testAddGetRemoveTreeWillExpandListenerClass:  
> javax.swing.JTreeTestjava.lang.OutOfMemoryError: Failed to create  
> new thread
> 	at java.lang.Thread.start(Unknown Source)
> 	at javax.swing.BasicSwingTestCase.runBare(BasicSwingTestCase.java: 
> 133)
>
> Test: testClearSelectionClass:  
> javax.swing.JTreeTestjava.lang.OutOfMemoryError: Failed to create  
> new thread
> 	at java.lang.Thread.start(Unknown Source)
> 	at javax.swing.BasicSwingTestCase.runBare(BasicSwingTestCase.java: 
> 133)
>
> Test: testClearToggledPathsClass:  
> javax.swing.JTreeTestjava.lang.OutOfMemoryError: Failed to create  
> new thread
> 	at java.lang.Thread.start(Unknown Source)
> 	at javax.swing.BasicSwingTestCase.runBare(BasicSwingTestCase.java: 
> 133)
>
> Test: testConvertValueToTextClass:  
> javax.swing.JTreeTestjava.lang.OutOfMemoryError: Failed to create  
> new thread
> 	at java.lang.Thread.start(Unknown Source)
> 	at javax.swing.BasicSwingTestCase.runBare(BasicSwingTestCase.java: 
> 133)
>
> Test: testCreateTreeModelClass:  
> javax.swing.JTreeTestjava.lang.OutOfMemoryError: Failed to create  
> new thread
> 	at java.lang.Thread.start(Unknown Source)
> 	at javax.swing.BasicSwingTestCase.runBare(BasicSwingTestCase.java: 
> 133)
>
> Test: testCreateTreeModelListenerClass:  
> javax.swing.JTreeTestjava.lang.OutOfMemoryError: Failed to create  
> new thread
> 	at java.lang.Thread.start(Unknown Source)
> 	at javax.swing.BasicSwingTestCase.runBare(BasicSwingTestCase.java: 
> 133)
>
> Test: testTreeModelHandlerClass:  
> javax.swing.JTreeTestjava.lang.OutOfMemoryError: Failed to create  
> new thread
> 	at java.lang.Thread.start(Unknown Source)
> 	at javax.swing.BasicSwingTestCase.runBare(BasicSwingTestCase.java: 
> 133)
>
> Test: testExpandCollapsePathRowClass:  
> javax.swing.JTreeTestjava.lang.OutOfMemoryError: Failed to create  
> new thread
> 	at java.lang.Thread.start(Unknown Source)
> 	at javax.swing.BasicSwingTestCase.runBare(BasicSwingTestCase.java: 
> 133)
>
> Test: testHasBeenExpandedClass:  
> javax.swing.JTreeTestjava.lang.OutOfMemoryError: Failed to create  
> new thread
> 	at java.lang.Thread.start(Unknown Source)
> 	at javax.swing.BasicSwingTestCase.runBare(BasicSwingTestCase.java: 
> 133)
>
> Test: testFireTreeExpandedCollapsedWillExpandCollapseClass:  
> javax.swing.JTreeTestjava.lang.OutOfMemoryError: Failed to create  
> new thread
> 	at java.lang.Thread.start(Unknown Source)
> 	at javax.swing.BasicSwingTestCase.runBare(BasicSwingTestCase.java: 
> 133)
>
> Test: testFireValueChangedClass:  
> javax.swing.JTreeTestjava.lang.OutOfMemoryError: Failed to create  
> new thread
> 	at java.lang.Thread.start(Unknown Source)
> 	at javax.swing.BasicSwingTestCase.runBare(BasicSwingTestCase.java: 
> 133)
>
> Test: testGetSetAnchorSelectionPathClass:  
> javax.swing.JTreeTestjava.lang.OutOfMemoryError: Failed to create  
> new thread
> 	at java.lang.Thread.start(Unknown Source)
> 	at javax.swing.BasicSwingTestCase.runBare(BasicSwingTestCase.java: 
> 133)
>
> Test: testGetClosestPathForLocationClass:  
> javax.swing.JTreeTestjava.lang.OutOfMemoryError: Failed to create  
> new thread
> 	at java.lang.Thread.start(Unknown Source)
> 	at javax.swing.BasicSwingTestCase.runBare(BasicSwingTestCase.java: 
> 133)
>
> Test: testGetClosestRowForLocationClass:  
> javax.swing.JTreeTestjava.lang.OutOfMemoryError: Failed to create  
> new thread
> 	at java.lang.Thread.start(Unknown Source)
> 	at javax.swing.BasicSwingTestCase.runBare(BasicSwingTestCase.java: 
> 133)
>
> Test: testGetDefaultTreeModelClass:  
> javax.swing.JTreeTestjava.lang.OutOfMemoryError: Failed to create  
> new thread
> 	at java.lang.Thread.start(Unknown Source)
> 	at javax.swing.BasicSwingTestCase.runBare(BasicSwingTestCase.java: 
> 133)
>
> Test: testGetDescendantToggledPathsClass:  
> javax.swing.JTreeTestjava.lang.OutOfMemoryError: Failed to create  
> new thread
> 	at java.lang.Thread.start(Unknown Source)
> 	at javax.swing.BasicSwingTestCase.runBare(BasicSwingTestCase.java: 
> 133)
>
> Test: testGetDragEnabledClass:  
> javax.swing.JTreeTestjava.lang.OutOfMemoryError: Failed to create  
> new thread
> 	at java.lang.Thread.start(Unknown Source)
> 	at javax.swing.BasicSwingTestCase.runBare(BasicSwingTestCase.java: 
> 133)
>
> Test: testGetExpandedDescendantsClass:  
> javax.swing.JTreeTestjava.lang.OutOfMemoryError: Failed to create  
> new thread
> 	at java.lang.Thread.start(Unknown Source)
> 	at javax.swing.BasicSwingTestCase.runBare(BasicSwingTestCase.java: 
> 133)
>
> Test: testGetSetExpandsSelectedPathsClass:  
> javax.swing.JTreeTestjava.lang.OutOfMemoryError: Failed to create  
> new thread
> 	at java.lang.Thread.start(Unknown Source)
> 	at javax.swing.BasicSwingTestCase.runBare(BasicSwingTestCase.java: 
> 133)
>
> Test: testGetSetInvokesStopCellEditingClass:  
> javax.swing.JTreeTestjava.lang.OutOfMemoryError: Failed to create  
> new thread
> 	at java.lang.Thread.start(Unknown Source)
> 	at javax.swing.BasicSwingTestCase.runBare(BasicSwingTestCase.java: 
> 133)
>
> Test: testGetLastSelectedPathComponentClass:  
> javax.swing.JTreeTestjava.lang.OutOfMemoryError: Failed to create  
> new thread
> 	at java.lang.Thread.start(Unknown Source)
> 	at javax.swing.BasicSwingTestCase.runBare(BasicSwingTestCase.java: 
> 133)
>
> Test: testGetLeadSelectionRowClass:  
> javax.swing.JTreeTestjava.lang.OutOfMemoryError: Failed to create  
> new thread
> 	at java.lang.Thread.start(Unknown Source)
> 	at javax.swing.BasicSwingTestCase.runBare(BasicSwingTestCase.java: 
> 133)
>
> Test: testGetMinMaxSelectionRowClass:  
> javax.swing.JTreeTestjava.lang.OutOfMemoryError: Failed to create  
> new thread
> 	at java.lang.Thread.start(Unknown Source)
> 	at javax.swing.BasicSwingTestCase.runBare(BasicSwingTestCase.java: 
> 133)
>
> Test: testGetNextMatchClass:  
> javax.swing.JTreeTestjava.lang.OutOfMemoryError: Failed to create  
> new thread
> 	at java.lang.Thread.start(Unknown Source)
> 	at javax.swing.BasicSwingTestCase.runBare(BasicSwingTestCase.java: 
> 133)
>
> Test: testGetPathBetweenRowsClass:  
> javax.swing.JTreeTestjava.lang.OutOfMemoryError: Failed to create  
> new thread
> 	at java.lang.Thread.start(Unknown Source)
> 	at javax.swing.BasicSwingTestCase.runBare(BasicSwingTestCase.java: 
> 133)
>
> Test: testGetPathBoundsClass:  
> javax.swing.JTreeTestjava.lang.OutOfMemoryError: Failed to create  
> new thread
> 	at java.lang.Thread.start(Unknown Source)
> 	at javax.swing.BasicSwingTestCase.runBare(BasicSwingTestCase.java: 
> 133)
>
> Test: testGetRowBoundsClass:  
> javax.swing.JTreeTestjava.lang.OutOfMemoryError: Failed to create  
> new thread
> 	at java.lang.Thread.start(Unknown Source)
> 	at javax.swing.BasicSwingTestCase.runBare(BasicSwingTestCase.java: 
> 133)
>
> Test: testGetPathForLocationClass:  
> javax.swing.JTreeTestjava.lang.OutOfMemoryError: Failed to create  
> new thread
> 	at java.lang.Thread.start(Unknown Source)
> 	at javax.swing.BasicSwingTestCase.runBare(BasicSwingTestCase.java: 
> 133)
>
> Test: testGetRowForLocationClass:  
> javax.swing.JTreeTestjava.lang.OutOfMemoryError: Failed to create  
> new thread
> 	at java.lang.Thread.start(Unknown Source)
> 	at javax.swing.BasicSwingTestCase.runBare(BasicSwingTestCase.java: 
> 133)
>
> Test: testGetRowForPathClass:  
> javax.swing.JTreeTestjava.lang.OutOfMemoryError: Failed to create  
> new thread
> 	at java.lang.Thread.start(Unknown Source)
> 	at javax.swing.BasicSwingTestCase.runBare(BasicSwingTestCase.java: 
> 133)
>
> Test: testGetPathForRowClass:  
> javax.swing.JTreeTestjava.lang.OutOfMemoryError: Failed to create  
> new thread
> 	at java.lang.Thread.start(Unknown Source)
> 	at javax.swing.BasicSwingTestCase.runBare(BasicSwingTestCase.java: 
> 133)
>
> Test: testGetRowCountClass:  
> javax.swing.JTreeTestjava.lang.OutOfMemoryError: Failed to create  
> new thread
> 	at java.lang.Thread.start(Unknown Source)
> 	at javax.swing.BasicSwingTestCase.runBare(BasicSwingTestCase.java: 
> 133)
>
> Test: testGetSetRowHeightClass:  
> javax.swing.JTreeTestjava.lang.OutOfMemoryError: Failed to create  
> new thread
> 	at java.lang.Thread.start(Unknown Source)
> 	at javax.swing.BasicSwingTestCase.runBare(BasicSwingTestCase.java: 
> 133)
>
> Test: testGetSetScrollsOnExpandClass:  
> javax.swing.JTreeTestjava.lang.OutOfMemoryError: Failed to create  
> new thread
> 	at java.lang.Thread.start(Unknown Source)
> 	at javax.swing.BasicSwingTestCase.runBare(BasicSwingTestCase.java: 
> 133)
>
> Test: testGetSelectionCountClass:  
> javax.swing.JTreeTestjava.lang.OutOfMemoryError: Failed to create  
> new thread
> 	at java.lang.Thread.start(Unknown Source)
> 	at javax.swing.BasicSwingTestCase.runBare(BasicSwingTestCase.java: 
> 133)
>
> Test: testGetSelectionModelClass:  
> javax.swing.JTreeTestjava.lang.OutOfMemoryError: Failed to create  
> new thread
> 	at java.lang.Thread.start(Unknown Source)
> 	at javax.swing.BasicSwingTestCase.runBare(BasicSwingTestCase.java: 
> 133)
>
> Test: testGetSetSelectionPathsClass:  
> javax.swing.JTreeTestjava.lang.OutOfMemoryError: Failed to create  
> new thread
> 	at java.lang.Thread.start(Unknown Source)
> 	at javax.swing.BasicSwingTestCase.runBare(BasicSwingTestCase.java: 
> 133)
>
> Test: testGetSetShowsRootHandlesClass:  
> javax.swing.JTreeTestjava.lang.OutOfMemoryError: Failed to create  
> new thread
> 	at java.lang.Thread.start(Unknown Source)
> 	at javax.swing.BasicSwingTestCase.runBare(BasicSwingTestCase.java: 
> 133)
>
> Test: testGetToggleClickCountClass:  
> javax.swing.JTreeTestjava.lang.OutOfMemoryError: Failed to create  
> new thread
> 	at java.lang.Thread.start(Unknown Source)
> 	at javax.swing.BasicSwingTestCase.runBare(BasicSwingTestCase.java: 
> 133)
>
> Test: testGetUIClass:  
> javax.swing.JTreeTestjava.lang.OutOfMemoryError: Failed to create  
> new thread
> 	at java.lang.Thread.start(Unknown Source)
> 	at javax.swing.BasicSwingTestCase.runBare(BasicSwingTestCase.java: 
> 133)
>
> Test: testIsSetEditableClass:  
> javax.swing.JTreeTestjava.lang.OutOfMemoryError: Failed to create  
> new thread
> 	at java.lang.Thread.start(Unknown Source)
> 	at javax.swing.BasicSwingTestCase.runBare(BasicSwingTestCase.java: 
> 133)
>
> Test: testIsExpandedClass:  
> javax.swing.JTreeTestjava.lang.OutOfMemoryError: Failed to create  
> new thread
> 	at java.lang.Thread.start(Unknown Source)
> 	at javax.swing.BasicSwingTestCase.runBare(BasicSwingTestCase.java: 
> 133)
>
> Test: testIsFixedRowHeightClass:  
> javax.swing.JTreeTestjava.lang.OutOfMemoryError: Failed to create  
> new thread
> 	at java.lang.Thread.start(Unknown Source)
> 	at javax.swing.BasicSwingTestCase.runBare(BasicSwingTestCase.java: 
> 133)
>
> Test: testIsLargeModelClass:  
> javax.swing.JTreeTestjava.lang.OutOfMemoryError: Failed to create  
> new thread
> 	at java.lang.Thread.start(Unknown Source)
> 	at javax.swing.BasicSwingTestCase.runBare(BasicSwingTestCase.java: 
> 133)
>
> Test: testIsPathEditableClass:  
> javax.swing.JTreeTestjava.lang.OutOfMemoryError: Failed to create  
> new thread
> 	at java.lang.Thread.start(Unknown Source)
> 	at javax.swing.BasicSwingTestCase.runBare(BasicSwingTestCase.java: 
> 133)
>
> Test: testSetIsRootVisibleClass:  
> javax.swing.JTreeTestjava.lang.OutOfMemoryError: Failed to create  
> new thread
> 	at java.lang.Thread.start(Unknown Source)
> 	at javax.swing.BasicSwingTestCase.runBare(BasicSwingTestCase.java: 
> 133)
>
> Test: testIsPathSelectedClass:  
> javax.swing.JTreeTestjava.lang.OutOfMemoryError: Failed to create  
> new thread
> 	at java.lang.Thread.start(Unknown Source)
> 	at javax.swing.BasicSwingTestCase.runBare(BasicSwingTestCase.java: 
> 133)
>
> Test: testIsRowSelectedClass:  
> javax.swing.JTreeTestjava.lang.OutOfMemoryError: Failed to create  
> new thread
> 	at java.lang.Thread.start(Unknown Source)
> 	at javax.swing.BasicSwingTestCase.runBare(BasicSwingTestCase.java: 
> 133)
>
> Test: testIsSelectionEmptyClass:  
> javax.swing.JTreeTestjava.lang.OutOfMemoryError: Failed to create  
> new thread
> 	at java.lang.Thread.start(Unknown Source)
> 	at javax.swing.BasicSwingTestCase.runBare(BasicSwingTestCase.java: 
> 133)
>
> Test: testIsVisibleClass:  
> javax.swing.JTreeTestjava.lang.OutOfMemoryError: Failed to create  
> new thread
> 	at java.lang.Thread.start(Unknown Source)
> 	at javax.swing.BasicSwingTestCase.runBare(BasicSwingTestCase.java: 
> 133)
>
> Test: testMakeVisibleClass:  
> javax.swing.JTreeTestjava.lang.OutOfMemoryError: Failed to create  
> new thread
> 	at java.lang.Thread.start(Unknown Source)
> 	at javax.swing.BasicSwingTestCase.runBare(BasicSwingTestCase.java: 
> 133)
>
> Test: testRemoveDescendantSelectedPathsClass:  
> javax.swing.JTreeTestjava.lang.OutOfMemoryError: Failed to create  
> new thread
> 	at java.lang.Thread.start(Unknown Source)
> 	at javax.swing.BasicSwingTestCase.runBare(BasicSwingTestCase.java: 
> 133)
>
> Test: testRemoveDescendantToggledPathsClass:  
> javax.swing.JTreeTestjava.lang.OutOfMemoryError: Failed to create  
> new thread
> 	at java.lang.Thread.start(Unknown Source)
> 	at javax.swing.BasicSwingTestCase.runBare(BasicSwingTestCase.java: 
> 133)
>
> Test: testSetCellEditorClass:  
> javax.swing.JTreeTestjava.lang.OutOfMemoryError: Failed to create  
> new thread
> 	at java.lang.Thread.start(Unknown Source)
> 	at javax.swing.BasicSwingTestCase.runBare(BasicSwingTestCase.java: 
> 133)
>
> Test: testGetCellEditorClass:  
> javax.swing.JTreeTestjava.lang.OutOfMemoryError: Failed to create  
> new thread
> 	at java.lang.Thread.start(Unknown Source)
> 	at javax.swing.BasicSwingTestCase.runBare(BasicSwingTestCase.java: 
> 133)
>
> Test: testSetCellRendererClass:  
> javax.swing.JTreeTestjava.lang.OutOfMemoryError: Failed to create  
> new thread
> 	at java.lang.Thread.start(Unknown Source)
> 	at javax.swing.BasicSwingTestCase.runBare(BasicSwingTestCase.java: 
> 133)
>
> Test: testGetCellRendererClass:  
> javax.swing.JTreeTestjava.lang.OutOfMemoryError: Failed to create  
> new thread
> 	at java.lang.Thread.start(Unknown Source)
> 	at javax.swing.BasicSwingTestCase.runBare(BasicSwingTestCase.java: 
> 133)
>
> Test: testSetExpandedStateClass:  
> javax.swing.JTreeTestjava.lang.OutOfMemoryError: Failed to create  
> new thread
> 	at java.lang.Thread.start(Unknown Source)
> 	at javax.swing.BasicSwingTestCase.runBare(BasicSwingTestCase.java: 
> 133)
>
> Test: testGetSetLeadSelectionPathClass:  
> javax.swing.JTreeTestjava.lang.OutOfMemoryError: Failed to create  
> new thread
> 	at java.lang.Thread.start(Unknown Source)
> 	at javax.swing.BasicSwingTestCase.runBare(BasicSwingTestCase.java: 
> 133)
>
> Test: testGetSetModelClass:  
> javax.swing.JTreeTestjava.lang.OutOfMemoryError: Failed to create  
> new thread
> 	at java.lang.Thread.start(Unknown Source)
> 	at javax.swing.BasicSwingTestCase.runBare(BasicSwingTestCase.java: 
> 133)
>
> Test: testSetSelectionModelClass:  
> javax.swing.JTreeTestjava.lang.OutOfMemoryError: Failed to create  
> new thread
> 	at java.lang.Thread.start(Unknown Source)
> 	at javax.swing.BasicSwingTestCase.runBare(BasicSwingTestCase.java: 
> 133)
>
> Test: testGetSetSelectionPathClass:  
> javax.swing.JTreeTestjava.lang.OutOfMemoryError: Failed to create  
> new thread
> 	at java.lang.Thread.start(Unknown Source)
> 	at javax.swing.BasicSwingTestCase.runBare(BasicSwingTestCase.java: 
> 133)
>
> Test: testGetSetSelectionRowClass:  
> javax.swing.JTreeTestjava.lang.OutOfMemoryError: Failed to create  
> new thread
> 	at java.lang.Thread.start(Unknown Source)
> 	at javax.swing.BasicSwingTestCase.runBare(BasicSwingTestCase.java: 
> 133)
>
> Test: testGetSetSelectionRowsClass:  
> javax.swing.JTreeTestjava.lang.OutOfMemoryError: Failed to create  
> new thread
> 	at java.lang.Thread.start(Unknown Source)
> 	at javax.swing.BasicSwingTestCase.runBare(BasicSwingTestCase.java: 
> 133)
>
> Test: testSetUITreeUIClass:  
> javax.swing.JTreeTestjava.lang.OutOfMemoryError: Failed to create  
> new thread
> 	at java.lang.Thread.start(Unknown Source)
> 	at javax.swing.BasicSwingTestCase.runBare(BasicSwingTestCase.java: 
> 133)
>
> Test: testGetSetVisibleRowCountClass:  
> javax.swing.JTreeTestjava.lang.OutOfMemoryError: Failed to create  
> new thread
> 	at java.lang.Thread.start(Unknown Source)
> 	at javax.swing.BasicSwingTestCase.runBare(BasicSwingTestCase.java: 
> 133)
>
> Test: testIsEditingStartEditingAtPathGetEditingPathClass:  
> javax.swing.JTreeTestjava.lang.OutOfMemoryError: Failed to create  
> new thread
> 	at java.lang.Thread.start(Unknown Source)
> 	at javax.swing.BasicSwingTestCase.runBare(BasicSwingTestCase.java: 
> 133)
>
> Test: testGetPreferredScrollableViewportSizeClass:  
> javax.swing.JTreeTestjava.lang.OutOfMemoryError: Failed to create  
> new thread
> 	at java.lang.Thread.start(Unknown Source)
> 	at javax.swing.BasicSwingTestCase.runBare(BasicSwingTestCase.java: 
> 133)
>
> Test: testGetScrollableBlockIncrementClass:  
> javax.swing.JTreeTestjava.lang.OutOfMemoryError: Failed to create  
> new thread
> 	at java.lang.Thread.start(Unknown Source)
> 	at javax.swing.BasicSwingTestCase.runBare(BasicSwingTestCase.java: 
> 133)
>
> Test: testGetScrollableUnitIncrementClass:  
> javax.swing.JTreeTestjava.lang.OutOfMemoryError: Failed to create  
> new thread
> 	at java.lang.Thread.start(Unknown Source)
> 	at javax.swing.BasicSwingTestCase.runBare(BasicSwingTestCase.java: 
> 133)
>
> Test: testGetScrollableTracksViewportHeightClass:  
> javax.swing.JTreeTestjava.lang.OutOfMemoryError: Failed to create  
> new thread
> 	at java.lang.Thread.start(Unknown Source)
> 	at javax.swing.BasicSwingTestCase.runBare(BasicSwingTestCase.java: 
> 133)
>
> Test: testGetScrollableTracksViewportWidthClass:  
> javax.swing.JTreeTestjava.lang.OutOfMemoryError: Failed to create  
> new thread
> 	at java.lang.Thread.start(Unknown Source)
> 	at javax.swing.BasicSwingTestCase.runBare(BasicSwingTestCase.java: 
> 133)
>
> Test: testScrollRowPathToVisibleClass:  
> javax.swing.JTreeTestjava.lang.OutOfMemoryError: Failed to create  
> new thread
> 	at java.lang.Thread.start(Unknown Source)
> 	at javax.swing.BasicSwingTestCase.runBare(BasicSwingTestCase.java: 
> 133)
>
> Test: testDynamicUtilTreeNodeClass:  
> javax.swing.JTree_DynamicUtilTreeNodeTestjava.lang.OutOfMemoryError: F 
> ailed to create new thread
> 	at java.lang.Thread.start(Unknown Source)
> 	at javax.swing.BasicSwingTestCase.runBare(BasicSwingTestCase.java: 
> 133)
>
> Test: testCreateChildrenClass:  
> javax.swing.JTree_DynamicUtilTreeNodeTestjava.lang.OutOfMemoryError: F 
> ailed to create new thread
> 	at java.lang.Thread.start(Unknown Source)
> 	at javax.swing.BasicSwingTestCase.runBare(BasicSwingTestCase.java: 
> 133)
>
> Test: testIsLeafClass:  
> javax.swing.JTree_DynamicUtilTreeNodeTestjava.lang.OutOfMemoryError: F 
> ailed to create new thread
> 	at java.lang.Thread.start(Unknown Source)
> 	at javax.swing.BasicSwingTestCase.runBare(BasicSwingTestCase.java: 
> 133)
>
> Test: testGetChildCountClass:  
> javax.swing.JTree_DynamicUtilTreeNodeTestjava.lang.OutOfMemoryError: F 
> ailed to create new thread
> 	at java.lang.Thread.start(Unknown Source)
> 	at javax.swing.BasicSwingTestCase.runBare(BasicSwingTestCase.java: 
> 133)
>
> Test: testGetChildAtClass:  
> javax.swing.JTree_DynamicUtilTreeNodeTestjava.lang.OutOfMemoryError: F 
> ailed to create new thread
> 	at java.lang.Thread.start(Unknown Source)
> 	at javax.swing.BasicSwingTestCase.runBare(BasicSwingTestCase.java: 
> 133)
>
> Test: testChildrenClass:  
> javax.swing.JTree_DynamicUtilTreeNodeTestjava.lang.OutOfMemoryError: F 
> ailed to create new thread
> 	at java.lang.Thread.start(Unknown Source)
> 	at javax.swing.BasicSwingTestCase.runBare(BasicSwingTestCase.java: 
> 133)
>
> Test: testLoadChildrenClass:  
> javax.swing.JTree_DynamicUtilTreeNodeTestjava.lang.OutOfMemoryError: F 
> ailed to create new thread
> 	at java.lang.Thread.start(Unknown Source)
> 	at javax.swing.BasicSwingTestCase.runBare(BasicSwingTestCase.java: 
> 133)
>
> Test: testEmptySelectionModelClass:  
> javax.swing.JTree_EmptySelectionModelTestjava.lang.OutOfMemoryError: F 
> ailed to create new thread
> 	at java.lang.Thread.start(Unknown Source)
> 	at javax.swing.BasicSwingTestCase.runBare(BasicSwingTestCase.java: 
> 133)
>
> Test: testSharedInstanceClass:  
> javax.swing.JTree_EmptySelectionModelTestjava.lang.OutOfMemoryError: F 
> ailed to create new thread
> 	at java.lang.Thread.start(Unknown Source)
> 	at javax.swing.BasicSwingTestCase.runBare(BasicSwingTestCase.java: 
> 133)
>
> Test: testSetAddRemoveSelectionPathsClass:  
> javax.swing.JTree_EmptySelectionModelTestjava.lang.OutOfMemoryError: F 
> ailed to create new thread
> 	at java.lang.Thread.start(Unknown Source)
> 	at javax.swing.BasicSwingTestCase.runBare(BasicSwingTestCase.java: 
> 133)
>
> Test: testGetKeyStrokeStringClass:  
> javax.swing.KeyStrokeTestjava.lang.OutOfMemoryError: Failed to  
> create new thread
> 	at java.lang.Thread.start(Unknown Source)
> 	at javax.swing.BasicSwingTestCase.runBare(BasicSwingTestCase.java: 
> 133)
>
> Test: testGetKeyStrokeCharacterintClass:  
> javax.swing.KeyStrokeTestjava.lang.OutOfMemoryError: Failed to  
> create new thread
> 	at java.lang.Thread.start(Unknown Source)
> 	at javax.swing.BasicSwingTestCase.runBare(BasicSwingTestCase.java: 
> 133)
>
> Test: testGetKeyStrokeForEventClass:  
> javax.swing.KeyStrokeTestjava.lang.OutOfMemoryError: Failed to  
> create new thread
> 	at java.lang.Thread.start(Unknown Source)
> 	at javax.swing.BasicSwingTestCase.runBare(BasicSwingTestCase.java: 
> 133)
>
> Test: testGetKeyStrokeintintbooleanClass:  
> javax.swing.KeyStrokeTestjava.lang.OutOfMemoryError: Failed to  
> create new thread
> 	at java.lang.Thread.start(Unknown Source)
> 	at javax.swing.BasicSwingTestCase.runBare(BasicSwingTestCase.java: 
> 133)
>
> Test: testGetKeyStrokeintintClass:  
> javax.swing.KeyStrokeTestjava.lang.OutOfMemoryError: Failed to  
> create new thread
> 	at java.lang.Thread.start(Unknown Source)
> 	at javax.swing.BasicSwingTestCase.runBare(BasicSwingTestCase.java: 
> 133)
>
> Test: testGetKeyStrokecharbooleanClass:  
> javax.swing.KeyStrokeTestjava.lang.OutOfMemoryError: Failed to  
> create new thread
> 	at java.lang.Thread.start(Unknown Source)
> 	at javax.swing.BasicSwingTestCase.runBare(BasicSwingTestCase.java: 
> 133)
>
> Test: testGetKeyStrokecharClass:  
> javax.swing.KeyStrokeTestjava.lang.OutOfMemoryError: Failed to  
> create new thread
> 	at java.lang.Thread.start(Unknown Source)
> 	at javax.swing.BasicSwingTestCase.runBare(BasicSwingTestCase.java: 
> 133)
>
> Test: testToStringClass:  
> javax.swing.LookAndFeelTestjava.lang.OutOfMemoryError: Failed to  
> create new thread
> 	at java.lang.Thread.start(Unknown Source)
> 	at javax.swing.BasicSwingTestCase.runBare(BasicSwingTestCase.java: 
> 133)
>
> Test: testMakeComponentInputMapClass:  
> javax.swing.LookAndFeelTestjava.lang.OutOfMemoryError: Failed to  
> create new thread
> 	at java.lang.Thread.start(Unknown Source)
> 	at javax.swing.BasicSwingTestCase.runBare(BasicSwingTestCase.java: 
> 133)
>
> Test: testMakeIconClass:  
> javax.swing.LookAndFeelTestjava.lang.OutOfMemoryError: Failed to  
> create new thread
> 	at java.lang.Thread.start(Unknown Source)
> 	at javax.swing.BasicSwingTestCase.runBare(BasicSwingTestCase.java: 
> 133)
>
> Test: testMakeInputMapClass:  
> javax.swing.LookAndFeelTestjava.lang.OutOfMemoryError: Failed to  
> create new thread
> 	at java.lang.Thread.start(Unknown Source)
> 	at javax.swing.BasicSwingTestCase.runBare(BasicSwingTestCase.java: 
> 133)
>
> Test: testMakeKeyBindingsClass:  
> javax.swing.LookAndFeelTestjava.lang.OutOfMemoryError: Failed to  
> create new thread
> 	at java.lang.Thread.start(Unknown Source)
> 	at javax.swing.BasicSwingTestCase.runBare(BasicSwingTestCase.java: 
> 133)
>
> Test: testMakeKeyBindingsFromErrorArrayClass:  
> javax.swing.LookAndFeelTestjava.lang.OutOfMemoryError: Failed to  
> create new thread
> 	at java.lang.Thread.start(Unknown Source)
> 	at javax.swing.BasicSwingTestCase.runBare(BasicSwingTestCase.java: 
> 133)
>
> Test: testGetDefaultsClass:  
> javax.swing.LookAndFeelTestjava.lang.OutOfMemoryError: Failed to  
> create new thread
> 	at java.lang.Thread.start(Unknown Source)
> 	at javax.swing.BasicSwingTestCase.runBare(BasicSwingTestCase.java: 
> 133)
>
> Test: testInstallColorsClass:  
> javax.swing.LookAndFeelTestjava.lang.OutOfMemoryError: Failed to  
> create new thread
> 	at java.lang.Thread.start(Unknown Source)
> 	at javax.swing.BasicSwingTestCase.runBare(BasicSwingTestCase.java: 
> 133)
>
> Test: testInstallErrorColorsClass:  
> javax.swing.LookAndFeelTestjava.lang.OutOfMemoryError: Failed to  
> create new thread
> 	at java.lang.Thread.start(Unknown Source)
> 	at javax.swing.BasicSwingTestCase.runBare(BasicSwingTestCase.java: 
> 133)
>
> Test: testInstallColorAndFontsClass:  
> javax.swing.LookAndFeelTestjava.lang.OutOfMemoryError: Failed to  
> create new thread
> 	at java.lang.Thread.start(Unknown Source)
> 	at javax.swing.BasicSwingTestCase.runBare(BasicSwingTestCase.java: 
> 133)
>
> Test: testInstallUninstallBorderClass:  
> javax.swing.LookAndFeelTestjava.lang.OutOfMemoryError: Failed to  
> create new thread
> 	at java.lang.Thread.start(Unknown Source)
> 	at javax.swing.BasicSwingTestCase.runBare(BasicSwingTestCase.java: 
> 133)
>
> Test: testLoadKeyBindingsClass:  
> javax.swing.LookAndFeelTestjava.lang.OutOfMemoryError: Failed to  
> create new thread
> 	at java.lang.Thread.start(Unknown Source)
> 	at javax.swing.BasicSwingTestCase.runBare(BasicSwingTestCase.java: 
> 133)
>
> Test: testGetDesktopPropertyValueClass:  
> javax.swing.LookAndFeelTestjava.lang.OutOfMemoryError: Failed to  
> create new thread
> 	at java.lang.Thread.start(Unknown Source)
> 	at javax.swing.BasicSwingTestCase.runBare(BasicSwingTestCase.java: 
> 133)
>
> Test: testGetSupportsWindowsDecorationsClass:  
> javax.swing.LookAndFeelTestjava.lang.OutOfMemoryError: Failed to  
> create new thread
> 	at java.lang.Thread.start(Unknown Source)
> 	at javax.swing.BasicSwingTestCase.runBare(BasicSwingTestCase.java: 
> 133)
>
> Test: testInstallPropertyClass:  
> javax.swing.LookAndFeelTestjava.lang.OutOfMemoryError: Failed to  
> create new thread
> 	at java.lang.Thread.start(Unknown Source)
> 	at javax.swing.BasicSwingTestCase.runBare(BasicSwingTestCase.java: 
> 133)
>
> Test: testIsComponentPartOfCurrentMenuClass:  
> javax.swing.MenuSelectionManagerRTestjava.lang.OutOfMemoryError:  
> Failed to create new thread
> 	at java.lang.Thread.start(Unknown Source)
> 	at javax.swing.BasicSwingTestCase.runBare(BasicSwingTestCase.java: 
> 133)
>
> Test: testMenuSelectionManagerClass:  
> javax.swing.MenuSelectionManagerTestjava.lang.OutOfMemoryError:  
> Failed to create new thread
> 	at java.lang.Thread.start(Unknown Source)
> 	at javax.swing.BasicSwingTestCase.runBare(BasicSwingTestCase.java: 
> 133)
>
> Test: testAddGetRemoveChangeListenerClass:  
> javax.swing.MenuSelectionManagerTestjava.lang.OutOfMemoryError:  
> Failed to create new thread
> 	at java.lang.Thread.start(Unknown Source)
> 	at javax.swing.BasicSwingTestCase.runBare(BasicSwingTestCase.java: 
> 133)
>
> Test: testComponentForPointClass:  
> javax.swing.MenuSelectionManagerTestjava.lang.OutOfMemoryError:  
> Failed to create new thread
> 	at java.lang.Thread.start(Unknown Source)
> 	at javax.swing.BasicSwingTestCase.runBare(BasicSwingTestCase.java: 
> 133)
>
> Test: testDefaultManagerClass:  
> javax.swing.MenuSelectionManagerTestjava.lang.OutOfMemoryError:  
> Failed to create new thread
> 	at java.lang.Thread.start(Unknown Source)
> 	at javax.swing.BasicSwingTestCase.runBare(BasicSwingTestCase.java: 
> 133)
>
> Test: testFireStateChangedClass:  
> javax.swing.MenuSelectionManagerTestjava.lang.OutOfMemoryError:  
> Failed to create new thread
> 	at java.lang.Thread.start(Unknown Source)
> 	at javax.swing.BasicSwingTestCase.runBare(BasicSwingTestCase.java: 
> 133)
>
> Test: testIsComponentPartOfCurrentMenuClass:  
> javax.swing.MenuSelectionManagerTestjava.lang.OutOfMemoryError:  
> Failed to create new thread
> 	at java.lang.Thread.start(Unknown Source)
> 	at javax.swing.BasicSwingTestCase.runBare(BasicSwingTestCase.java: 
> 133)
>
> Test: testProcessKeyEventClass:  
> javax.swing.MenuSelectionManagerTestjava.lang.OutOfMemoryError:  
> Failed to create new thread
> 	at java.lang.Thread.start(Unknown Source)
> 	at javax.swing.BasicSwingTestCase.runBare(BasicSwingTestCase.java: 
> 133)
>
> Test: testProcessMouseEventClass:  
> javax.swing.MenuSelectionManagerTestjava.lang.OutOfMemoryError:  
> Failed to create new thread
> 	at java.lang.Thread.start(Unknown Source)
> 	at javax.swing.BasicSwingTestCase.runBare(BasicSwingTestCase.java: 
> 133)
>
> Test: testSetGetClearSelectedPathClass:  
> javax.swing.MenuSelectionManagerTestjava.lang.OutOfMemoryError:  
> Failed to create new thread
> 	at java.lang.Thread.start(Unknown Source)
> 	at javax.swing.BasicSwingTestCase.runBare(BasicSwingTestCase.java: 
> 133)
>
> Test: testSetSelectedPathClass:  
> javax.swing.MenuSelectionManagerTestjava.lang.OutOfMemoryError:  
> Failed to create new thread
> 	at java.lang.Thread.start(Unknown Source)
> 	at javax.swing.BasicSwingTestCase.runBare(BasicSwingTestCase.java: 
> 133)
>
> Test: testGetPreferredLayoutSizeClass:  
> javax.swing.ScrollPaneLayoutTestjava.lang.OutOfMemoryError: Failed  
> to create new thread
> 	at java.lang.Thread.start(Unknown Source)
> 	at javax.swing.BasicSwingTestCase.runBare(BasicSwingTestCase.java: 
> 133)
>
> Test: testDefaultLayoutClass:  
> javax.swing.ScrollPaneLayoutTestjava.lang.OutOfMemoryError: Failed  
> to create new thread
> 	at java.lang.Thread.start(Unknown Source)
> 	at javax.swing.BasicSwingTestCase.runBare(BasicSwingTestCase.java: 
> 133)
>
> Test: testSetHorizontalPolicyClass:  
> javax.swing.ScrollPaneLayoutTestjava.lang.OutOfMemoryError: Failed  
> to create new thread
> 	at java.lang.Thread.start(Unknown Source)
> 	at javax.swing.BasicSwingTestCase.runBare(BasicSwingTestCase.java: 
> 133)
>
> Test: testSetVerticalPolicyClass:  
> javax.swing.ScrollPaneLayoutTestjava.lang.OutOfMemoryError: Failed  
> to create new thread
> 	at java.lang.Thread.start(Unknown Source)
> 	at javax.swing.BasicSwingTestCase.runBare(BasicSwingTestCase.java: 
> 133)
>
> Test: testGetViewportClass:  
> javax.swing.ScrollPaneLayoutTestjava.lang.OutOfMemoryError: Failed  
> to create new thread
> 	at java.lang.Thread.start(Unknown Source)
> 	at javax.swing.BasicSwingTestCase.runBare(BasicSwingTestCase.java: 
> 133)
>
> Test: testGetHorizontalScrollbarClass:  
> javax.swing.ScrollPaneLayoutTestjava.lang.OutOfMemoryError: Failed  
> to create new thread
> 	at java.lang.Thread.start(Unknown Source)
> 	at javax.swing.BasicSwingTestCase.runBare(BasicSwingTestCase.java: 
> 133)
>
> Test: testGetVerticalScrollbarClass:  
> javax.swing.ScrollPaneLayoutTestjava.lang.OutOfMemoryError: Failed  
> to create new thread
> 	at java.lang.Thread.start(Unknown Source)
> 	at javax.swing.BasicSwingTestCase.runBare(BasicSwingTestCase.java: 
> 133)
>
> Test: testGetCornerClass:  
> javax.swing.ScrollPaneLayoutTestjava.lang.OutOfMemoryError: Failed  
> to create new thread
> 	at java.lang.Thread.start(Unknown Source)
> 	at javax.swing.BasicSwingTestCase.runBare(BasicSwingTestCase.java: 
> 133)
>
> Test: testGetRowHeaderClass:  
> javax.swing.ScrollPaneLayoutTestjava.lang.OutOfMemoryError: Failed  
> to create new thread
> 	at java.lang.Thread.start(Unknown Source)
> 	at javax.swing.BasicSwingTestCase.runBare(BasicSwingTestCase.java: 
> 133)
>
> Test: testGetColumnHeaderClass:  
> javax.swing.ScrollPaneLayoutTestjava.lang.OutOfMemoryError: Failed  
> to create new thread
> 	at java.lang.Thread.start(Unknown Source)
> 	at javax.swing.BasicSwingTestCase.runBare(BasicSwingTestCase.java: 
> 133)
>
> Test: testSyncWithScrollPaneClass:  
> javax.swing.ScrollPaneLayoutTestjava.lang.OutOfMemoryError: Failed  
> to create new thread
> 	at java.lang.Thread.start(Unknown Source)
> 	at javax.swing.BasicSwingTestCase.runBare(BasicSwingTestCase.java: 
> 133)
>
> Test: testGetViewportBorderBoundsClass:  
> javax.swing.ScrollPaneLayoutTestjava.lang.OutOfMemoryError: Failed  
> to create new thread
> 	at java.lang.Thread.start(Unknown Source)
> 	at javax.swing.BasicSwingTestCase.runBare(BasicSwingTestCase.java: 
> 133)
>
> Test: testRemoveLayoutComponentClass:  
> javax.swing.ScrollPaneLayoutTestjava.lang.OutOfMemoryError: Failed  
> to create new thread
> 	at java.lang.Thread.start(Unknown Source)
> 	at javax.swing.BasicSwingTestCase.runBare(BasicSwingTestCase.java: 
> 133)
>
> Test: testAddSingletonLayoutComponentClass:  
> javax.swing.ScrollPaneLayoutTestjava.lang.OutOfMemoryError: Failed  
> to create new thread
> 	at java.lang.Thread.start(Unknown Source)
> 	at javax.swing.BasicSwingTestCase.runBare(BasicSwingTestCase.java: 
> 133)
>
> Test: testMinimumLayoutSizeClass:  
> javax.swing.ScrollPaneLayoutTestjava.lang.OutOfMemoryError: Failed  
> to create new thread
> 	at java.lang.Thread.start(Unknown Source)
> 	at javax.swing.BasicSwingTestCase.runBare(BasicSwingTestCase.java: 
> 133)
>
> Test: testSizeRequirementsintintintfloatClass:  
> javax.swing.SizeRequirementsTestjava.lang.OutOfMemoryError: Failed  
> to create new thread
> 	at java.lang.Thread.start(Unknown Source)
> 	at javax.swing.BasicSwingTestCase.runBare(BasicSwingTestCase.java: 
> 133)
>
> Test: testSizeRequirementsfloatClass:  
> javax.swing.SizeRequirementsTestjava.lang.OutOfMemoryError: Failed  
> to create new thread
> 	at java.lang.Thread.start(Unknown Source)
> 	at javax.swing.BasicSwingTestCase.runBare(BasicSwingTestCase.java: 
> 133)
>
> Test: testSizeRequirementsClass:  
> javax.swing.SizeRequirementsTestjava.lang.OutOfMemoryError: Failed  
> to create new thread
> 	at java.lang.Thread.start(Unknown Source)
> 	at javax.swing.BasicSwingTestCase.runBare(BasicSwingTestCase.java: 
> 133)
>
> Test: testToStringClass:  
> javax.swing.SizeRequirementsTestjava.lang.OutOfMemoryError: Failed  
> to create new thread
> 	at java.lang.Thread.start(Unknown Source)
> 	at javax.swing.BasicSwingTestCase.runBare(BasicSwingTestCase.java: 
> 133)
>
> Test: testGetTiledSizeRequirementsClass:  
> javax.swing.SizeRequirementsTestjunit.framework.AssertionFailedError:  
> Test interrupted due timeout
> 	at javax.swing.BasicSwingTestCase.runBare(BasicSwingTestCase.java: 
> 147)
>
> Test: testGetAlignedSizeRequirementsClass:  
> javax.swing.SizeRequirementsTestjunit.framework.AssertionFailedError:  
> Test interrupted due timeout
> 	at javax.swing.BasicSwingTestCase.runBare(BasicSwingTestCase.java: 
> 147)
>
> Test:  
> testCalculateTiledPositionsintSizeRequirementsSizeRequirementsArrayint 
> ArrayintArraybooleanClass:  
> javax.swing.SizeRequirementsTestjunit.framework.AssertionFailedError:  
> Test interrupted due timeout
> 	at javax.swing.BasicSwingTestCase.runBare(BasicSwingTestCase.java: 
> 147)
>
> Test:  
> testCalculateTiledPositionsintSizeRequirementsSizeRequirementsArrayint 
> ArrayintArrayClass:  
> javax.swing.SizeRequirementsTestjunit.framework.AssertionFailedError:  
> Test interrupted due timeout
> 	at javax.swing.BasicSwingTestCase.runBare(BasicSwingTestCase.java: 
> 147)
>
> Test:  
> testCalculateAlignedPositionsintSizeRequirementsSizeRequirementsArrayi 
> ntArrayintArraybooleanClass:  
> javax.swing.SizeRequirementsTestjunit.framework.AssertionFailedError:  
> Test interrupted due timeout
> 	at javax.swing.BasicSwingTestCase.runBare(BasicSwingTestCase.java: 
> 147)
>
> Test:  
> testCalculateAlignedPositionsintSizeRequirementsSizeRequirementsArrayi 
> ntArrayintArrayClass:  
> javax.swing.SizeRequirementsTestjunit.framework.AssertionFailedError:  
> Test interrupted due timeout
> 	at javax.swing.BasicSwingTestCase.runBare(BasicSwingTestCase.java: 
> 147)
>
> Test: testAdjustSizesClass:  
> javax.swing.SizeRequirementsTestjunit.framework.AssertionFailedError:  
> Test interrupted due timeout
> 	at javax.swing.BasicSwingTestCase.runBare(BasicSwingTestCase.java: 
> 147)
>
> Test: testWriteObjectClass:  
> javax.swing.SizeRequirementsTestjunit.framework.AssertionFailedError:  
> Test interrupted due timeout
> 	at javax.swing.BasicSwingTestCase.runBare(BasicSwingTestCase.java: 
> 147)
>
> Test: testReadObjectClass:  
> javax.swing.SizeRequirementsTestjunit.framework.AssertionFailedError:  
> Test interrupted due timeout
> 	at javax.swing.BasicSwingTestCase.runBare(BasicSwingTestCase.java: 
> 147)
>
> Test: testSpringLayoutClass:  
> javax.swing.SpringLayoutTestjunit.framework.AssertionFailedError:  
> Test interrupted due timeout
> 	at javax.swing.BasicSwingTestCase.runBare(BasicSwingTestCase.java: 
> 147)
>
> Test: testRemoveLayoutComponentClass:  
> javax.swing.SpringLayoutTestjunit.framework.AssertionFailedError:  
> Test interrupted due timeout
> 	at javax.swing.BasicSwingTestCase.runBare(BasicSwingTestCase.java: 
> 147)
>
> Test: testGetLayoutAlignmentXClass:  
> javax.swing.SpringLayoutTestjunit.framework.AssertionFailedError:  
> Test interrupted due timeout
> 	at javax.swing.BasicSwingTestCase.runBare(BasicSwingTestCase.java: 
> 147)
>
> Test: testGetLayoutAlignmentYClass:  
> javax.swing.SpringLayoutTestjunit.framework.AssertionFailedError:  
> Test interrupted due timeout
> 	at javax.swing.BasicSwingTestCase.runBare(BasicSwingTestCase.java: 
> 147)
>
> Test: testGetConstraints_ForComponentClass:  
> javax.swing.SpringLayoutTestjunit.framework.AssertionFailedError:  
> Test interrupted due timeout
> 	at javax.swing.BasicSwingTestCase.runBare(BasicSwingTestCase.java: 
> 147)
>
> Test: testTimerClass:  
> javax.swing.TimerTestjunit.framework.AssertionFailedError: Test  
> interrupted due timeout
> 	at javax.swing.BasicSwingTestCase.runBare(BasicSwingTestCase.java: 
> 147)
>
> Test: testGetListenersClass:  
> javax.swing.TimerTestjunit.framework.AssertionFailedError: Test  
> interrupted due timeout
> 	at javax.swing.BasicSwingTestCase.runBare(BasicSwingTestCase.java: 
> 147)
>
> Test: testRemoveActionListenerClass:  
> javax.swing.TimerTestjunit.framework.AssertionFailedError: Test  
> interrupted due timeout
> 	at javax.swing.BasicSwingTestCase.runBare(BasicSwingTestCase.java: 
> 147)
>
> Test: testAddActionListenerClass:  
> javax.swing.TimerTestjunit.framework.AssertionFailedError: Test  
> interrupted due timeout
> 	at javax.swing.BasicSwingTestCase.runBare(BasicSwingTestCase.java: 
> 147)
>
> Test: testGetActionListenersClass:  
> javax.swing.TimerTestjunit.framework.AssertionFailedError: Test  
> interrupted due timeout
> 	at javax.swing.BasicSwingTestCase.runBare(BasicSwingTestCase.java: 
> 147)
>
> Test: testIsRepeatsClass:  
> javax.swing.TimerTestjunit.framework.AssertionFailedError: Test  
> interrupted due timeout
> 	at javax.swing.BasicSwingTestCase.runBare(BasicSwingTestCase.java: 
> 147)
>
> Test: testSetCoalesceClass:  
> javax.swing.TimerTestjunit.framework.AssertionFailedError: Test  
> interrupted due timeout
> 	at javax.swing.BasicSwingTestCase.runBare(BasicSwingTestCase.java: 
> 147)
>
> Test: testIsCoalesceClass:  
> javax.swing.TimerTestjunit.framework.AssertionFailedError: Test  
> interrupted due timeout
> 	at javax.swing.BasicSwingTestCase.runBare(BasicSwingTestCase.java: 
> 147)
>
> Test: testGetInitialDelayClass:  
> javax.swing.TimerTestjunit.framework.AssertionFailedError: Test  
> interrupted due timeout
> 	at javax.swing.BasicSwingTestCase.runBare(BasicSwingTestCase.java: 
> 147)
>
> Test: testGetDelayClass:  
> javax.swing.TimerTestjunit.framework.AssertionFailedError: Test  
> interrupted due timeout
> 	at javax.swing.BasicSwingTestCase.runBare(BasicSwingTestCase.java: 
> 147)
>
> Test: testGetLogTimersClass:  
> javax.swing.TimerTestjunit.framework.AssertionFailedError: Test  
> interrupted due timeout
> 	at javax.swing.BasicSwingTestCase.runBare(BasicSwingTestCase.java: 
> 147)
>
> Test: test_hashCodeClass:  
> org.apache.harmony.text.tests.java.text.DateFormatSymbolsTestjunit.fra 
> mework.AssertionFailedError: hashCode() returned negative number
> 	at  
> org.apache.harmony.text.tests.java.text.DateFormatSymbolsTest.test_has 
> hCode(DateFormatSymbolsTest.java:198)
> 	at java.lang.reflect.VMReflection.invokeMethod(Native Method)
>
>
> ***********************************************************
> Modifications since last successful build:	(14)
>
> modified tellison  /harmony/enhanced/classlib/trunk/modules/luni/ 
> src/test/java/tests/api/java/net/AuthenticatorTest.java 12/29/2006  
> 14:35:41 Apply patch HARMONY-2413 ([luni]  
> java.net.Authenticator.getRequestorType returns null while RI  
> returns valid result)
> modified tellison  /harmony/enhanced/classlib/trunk/modules/luni/ 
> src/main/java/java/net/Authenticator.java 12/29/2006 14:35:41 Apply  
> patch HARMONY-2413 ([luni] java.net.Authenticator.getRequestorType  
> returns null while RI returns valid result)
> add cc-drlvm log20061229142926Lbuild.1 12/29/2006 14:29:26drlvm
> modified tellison  /harmony/enhanced/classlib/trunk/modules/luni/ 
> src/main/java/java/io/ObjectInputStream.java 12/29/2006 14:24:55  
> Fix for HARMONY-2402 ([classlib][luni]  
> java.io.ObjectInputStream.registerValidation throws  
> InvalidObjectException while RI throws NotActiveException)
> modified tellison  /harmony/enhanced/classlib/trunk/modules/luni/ 
> src/test/java/tests/api/java/io/ObjectInputStreamTest.java  
> 12/29/2006 14:24:55 Fix for HARMONY-2402 ([classlib][luni]  
> java.io.ObjectInputStream.registerValidation throws  
> InvalidObjectException while RI throws NotActiveException)
> add cc-classlib log20061229141933Lbuild.1 12/29/2006 14:19:33classlib
> modified tellison  /harmony/enhanced/classlib/trunk/modules/luni/ 
> src/test/java/tests/api/java/net/MulticastSocketTest.java  
> 12/29/2006 06:26:13 Apply regression test for HARMONY-2410  
> ([classlib][luni] java.net.MulticastSocket.setInterface 
> (InetAddress) doesn't throw SocketException)
> modified tellison  /harmony/enhanced/classlib/trunk/modules/luni/ 
> src/test/java/tests/api/java/net/URITest.java 12/29/2006 04:51:46  
> Tidy-up URITest.
> modified tellison  /harmony/enhanced/classlib/trunk/modules/luni/ 
> src/main/java/java/net/URI.java 12/29/2006 04:28:07 Apply patch  
> HARMONY-1693 ([classlib][net] compatibility: URI(4* null).getPath()  
> returns null on Harmony and empty string on RI)
> modified tellison  /harmony/enhanced/classlib/trunk/modules/luni/ 
> src/test/java/tests/api/java/net/URITest.java 12/29/2006 04:28:07  
> Apply patch HARMONY-1693 ([classlib][net] compatibility: URI(4*  
> null).getPath() returns null on Harmony and empty string on RI)
> modified varlax  /harmony/enhanced/drlvm/trunk/vm/jitrino/src/ 
> codegenerator/ia32/Ia32RegAlloc2.cpp 12/29/2006 01:31:59 Applied  
> HARMONY-2816 [drlvm][jit] Jitrino operand priority calculation in  
> bin pack register allocatorTested on SLES9
> modified varlax  /harmony/enhanced/drlvm/trunk/vm/jitrino/src/ 
> shared/ControlFlowGraph.h 12/29/2006 01:29:46 Applied HARMONY-2832  
> [drlvm][jitrino] Static profiler related fixesTested on SLES9
> modified varlax  /harmony/enhanced/drlvm/trunk/vm/jitrino/src/ 
> dynopt/StaticProfiler.cpp 12/29/2006 01:29:46 Applied HARMONY-2832  
> [drlvm][jitrino] Static profiler related fixesTested on SLES9
> modified varlax  /harmony/enhanced/drlvm/trunk/vm/port/src/lil/ 
> em64t/pim/lil_code_generator_em64t.cpp 12/29/2006 01:16:05 Applied  
> HARMONY-2899 [drlvm][em64t] VM doesn't support native methods with  
> big number of arguments.Tested on SLES9@x64
>


Mime
  • Unnamed multipart/alternative (inline, None, 0 bytes)
View raw message