harmony-dev mailing list archives

Site index · List index
Message view « Date » · « Thread »
Top « Date » · « Thread »
From "Alexei Zakharov" <alexei.zakha...@gmail.com>
Subject Re: [continuum] BUILD FAILURE: Classlib/linux.ia32 Build/Test
Date Sat, 23 Dec 2006 22:36:23 GMT
Hi all,

>      [exec]     [junit] Tests run: 4, Failures: 0, Errors: 0, Time elapsed: 0.006 sec
>      [exec]     [junit] Tests run: 3, Failures: 2, Errors: 0, Time elapsed: 65.551 sec
>      [exec]     [junit] TEST java.awt.KeyboardFocusManagerRTest FAILED
>      [exec]     [junit] Tests run: 11, Failures: 0, Errors: 0, Time elapsed: 0.018 sec

Can anyone reproduce this? All AWT tests pass on my WinXP system.

Thanks,

6/12/24, nomail@hursley.ibm.com <nomail@hursley.ibm.com>:
> Online report : http://people.apache.org/~hindessm/continuum/classlib/linux.ia32/2006/12/23/20061223-220931.failure.log.gz
> Build statistics:
>   State: Failed
>   Previous State: Failed
>   Started at: Sat, 23 Dec 2006 21:07:31 +0000
>   Finished at: Sat, 23 Dec 2006 22:09:28 +0000
>   Total time: 1h 1m 57s
>   Build Trigger: Schedule
>   Exit code: 1
>   Building machine hostname: hy2
>   Operating system : Linux(unknown)
>   Java version : 1.5.0_06(Sun Microsystems Inc.)
>
> Changes
>                             classlib/modules/awt/src/test/api/java/common/java/awt/KeyboardFocusManagerTest.java
>
> ****************************************************************************
> Output:
> ****************************************************************************
> Buildfile: build.xml
>
> build:
>    [delete] Deleting directory /home/hybld/continuum-working-directory/6/classlib/deploy
>      [echo] Classlib revision is 489926
>      [echo] Post process: true
>      [echo] JAPI: true
>      [echo] Building with reference jdk/javac
>      [exec] Buildfile: build.xml
>
>      [exec] -init-hdk-for-clean:
>      [exec]     [mkdir] Created dir: /home/hybld/continuum-working-directory/6/classlib/deploy/build/ant
>      [exec]      [copy] Copying 1 file to /home/hybld/continuum-working-directory/6/classlib/deploy/build/ant
>
>      [exec] clean-java:
>
>      [exec] -modules-clean-bin:
>
>      [exec] clean:
>      [exec]    [delete] Deleting 30 files from /home/hybld/continuum-working-directory/6/classlib/build/classes
>      [exec]    [delete] Deleting 12 files from /home/hybld/continuum-working-directory/6/classlib/modules/accessibility/bin/test
>
>      [exec] clean:
>      [exec]    [delete] Deleting 13 files from /home/hybld/continuum-working-directory/6/classlib/build/classes
>
>      [exec] clean:
>      [exec]    [delete] Deleting 35 files from /home/hybld/continuum-working-directory/6/classlib/build/classes
>      [exec]    [delete] Deleting 1 files from /home/hybld/continuum-working-directory/6/classlib/modules/applet/bin/test
>
>      [exec] clean:
>      [exec]    [delete] Deleting 78 files from /home/hybld/continuum-working-directory/6/classlib/build/classes
>      [exec]    [delete] Deleting 49 files from /home/hybld/continuum-working-directory/6/classlib/modules/archive/bin/test
>
>      [exec] clean-native-includes:
>      [exec]    [delete] /home/hybld/continuum-working-directory/6/classlib/deploy/include
not found.
>
>      [exec] clean:
>      [exec]    [delete] Deleting 113 files from /home/hybld/continuum-working-directory/6/classlib/build/classes
>      [exec]    [delete] Deleting 226 files from /home/hybld/continuum-working-directory/6/classlib/modules/auth/bin/test
>
>      [exec] clean:
>      [exec]    [delete] Deleting 901 files from /home/hybld/continuum-working-directory/6/classlib/build/classes
>      [exec]    [delete] Deleting 589 files from /home/hybld/continuum-working-directory/6/classlib/modules/awt/bin/test
>
>      [exec] clean:
>      [exec]    [delete] Deleting 107 files from /home/hybld/continuum-working-directory/6/classlib/build/classes
>      [exec]    [delete] Deleting 238 files from /home/hybld/continuum-working-directory/6/classlib/modules/beans/bin/test
>
>      [exec] clean:
>      [exec]    [delete] Deleting 125 files from /home/hybld/continuum-working-directory/6/classlib/build/classes
>      [exec]    [delete] /home/hybld/continuum-working-directory/6/classlib/modules/concurrent/bin/test
not found.
>
>      [exec] clean:
>      [exec]    [delete] Deleting 48 files from /home/hybld/continuum-working-directory/6/classlib/build/classes
>      [exec]    [delete] Deleting 91 files from /home/hybld/continuum-working-directory/6/classlib/modules/crypto/bin/test
>
>      [exec] clean:
>      [exec]    [delete] Deleting 87 files from /home/hybld/continuum-working-directory/6/classlib/build/classes
>
>      [exec] clean:
>      [exec]    [delete] Deleting 9 files from /home/hybld/continuum-working-directory/6/classlib/build/classes
>      [exec]    [delete] Deleting 20 files from /home/hybld/continuum-working-directory/6/classlib/modules/instrument/bin/test
>
>      [exec] clean:
>      [exec]    [delete] Deleting 154 files from /home/hybld/continuum-working-directory/6/classlib/build/classes
>      [exec]    [delete] Deleting 163 files from /home/hybld/continuum-working-directory/6/classlib/modules/jndi/bin/test
>
>      [exec] clean:
>      [exec]    [delete] Deleting 15 files from /home/hybld/continuum-working-directory/6/classlib/build/classes
>      [exec]    [delete] Deleting 2 files from /home/hybld/continuum-working-directory/6/classlib/modules/lang-management/bin/test
>
>      [exec] clean:
>      [exec]    [delete] Deleting 34 files from /home/hybld/continuum-working-directory/6/classlib/build/classes
>      [exec]    [delete] Deleting 99 files from /home/hybld/continuum-working-directory/6/classlib/modules/logging/bin/test
>
>      [exec] clean:
>      [exec]    [delete] Deleting 963 files from /home/hybld/continuum-working-directory/6/classlib/build/classes
>      [exec]    [delete] Deleting 896 files from /home/hybld/continuum-working-directory/6/classlib/modules/luni/bin/test
>
>      [exec] clean-native-includes:
>      [exec]    [delete] /home/hybld/continuum-working-directory/6/classlib/deploy/include
not found.
>      [exec]    [delete] /home/hybld/continuum-working-directory/6/classlib/deploy/jdk/include
not found.
>
>      [exec] clean:
>      [exec]    [delete] Deleting 29 files from /home/hybld/continuum-working-directory/6/classlib/build/classes
>
>      [exec] clean:
>      [exec]    [delete] Deleting 14 files from /home/hybld/continuum-working-directory/6/classlib/build/classes
>      [exec]    [delete] Deleting 25 files from /home/hybld/continuum-working-directory/6/classlib/modules/math/bin/test
>
>      [exec] clean:
>      [exec]    [delete] Deleting 14 files from /home/hybld/continuum-working-directory/6/classlib/build/classes
>      [exec]    [delete] Deleting 1 files from /home/hybld/continuum-working-directory/6/classlib/modules/misc/bin/test
>
>      [exec] clean:
>      [exec]    [delete] Deleting 146 files from /home/hybld/continuum-working-directory/6/classlib/build/classes
>      [exec]    [delete] Deleted 5 directories from /home/hybld/continuum-working-directory/6/classlib/build/classes
>      [exec]    [delete] Deleting 156 files from /home/hybld/continuum-working-directory/6/classlib/modules/nio/bin/test
>      [exec]    [delete] Deleted 19 directories from /home/hybld/continuum-working-directory/6/classlib/modules/nio/bin/test
>
>      [exec] clean:
>      [exec]    [delete] Deleting 20 files from /home/hybld/continuum-working-directory/6/classlib/build/classes
>      [exec]    [delete] Deleting 77 files from /home/hybld/continuum-working-directory/6/classlib/modules/nio_char/bin/test
>
>      [exec] clean:
>
>      [exec] clean-native-includes:
>      [exec]    [delete] /home/hybld/continuum-working-directory/6/classlib/deploy/include
not found.
>
>      [exec] clean:
>      [exec]    [delete] Deleting 32 files from /home/hybld/continuum-working-directory/6/classlib/build/classes
>      [exec]    [delete] Deleting 34 files from /home/hybld/continuum-working-directory/6/classlib/modules/prefs/bin/test
>
>      [exec] clean:
>      [exec]    [delete] Deleting 205 files from /home/hybld/continuum-working-directory/6/classlib/build/classes
>      [exec]    [delete] Deleting 60 files from /home/hybld/continuum-working-directory/6/classlib/modules/print/bin/test
>
>      [exec] clean:
>      [exec]    [delete] Deleting 177 files from /home/hybld/continuum-working-directory/6/classlib/build/classes
>      [exec]    [delete] Deleting 13 files from /home/hybld/continuum-working-directory/6/classlib/modules/regex/bin/test
>
>      [exec] clean:
>      [exec]    [delete] Deleting 230 files from /home/hybld/continuum-working-directory/6/classlib/build/classes
>      [exec]    [delete] Deleting 53 files from /home/hybld/continuum-working-directory/6/classlib/modules/rmi/bin/test
>
>      [exec] clean:
>      [exec]    [delete] Deleting 428 files from /home/hybld/continuum-working-directory/6/classlib/build/classes
>      [exec]    [delete] Deleting 616 files from /home/hybld/continuum-working-directory/6/classlib/modules/security/bin/test
>
>      [exec] clean:
>      [exec]    [delete] Deleting 2 files from /home/hybld/continuum-working-directory/6/classlib/build/classes
>
>      [exec] clean:
>      [exec]    [delete] Deleting 72 files from /home/hybld/continuum-working-directory/6/classlib/build/classes
>      [exec]    [delete] Deleting 53 files from /home/hybld/continuum-working-directory/6/classlib/modules/sound/bin/test
>
>      [exec] clean:
>      [exec]    [delete] Deleting 74 files from /home/hybld/continuum-working-directory/6/classlib/build/classes
>      [exec]    [delete] Deleting 54 files from /home/hybld/continuum-working-directory/6/classlib/modules/sql/bin/test
>
>      [exec] clean:
>      [exec]    [delete] Deleting 5 files from /home/hybld/continuum-working-directory/6/classlib/build/classes
>
>      [exec] clean:
>      [exec]    [delete] Deleting 1591 files from /home/hybld/continuum-working-directory/6/classlib/build/classes
>      [exec]    [delete] Deleting 1502 files from /home/hybld/continuum-working-directory/6/classlib/modules/swing/bin/test
>
>      [exec] clean:
>      [exec]    [delete] Deleting 40 files from /home/hybld/continuum-working-directory/6/classlib/build/classes
>      [exec]    [delete] Deleting 32 files from /home/hybld/continuum-working-directory/6/classlib/modules/text/bin/test
>
>      [exec] clean:
>      [exec]    [delete] Deleting 34 files from /home/hybld/continuum-working-directory/6/classlib/build/classes
>      [exec]    [delete] Deleting 4 files from /home/hybld/continuum-working-directory/6/classlib/modules/tools/bin/test
>
>      [exec] clean:
>      [exec]    [delete] Deleting 123 files from /home/hybld/continuum-working-directory/6/classlib/build/classes
>      [exec]    [delete] Deleting 54 files from /home/hybld/continuum-working-directory/6/classlib/modules/x-net/bin/test
>
>      [exec] -clean-bin-catch-all-test:
>
>      [exec] -clean-bin-catch-all:
>      [exec]    [delete] Deleted 305 directories from /home/hybld/continuum-working-directory/6/classlib/build/classes
>
>      [exec] -clean-bin:
>
>      [exec] -clean-layout:
>      [exec]    [delete] /home/hybld/continuum-working-directory/6/classlib/deploy/jdk
not found.
>
> ...
>
>      [exec]     [junit] Tests run: 2, Failures: 0, Errors: 0, Time elapsed: 0.198 sec
>      [exec]     [junit] Tests run: 5, Failures: 0, Errors: 0, Time elapsed: 0.034 sec
>      [exec]     [junit] Tests run: 4, Failures: 0, Errors: 0, Time elapsed: 0.006 sec
>      [exec]     [junit] Tests run: 3, Failures: 2, Errors: 0, Time elapsed: 65.551 sec
>      [exec]     [junit] TEST java.awt.KeyboardFocusManagerRTest FAILED
>      [exec]     [junit] Tests run: 11, Failures: 0, Errors: 0, Time elapsed: 0.018 sec
>      [exec]     [junit] Tests run: 7, Failures: 0, Errors: 0, Time elapsed: 0.005 sec
>      [exec]     [junit] Tests run: 1, Failures: 0, Errors: 0, Time elapsed: 0.003 sec
>      [exec]     [junit] Tests run: 4, Failures: 0, Errors: 0, Time elapsed: 0.009 sec
>      [exec]     [junit] Tests run: 4, Failures: 0, Errors: 0, Time elapsed: 0.004 sec
>
> ...
>
>      [exec]     [junit] Tests run: 2, Failures: 0, Errors: 0, Time elapsed: 0.005 sec
>      [exec]     [junit] Tests run: 1, Failures: 0, Errors: 0, Time elapsed: 0.106 sec
>      [exec]     [junit] Tests run: 2, Failures: 0, Errors: 0, Time elapsed: 0.005 sec
>      [exec]     [junit] Tests run: 1, Failures: 0, Errors: 0, Time elapsed: 0.004 sec
>      [exec]     [junit] Tests FAILED
>
>      [exec] touch-failures-file:
>
>      [exec] touch-errors-file:
>
>
> ...
>
>      [exec] gen-report:
>
>      [exec] check-test-result:
>
>      [exec] BUILD FAILED
>      [exec] /home/hybld/continuum-working-directory/6/classlib/build.xml:167: The following
error occurred while executing this line:
>      [exec] /home/hybld/continuum-working-directory/6/classlib/make/build-test.xml:139:
There were test failures.
>
>      [exec] Total time: 45 minutes 12 seconds
>      [exec] Result: 1
>      [echo] Tests.failed is set to true
>
> japi:
>
>      [exec] Processing class java.lang,Object:+
>      [exec] Processing package java.lang,:=========================================================================+-++++++++++++++++++++++++-+++++++++++++++++++++++++++++++++++++++++++++++++--^+^+++++++++--++++++++++
>
> ...
>
>      [exec] Processing package java.lang.management,:=========================================================================+++++++++++++++
>      [exec] Processing package java.lang.ref,:=========================================================================+++++
>      [exec] Processing package java.lang.reflect,:=========================================================================+++++++++++++++++++++
>      [exec] Processing class ,java:
>      [exec] Failed to Japize java: java.lang.RuntimeException: NoClassDefFoundError:
java
>      [exec] java.lang.RuntimeException: NoClassDefFoundError: java
>      [exec]     at net.wuffies.japi.ClassFile.forName(ClassFile.java:163)
>      [exec]     at net.wuffies.japi.Japize.getClassWrapper(Japize.java:1425)
>      [exec]     at net.wuffies.japi.Japize.japizeClass(Japize.java:748)
>      [exec]     at net.wuffies.japi.Japize.processClass(Japize.java:516)
>
> ...
>
>      [exec]     at net.wuffies.japi.Japize.doJapize(Japize.java:443)
>      [exec]     at net.wuffies.japi.Japize.main(Japize.java:316)
>
>      [exec] Processing class ,javax:
>      [exec] Failed to Japize javax: java.lang.RuntimeException: NoClassDefFoundError:
javax
>      [exec] java.lang.RuntimeException: NoClassDefFoundError: javax
>      [exec]     at net.wuffies.japi.ClassFile.forName(ClassFile.java:163)
>      [exec]     at net.wuffies.japi.Japize.getClassWrapper(Japize.java:1425)
>      [exec]     at net.wuffies.japi.Japize.japizeClass(Japize.java:748)
>      [exec]     at net.wuffies.japi.Japize.processClass(Japize.java:516)
>
> ...
>
>      [exec]     at net.wuffies.japi.Japize.doJapize(Japize.java:443)
>      [exec]     at net.wuffies.japi.Japize.main(Japize.java:316)
>
>      [exec] Processing class ,org:
>      [exec] Failed to Japize org: java.lang.RuntimeException: NoClassDefFoundError: org
>      [exec] java.lang.RuntimeException: NoClassDefFoundError: org
>      [exec]     at net.wuffies.japi.ClassFile.forName(ClassFile.java:163)
>      [exec]     at net.wuffies.japi.Japize.getClassWrapper(Japize.java:1425)
>      [exec]     at net.wuffies.japi.Japize.japizeClass(Japize.java:748)
>      [exec]     at net.wuffies.japi.Japize.processClass(Japize.java:516)
>
> ...
>
> update-index:
>
> test-result:
>
> BUILD FAILED
> /home/hybld/continuum-working-directory/6/build.xml:194: There were test failures.
>
> Total time: 61 minutes 56 seconds
>
> ****************************************************************************
>
> ...
>


-- 
Alexei Zakharov,
Intel ESSD

Mime
View raw message