harmony-dev mailing list archives

Site index · List index
Message view « Date » · « Thread »
Top « Date » · « Thread »
From "Elena Semukhina" <elena.semukh...@gmail.com>
Subject Re: [drlvm][build] problem to build drlvm
Date Mon, 20 Nov 2006 09:05:04 GMT
On 11/20/06, Vladimir Ivanov <ivavladimir@gmail.com> wrote:
>
> Today I can't build DRLVM. On my winXP it failed with log (below). Could
> somebody reproduce/ fix it?


Yes, I see this on Windows 2003 as well.

Thanks, Vladimir
>
> build.native.cpp:
>       [cc] 25 total files to be compiled.
>       [cc] cl : Command line warning D4025 : overriding '/Ox' with '/Od'
>       [cc] gc_metadata.cpp
>       [cc]
> c:\harmony.top\drlvm\trunk\vm\gc_gen\src\common\gc_metadata.h(24) : fatal
> error C1083: Cannot open include file: '../utils/vector_block.h'
> : No such file or directory
>       [cc] fspace_collect_forward.cpp
>       [cc]
>
> c:\harmony.top\drlvm\trunk\vm\gc_gen\src\thread\../common\gc_metadata.h(24)
> : fatal error C1083: Cannot open include file: '../utils/vecto
> r_block.h': No such file or directory
>       [cc] verify_live_heap.cpp
>       [cc] fspace_alloc.cpp
>       [cc]
>
> c:\harmony.top\drlvm\trunk\vm\gc_gen\src\thread\../common\gc_metadata.h(24)
> : fatal error C1083: Cannot open include file: '../utils/vecto
> r_block.h': No such file or directory
>       [cc] mspace.cpp
>       [cc]
>
> c:\harmony.top\drlvm\trunk\vm\gc_gen\src\thread\../common\gc_metadata.h(24)
> : fatal error C1083: Cannot open include file: '../utils/vecto
> r_block.h': No such file or directory
>       [cc] mark_scan_seq.cpp
>       [cc]
> c:\harmony.top\drlvm\trunk\vm\gc_gen\src\common\gc_metadata.h(24) : fatal
> error C1083: Cannot open include file: '../utils/vector_block.h'
> : No such file or directory
>       [cc] fspace_forward.cpp
>       [cc] fspace.cpp
>       [cc]
>
> c:\harmony.top\drlvm\trunk\vm\gc_gen\src\thread\../common\gc_metadata.h(24)
> : fatal error C1083: Cannot open include file: '../utils/vecto
> r_block.h': No such file or directory
>       [cc] mspace_collect_compact.cpp
>       [cc]
>
> c:\harmony.top\drlvm\trunk\vm\gc_gen\src\thread\../common\gc_metadata.h(24)
> : fatal error C1083: Cannot open include file: '../utils/vecto
> r_block.h': No such file or directory
>       [cc] fspace_collect_copy.cpp
>       [cc]
>
> c:\harmony.top\drlvm\trunk\vm\gc_gen\src\thread\../common\gc_metadata.h(24)
> : fatal error C1083: Cannot open include file: '../utils/vecto
> r_block.h': No such file or directory
>       [cc] interior_pointer.cpp
>       [cc] mutator.cpp
>       [cc]
>
> c:\harmony.top\drlvm\trunk\vm\gc_gen\src\thread\../common\gc_metadata.h(24)
> : fatal error C1083: Cannot open include file: '../utils/vecto
> r_block.h': No such file or directory
>       [cc] fspace_copy.cpp
>       [cc] gc_for_class.cpp
>       [cc] collector.cpp
>       [cc]
>
> c:\harmony.top\drlvm\trunk\vm\gc_gen\src\thread\../common\gc_metadata.h(24)
> : fatal error C1083: Cannot open include file: '../utils/vecto
> r_block.h': No such file or directory
>       [cc] lspace.cpp
>       [cc]
>
> c:\harmony.top\drlvm\trunk\vm\gc_gen\src\thread\../common\gc_metadata.h(24)
> : fatal error C1083: Cannot open include file: '../utils/vecto
> r_block.h': No such file or directory
>       [cc] mspace_alloc.cpp
>       [cc]
>
> c:\harmony.top\drlvm\trunk\vm\gc_gen\src\thread\../common\gc_metadata.h(24)
> : fatal error C1083: Cannot open include file: '../utils/vecto
> r_block.h': No such file or directory
>       [cc] gc_for_barrier.cpp
>       [cc]
>
> c:\harmony.top\drlvm\trunk\vm\gc_gen\src\thread\../common\gc_metadata.h(24)
> : fatal error C1083: Cannot open include file: '../utils/vecto
> r_block.h': No such file or directory
>       [cc] mutator_alloc.cpp
>       [cc]
>
> c:\harmony.top\drlvm\trunk\vm\gc_gen\src\thread\../common\gc_metadata.h(24)
> : fatal error C1083: Cannot open include file: '../utils/vecto
> r_block.h': No such file or directory
>       [cc] gc_common.cpp
>       [cc] Generating Code...
>       [cc] Compiling...
>       [cc] mspace_collect.cpp
>       [cc] collector_alloc.cpp
>       [cc]
>
> c:\harmony.top\drlvm\trunk\vm\gc_gen\src\thread\../common\gc_metadata.h(24)
> : fatal error C1083: Cannot open include file: '../utils/vecto
> r_block.h': No such file or directory
>       [cc] gc_for_vm.cpp
>       [cc]
>
> c:\harmony.top\drlvm\trunk\vm\gc_gen\src\thread\../common\gc_metadata.h(24)
> : fatal error C1083: Cannot open include file: '../utils/vecto
> r_block.h': No such file or directory
>       [cc] gen.cpp
>       [cc]
>
> c:\harmony.top\drlvm\trunk\vm\gc_gen\src\thread\../common\gc_metadata.h(24)
> : fatal error C1083: Cannot open include file: '../utils/vecto
> r_block.h': No such file or directory
>       [cc] mark_scan_par.cpp
>       [cc]
> c:\harmony.top\drlvm\trunk\vm\gc_gen\src\common\gc_metadata.h(24) : fatal
> error C1083: Cannot open include file: '../utils/vector_block.h'
> : No such file or directory
>       [cc] Generating Code...
>
> BUILD FAILED
> C:\harmony.top\drlvm\trunk\build\make\build.xml:428: The following error
> occurred while executing this line:
> C:\harmony.top\drlvm\trunk\build\make\build.xml:435: The following error
> occurred while executing this line:
> C:\harmony.top\drlvm\trunk\build\make\build_component.xml:72: The
> following
> error occurred while executing this line:
>
> C:\harmony.top\drlvm\trunk\build\win_ia32_msvc_debug\semis\build\targets\build.native.xml:75:
> cl failed with return code 2
>
>


-- 
Thanks,
Elena

Mime
  • Unnamed multipart/alternative (inline, None, 0 bytes)
View raw message