harmony-dev mailing list archives

Site index · List index
Message view « Date » · « Thread »
Top « Date » · « Thread »
From "Ivanov, Alexey A" <alexey.a.iva...@intel.com>
Subject RE: [classlib][awt] can anyone reproduce that? (was: [continuum] BUILD FAILURE: Classlib/linux.ia32 Build/Test)
Date Fri, 24 Nov 2006 15:19:25 GMT
I have no failures on SLES9. And it also passes on WinXP.

Regards,
--
Alexey A. Ivanov
Intel Enterprise Solutions Software Division


>-----Original Message-----
>From: Ivanov, Alexey A [mailto:alexey.a.ivanov@intel.com]
>Sent: Thursday, November 23, 2006 12:59 PM
>To: dev@harmony.apache.org
>Subject: RE: [classlib][awt] can anyone reproduce that? (was:
[continuum]
>BUILD FAILURE: Classlib/linux.ia32 Build/Test)
>
>Mikhail,
>
>This test didn't always fail on WinXP, but it did most of the time.
>I've tested it on SLES 9: the test failed neither before my patch nor
>after it.
>
>I will re-check it ASAP.
>
>
>Regards,
>--
>Alexey A. Ivanov
>Intel Enterprise Solutions Software Division
>
>
>>-----Original Message-----
>>From: Mikhail Loenko [mailto:mloenko@gmail.com]
>>Sent: Thursday, November 23, 2006 11:49 AM
>>To: dev@harmony.apache.org
>>Subject: [classlib][awt] can anyone reproduce that? (was: [continuum]
>BUILD
>>FAILURE: Classlib/linux.ia32 Build/Test)
>>
>>It's either an intermittent AWT failure or a failure disciovered (and
>>caused by)
>>my commit of HARMONY-2148 ([classlib][awt][test] unit test fails:
>>j.a.KeyboardFocusManagerRTest)
>>
>>I can not reproduce it on winXP and SLES 9
>>
>>Anyone see it?
>>
>>Thanks,
>>Mikhail

Mime
View raw message