harmony-dev mailing list archives

Site index · List index
Message view « Date » · « Thread »
Top « Date » · « Thread »
From Gregory Shimansky <gshiman...@gmail.com>
Subject Re: [continuum] BUILD FAILURE: Classlib/linux.ia32 Build/Test
Date Wed, 08 Nov 2006 19:33:51 GMT
Hello

I've seen the same failure of clean target several times. Does anyone know why 
it happens? When I run clean again, it usually succeeds. The failure is 100% 
reproducible, clean usually works, but sometimes finds some files which 
weren't deleted.

On Wednesday 08 November 2006 22:05 nomail@hursley.ibm.com wrote:
>      [exec] -clean-bin-catch-all:
>      [exec]    [delete] Deleting 1 files from
> /home/hybld/continuum-working-directory/6/classlib/build/classes [exec]   
> [delete] Deleted 299 directories from
> /home/hybld/continuum-working-directory/6/classlib/build/classes
>
>      [exec] BUILD FAILED
>      [exec]
> /home/hybld/continuum-working-directory/6/classlib/build.xml:123: The
> following error occurred while executing this line: [exec]
> /home/hybld/continuum-working-directory/6/classlib/make/build-java.xml:96:
> ...
>
>      [exec] Built files still exist after module clean targets have run. 
> This [exec] probably means that one or more patternsets are incomplete. 
> The [exec] remaining files are:
>
> ...
>
>      [exec]
> /home/hybld/continuum-working-directory/6/classlib/build/classes/org/apache
>/harmony/luni/util/NotYetImplementedException.class
>
>      [exec] Total time: 1 minute 53 seconds
>
> BUILD FAILED
> /home/hybld/continuum-working-directory/6/build.xml:114: exec returned: 1
>
> Total time: 1 minute 58 seconds
>
> ***************************************************************************
>*
>
> ...

-- 
Gregory Shimansky, Intel Middleware Products Division

Mime
View raw message