harmony-dev mailing list archives

Site index · List index
Message view « Date » · « Thread »
Top « Date » · « Thread »
From "Alexey Varlamov" <alexey.v.varla...@gmail.com>
Subject [classlib][build] Failed to build classlib on r454714
Date Tue, 10 Oct 2006 12:09:13 GMT
Got the following compilation error (SLES 9 gcc 3.3.3):

 build-native:
     [exec] cc -O1 -march=pentium3 -DLINUX -D_REENTRANT
-DIPv6_FUNCTION_SUPPORT -DHYX86  -I/e
xport/users2/avarlamo/linux.ia32/svn-repo/classlib/deploy/include
-I/export/users2/avarlamo/l
inux.ia32/svn-repo/classlib/deploy/jdk/include -I. -I../shared/ -fpic
-Icommon -I../shared//i nclude
-I/export/users2/avarlamo/linux.ia32/svn-repo/classlib/deploy/../depends/libs/build/lc
ms   -c -o ../shared//cmmxforms.o ../shared//cmmxforms.c
     [exec] ../shared/cmmxforms.c: In function `cmmCreateMultiprofileTransform':
     [exec] ../shared/cmmxforms.c:150: error: `cmsFLAGS_NOTCACHE'
undeclared (first use in th is function)
     [exec] ../shared/cmmxforms.c:150: error: (Each undeclared
identifier is reported only on ce
     [exec] ../shared/cmmxforms.c:150: error: for each function it appears in.)
     [exec] ../shared/cmmxforms.c:181: warning: passing arg 2 of
`cmsSample3DGrid' from incom patible pointer type
     [exec] make: *** [../shared//cmmxforms.o] Error 1

BUILD FAILED

---------------------------------------------------------------------
Terms of use : http://incubator.apache.org/harmony/mailing.html
To unsubscribe, e-mail: harmony-dev-unsubscribe@incubator.apache.org
For additional commands, e-mail: harmony-dev-help@incubator.apache.org


Mime
View raw message