harmony-dev mailing list archives

Site index · List index
Message view « Date » · « Thread »
Top « Date » · « Thread »
From "Elena Semukhina" <elena.semukh...@gmail.com>
Subject Re: [DRLVM] Thread Manager jvmti related issues fixes (was: Re: [jira] Commented: (HARMONY-1421))
Date Thu, 21 Sep 2006 08:21:32 GMT
Looking at ThreadTest failures I see that all 1421-related failures
disappear. But there are 3 new failures which I've never seen before. Two of
them actually relate to "using the launcher" problems, but the third one
deserves a special investigation.

The problem is that Thread.currentThread().isAlive() returns false now. Can
anyone comment on this?

Thanks,
Elena

On 9/21/06, Geir Magnusson Jr. <geir@pobox.com> wrote:
>
> I'm not paying much attention to the kernel tests these days while we
> sort out the main problems.
>
> I do think that once we sort out the "using the launcher" problems,
> and get the patch backlog applied, we really should go after all of
> these broken tests
>
> We also need to refractor the test framework so including/excluding a
> test doesn't require changing the test source code...
>
> geir
>
> On Sep 20, 2006, at 7:22 PM, Weldon Washburn wrote:
>
> > On 9/20/06, Geir Magnusson Jr. <geir@pobox.com> wrote:
> >>
> >> patch applied, JIRA closed
> >
> >
> > Good.  I was just about to suggest the very same thing.  I applied
> > both of
> > the 1421 patches and a substantial number of tests now run on
> > windows.  At
> > this time I see only the below test failures.  I commented out
> > gc.LOS test
> > because it still hangs.
> >
> >
> >    [junit] Test java.lang.ThreadGroupTest FAILED
> >    [junit] Test java.lang.ThreadGroupTest FAILED
> >     [echo]    **** FAILED on reference JRE ****
> >    [junit] Test java.lang.ThreadTest FAILED
> >    [junit] Test java.lang.ThreadTest FAILED
> >     [echo]    **** FAILED on reference JRE ****
> >     [echo] Kernel tests FAILED using jitrino.jet. Please find the
> > detailed
> > resu
> >
> >    [junit] Test java.lang.ClassAnnotationsTest FAILED
> >    [junit] Test java.lang.ClassAnnotationsTest FAILED
> >     [echo]    **** FAILED on reference JRE ****
> >    [junit] Test java.lang.ClassLoaderTest FAILED
> >    [junit] Test java.lang.ClassLoaderTest FAILED
> >     [echo]    **** FAILED on reference JRE ****
> >    [junit] Test java.lang.ThreadGroupTest FAILED
> >    [junit] Test java.lang.ThreadGroupTest FAILED
> >     [echo]    **** FAILED on reference JRE ****
> >    [junit] Test java.lang.ThreadTest FAILED
> >    [junit] Test java.lang.ThreadTest FAILED
> >     [echo]    **** FAILED on reference JRE ****
> >     [echo] Kernel tests FAILED using jitrino.opt. Please find the
> > detailed
> > resu
> >
> >    [junit] Test java.lang.ClassGenericsTest FAILED (timeout)
> >    [junit] Test java.lang.ClassGenericsTest FAILED
> >     [echo]    **** FAILED on reference JRE ****
> >    [junit] Test java.lang.ThreadGroupTest FAILED
> >    [junit] Test java.lang.ThreadGroupTest FAILED
> >     [echo]    **** FAILED on reference JRE ****
> >    [junit] Test java.lang.ThreadTest FAILED
> >    [junit] Test java.lang.ThreadTest FAILED
> >     [echo]    **** FAILED on reference JRE ****
> >     [echo] Kernel tests FAILED using interpreter. Please find the
> > detailed
> > resu
> >
> > geir
> >
> >
> > --
> > Weldon Washburn
> > Intel Middleware Products Division
>
>
> ---------------------------------------------------------------------
> Terms of use : http://incubator.apache.org/harmony/mailing.html
> To unsubscribe, e-mail: harmony-dev-unsubscribe@incubator.apache.org
> For additional commands, e-mail: harmony-dev-help@incubator.apache.org
>
>


-- 
Thanks,
Elena

Mime
  • Unnamed multipart/alternative (inline, None, 0 bytes)
View raw message