harmony-dev mailing list archives

Site index · List index
Message view « Date » · « Thread »
Top « Date » · « Thread »
From Spark Shen <smallsmallor...@gmail.com>
Subject [classlib][build] failure?
Date Tue, 19 Sep 2006 01:48:49 GMT
Hi All:
When building today's(Sep 19, r447671) classlib on window xp, I got the 
following error message:
     [exec] main.c
     [exec] ..\shared\main.c(628) : error C2220: warning treated as 
error - no o
bject file generated
     [exec] ..\shared\main.c(628) : warning C4101: 'jarRunner' : 
unreferenced lo
cal variable
     [exec] NMAKE : fatal error U1077: 'cl' : return code '0x2'
     [exec] Stop.
     [exec] NMAKE : fatal error U1077: '"c:\Program Files\Microsoft 
Visual Studi
o .NET 2003\VC7\BIN\nmake.exe"' : return code '0x2'
     [exec] Stop.

BUILD FAILED
C:\spark\harmony\build.xml:95: The following error occurred while 
executing this
 line:
C:\spark\harmony\make\build-native.xml:75: The following error occurred 
while ex
ecuting this line:
C:\spark\harmony\modules\luni\build.xml:167: The following error 
occurred while
executing this line:
C:\spark\harmony\make\properties.xml:258: exec returned: 2

Could any one check it?

Best regards

-- 
Spark Shen
China Software Development Lab, IBM


---------------------------------------------------------------------
Terms of use : http://incubator.apache.org/harmony/mailing.html
To unsubscribe, e-mail: harmony-dev-unsubscribe@incubator.apache.org
For additional commands, e-mail: harmony-dev-help@incubator.apache.org


Mime
View raw message