harmony-dev mailing list archives

Site index · List index
Message view « Date » · « Thread »
Top « Date » · « Thread »
From Mark Hindess <mark.hind...@googlemail.com>
Subject Re: [continuum] BUILD FAILURE: Classlib/linux.ia32 Build/Test
Date Fri, 15 Sep 2006 15:09:11 GMT

Oops.  This one was my fault should be fixed in r446628.
-Mark.

On 15 September 2006 at 16:03, Apache Harmony Build <nomail@hursley.ibm.com> wrote:
> Online report : http://ibmonly.hursley.ibm.com/continuum/linux.ia32/servlet=
> /continuum/target/ProjectBuild.vm/view/ProjectBuild/id/6/buildId/5637
> Build statistics:
>   State: Failed
>   Previous State: Failed
>   Started at: Fri, 15 Sep 2006 16:02:16 +0100
>   Finished at: Fri, 15 Sep 2006 16:03:20 +0100
>   Total time: 1m 4s
>   Build Trigger: Schedule
>   Exit code: 1
>   Building machine hostname: hy2
>   Operating system : Linux(unknown)
>   Java version : 1.5.0_06(Sun Microsystems Inc.)
> 
> Changes
>                             classlib/modules/awt/src/main/java/common/java/=
> awt/Image.java
>             classlib/modules/awt/src/main/java/common/java/awt/GraphicsEnvi=
> ronment.java
>             classlib/modules/awt/src/main/java/common/java/awt/dnd/DragSour=
> ce.java
>        =20
> ***************************************************************************=
> *
> Output:
> ***************************************************************************=
> *
> Buildfile: build.xml
> 
> build:
>    [delete] Deleting directory /home/hybld/continuum-working-directory/6/cl=
> asslib/deploy
>      [echo] Classlib revision is 446623
>      [echo] Post process: true
>      [echo] JAPI: true
>      [echo] Building with reference jdk/javac
>      [exec] Buildfile: build.xml
> 
>      [exec] clean:
> 
>      [exec] clean-bin:
> 
>      [exec] call-modules-all:
> 
>      [exec] clean:
>      [exec]    [delete] Excludesfile /home/hybld/continuum-working-director=
> y/6/classlib/deploy/build/patternsets/luni-kernel.txt not found.
> 
>      [exec] clean:
>      [exec]    [delete] Excludesfile /home/hybld/continuum-working-director=
> y/6/classlib/deploy/build/patternsets/luni-kernel.txt not found.
> 
>      [exec] clean:
>      [exec]    [delete] Excludesfile /home/hybld/continuum-working-director=
> y/6/classlib/deploy/build/patternsets/luni-kernel.txt not found.
> 
>      [exec] clean:
>      [exec]    [delete] Excludesfile /home/hybld/continuum-working-director=
> y/6/classlib/deploy/build/patternsets/luni-kernel.txt not found.
> 
>      [exec] clean.native.includes:
>      [exec]    [delete] /home/hybld/continuum-working-directory/6/classlib/=
> deploy/include not found.
> 
>      [exec] clean:
>      [exec]    [delete] Excludesfile /home/hybld/continuum-working-director=
> y/6/classlib/deploy/build/patternsets/luni-kernel.txt not found.
> 
>      [exec] clean:
>      [exec]    [delete] Excludesfile /home/hybld/continuum-working-director=
> y/6/classlib/deploy/build/patternsets/luni-kernel.txt not found.
> 
>      [exec] clean:
>      [exec]    [delete] Excludesfile /home/hybld/continuum-working-director=
> y/6/classlib/deploy/build/patternsets/luni-kernel.txt not found.
> 
>      [exec] clean:
>      [exec]    [delete] Excludesfile /home/hybld/continuum-working-director=
> y/6/classlib/deploy/build/patternsets/luni-kernel.txt not found.
>      [exec]    [delete] /home/hybld/continuum-working-directory/6/classlib/=
> modules/concurrent/bin/test not found.
> 
>      [exec] clean:
>      [exec]    [delete] Excludesfile /home/hybld/continuum-working-director=
> y/6/classlib/deploy/build/patternsets/luni-kernel.txt not found.
> 
>      [exec] clean:
>      [exec]    [delete] Excludesfile /home/hybld/continuum-working-director=
> y/6/classlib/deploy/build/patternsets/luni-kernel.txt not found.
> 
>      [exec] clean:
>      [exec]    [delete] Excludesfile /home/hybld/continuum-working-director=
> y/6/classlib/deploy/build/patternsets/luni-kernel.txt not found.
> 
>      [exec] clean:
>      [exec]    [delete] Excludesfile /home/hybld/continuum-working-director=
> y/6/classlib/deploy/build/patternsets/luni-kernel.txt not found.
> 
>      [exec] clean:
>      [exec]    [delete] Excludesfile /home/hybld/continuum-working-director=
> y/6/classlib/deploy/build/patternsets/luni-kernel.txt not found.
> 
>      [exec] clean:
> 
>      [exec] clean:
>      [exec]    [delete] Excludesfile /home/hybld/continuum-working-director=
> y/6/classlib/deploy/build/patternsets/luni-kernel.txt not found.
> 
>      [exec] clean.native.includes:
>      [exec]    [delete] /home/hybld/continuum-working-directory/6/classlib/=
> deploy/include not found.
>      [exec]    [delete] /home/hybld/continuum-working-directory/6/classlib/=
> deploy/jdk/include not found.
> 
>      [exec] clean:
>      [exec]    [delete] Excludesfile /home/hybld/continuum-working-director=
> y/6/classlib/deploy/build/patternsets/luni-kernel.txt not found.
> 
>      [exec] clean:
>      [exec]    [delete] Excludesfile /home/hybld/continuum-working-director=
> y/6/classlib/deploy/build/patternsets/luni-kernel.txt not found.
> 
>      [exec] clean:
>      [exec]    [delete] Excludesfile /home/hybld/continuum-working-director=
> y/6/classlib/deploy/build/patternsets/luni-kernel.txt not found.
>      [exec]    [delete] /home/hybld/continuum-working-directory/6/classlib/=
> modules/nio/bin/test not found.
> 
>      [exec] clean:
>      [exec]    [delete] Excludesfile /home/hybld/continuum-working-director=
> y/6/classlib/deploy/build/patternsets/luni-kernel.txt not found.
> 
>      [exec] clean:
>      [exec]    [delete] Excludesfile /home/hybld/continuum-working-director=
> y/6/classlib/deploy/build/patternsets/luni-kernel.txt not found.
> 
>      [exec] clean:
>      [exec]    [delete] Excludesfile /home/hybld/continuum-working-director=
> y/6/classlib/deploy/build/patternsets/luni-kernel.txt not found.
> 
>      [exec] clean:
>      [exec]    [delete] Excludesfile /home/hybld/continuum-working-director=
> y/6/classlib/deploy/build/patternsets/luni-kernel.txt not found.
> 
>      [exec] clean:
> 
>      [exec] clean:
>      [exec]    [delete] Excludesfile /home/hybld/continuum-working-director=
> y/6/classlib/deploy/build/patternsets/luni-kernel.txt not found.
> 
>      [exec] clean:
>      [exec]    [delete] Excludesfile /home/hybld/continuum-working-director=
> y/6/classlib/deploy/build/patternsets/luni-kernel.txt not found.
> 
>      [exec] clean:
>      [exec]    [delete] Excludesfile /home/hybld/continuum-working-director=
> y/6/classlib/deploy/build/patternsets/luni-kernel.txt not found.
> 
>      [exec] clean:
>      [exec]    [delete] Excludesfile /home/hybld/continuum-working-director=
> y/6/classlib/deploy/build/patternsets/luni-kernel.txt not found.
> 
>      [exec] clean:
>      [exec]    [delete] Excludesfile /home/hybld/continuum-working-director=
> y/6/classlib/deploy/build/patternsets/luni-kernel.txt not found.
> 
>      [exec] clean:
>      [exec]    [delete] Excludesfile /home/hybld/continuum-working-director=
> y/6/classlib/deploy/build/patternsets/luni-kernel.txt not found.
> 
>      [exec] clean:
>      [exec]    [delete] Excludesfile /home/hybld/continuum-working-director=
> y/6/classlib/deploy/build/patternsets/luni-kernel.txt not found.
> 
>      [exec] clean:
>      [exec]    [delete] Excludesfile /home/hybld/continuum-working-director=
> y/6/classlib/deploy/build/patternsets/luni-kernel.txt not found.
> 
>      [exec] call-modules-one:
> 
>      [exec] clean-kernel-patternsets:
>      [exec]    [delete] Deleting 727 files from /home/hybld/continuum-worki=
> ng-directory/6/classlib/build/classes
>      [exec]    [delete] Deleted 52 directories from /home/hybld/continuum-w=
> orking-directory/6/classlib/build/classes
> 
>      [exec] clean-layout:
>      [exec]    [delete] /home/hybld/continuum-working-directory/6/classlib/=
> deploy/jdk not found.
> 
>      [exec] clean:
> 
>      [exec] copy-makefile-includes:
>      [exec]     [mkdir] Created dir: /home/hybld/continuum-working-director=
> y/6/classlib/deploy/build/make
>      [exec]      [copy] Copying 4 files to /home/hybld/continuum-working-di=
> rectory/6/classlib/deploy/build/make
> 
>      [exec] -make-clean:
> 
>      [exec] clean.native:
>      [exec]      [exec] rm -f ../shared/auth_copyright.o authnix.o ../libhy=
> auth.so =20
> 
>      [exec] clean.native:
>      [exec]      [exec] rm -f ../shared/zcpool.o ../shared/zipalloc.o ../sh=
> ared/zipcache.o ../shared/zipsup.o   /home/hybld/continuum-working-director=
> y/6/classlib/deploy/lib/libhyzip.a
>      [exec]      [exec] rm -f ../shared/zlib_copyright.o ../../zlib_dist/ad=
> ler32.o ../../zlib_dist/compress.o ../../zlib_dist/crc32.o ../../zlib_dist/=
> deflate.o ../../zlib_dist/infback.o ../../zlib_dist/inffast.o ../../zlib_di=
> st/inflate.o ../../zlib_dist/inftrees.o ../../zlib_dist/trees.o ../../zlib_=
> dist/uncompr.o ../../zlib_dist/zutil.o ../libhyzlib.so =20
>      [exec]      [exec] rm -f ../shared/archive_copyright.o ../shared/jclcr=
> c32.o ../shared/zip.o ../shared/adler32.o ../shared/inflater.o ../shared/ja=
> rfile.o ../shared/deflater.o ../shared/archiveglob.o ../libhyarchive.so =20
> 
>      [exec] clean.native:
>      [exec]      [exec] rm -f ../shared/text_copyright.o ../shared/BidiWrap=
> per.o ../libhytext.so =20
> 
>      [exec] clean.native:
> 
>      [exec] clean.native:
>      [exec]      [exec] rm -f ../shared/hysig_copyright.o hysiglinux.o hysi=
> gunix.o ../libhysig.so =20
>      [exec]      [exec] rm -f ../shared/libglob.o ../shared/iohelp.o ../sha=
> red/exceptions.o ../shared/strhelp.o ../shared/utf8encode.o ../shared/utf8d=
> ecode.o   /home/hybld/continuum-working-directory/6/classlib/deploy/lib/lib=
> hycommon.a
>      [exec]      [exec] rm -f ../shared/pool.o ../shared/pool_cap.o   /home=
> /hybld/continuum-working-directory/6/classlib/deploy/lib/libhypool.a
>      [exec]      [exec] rm -f ../shared/thread_copyright.o x86/thrhelp.o x8=
> 6/thrspinlock.o hythread.o ../shared/hythreadinspect.o linuxonexit.o priori=
> ty.o rasthrsup.o ../shared/rwmutex.o thrcreate.o thrdsup.o ../shared/thrpro=
> f.o ../libhythr.so =20
>      [exec]      [exec] rm -f ../shared/port_copyright.o hycpu.o ../shared/=
> hyerror.o hyerrorhelpers.o ../shared/hyexit.o hyfile.o hyfiletext.o ../shar=
> ed/hygp.o hyipcmutex.o hymem.o hymmap.o ../shared/hynls.o hynlshelpers.o hy=
> osdump.o ../shared/hyport.o ../shared/hyportcontrol.o hyportptb.o hysharedh=
> elper.o hyshmem.o hyshsem.o hysignal.o hysl.o hysock.o ../shared/hystr.o ..=
> /shared/hystrftime.o ../shared/hystsl.o hysysinfo.o hytime.o ../shared/hytl=
> shelpers.o hytty.o hyvmem.o ../libhyprt.so  /home/hybld/continuum-working-d=
> irectory/6/classlib/deploy/lib/libhyprt.a
>      [exec]      [exec] rm -f ../../fdlibm_dist/e_acos.o ../../fdlibm_dist/=
> e_acosh.o ../../fdlibm_dist/e_asin.o ../../fdlibm_dist/e_atan2.o ../../fdli=
> bm_dist/e_atanh.o ../../fdlibm_dist/e_cosh.o ../../fdlibm_dist/e_exp.o ../.=
> ./fdlibm_dist/e_fmod.o ../../fdlibm_dist/e_gamma.o ../../fdlibm_dist/e_gamm=
> a_r.o ../../fdlibm_dist/e_hypot.o ../../fdlibm_dist/e_j0.o ../../fdlibm_dis=
> t/e_j1.o ../../fdlibm_dist/e_jn.o ../../fdlibm_dist/e_lgamma.o ../../fdlibm=
> _dist/e_lgamma_r.o ../../fdlibm_dist/e_log.o ../../fdlibm_dist/e_log10.o ..=
> /../fdlibm_dist/e_pow.o ../../fdlibm_dist/e_rem_pio2.o ../../fdlibm_dist/e_=
> remainder.o ../../fdlibm_dist/e_scalb.o ../../fdlibm_dist/e_sinh.o ../../fd=
> libm_dist/e_sqrt.o ../../fdlibm_dist/k_cos.o ../../fdlibm_dist/k_rem_pio2.o=
>  ../../fdlibm_dist/k_sin.o ../../fdlibm_dist/k_standard.o ../../fdlibm_dist=
> /k_tan.o ../../fdlibm_dist/s_asinh.o ../../fdlibm_dist/s_atan.o ../../fdlib=
> m_dist/s_cbrt.o ../../fdlibm_dist/s_ceil.o ../../fdlibm_dist/s_copysign.o .=
> ./../fdlibm_dist/s_cos.o ../../fdlibm_dist/s_erf.o ../../fdlibm_dist/s_expm=
> 1.o ../../fdlibm_dist/s_fabs.o ../../fdlibm_dist/s_finite.o ../../fdlibm_di=
> st/s_floor.o ../../fdlibm_dist/s_frexp.o ../../fdlibm_dist/s_ilogb.o ../../=
> fdlibm_dist/s_isnan.o ../../fdlibm_dist/s_ldexp.o ../shared/s_lib_version.o=
>  ../../fdlibm_dist/s_log1p.o ../../fdlibm_dist/s_logb.o ../../fdlibm_dist/s=
> _matherr.o ../../fdlibm_dist/s_modf.o ../../fdlibm_dist/s_nextafter.o ../..=
> /fdlibm_dist/s_rint.o ../../fdlibm_dist/s_scalbn.o ../../fdlibm_dist/s_sign=
> gam.o ../../fdlibm_dist/s_significand.o ../../fdlibm_dist/s_sin.o ../../fdl=
> ibm_dist/s_tan.o ../../fdlibm_dist/s_tanh.o ../../fdlibm_dist/w_acos.o ../.=
> ./fdlibm_dist/w_acosh.o ../../fdlibm_dist/w_asin.o ../../fdlibm_dist/w_atan=
> 2.o ../../fdlibm_dist/w_atanh.o ../../fdlibm_dist/w_cosh.o ../../fdlibm_dis=
> t/w_exp.o ../../fdlibm_dist/w_fmod.o ../../fdlibm_dist/w_gamma.o ../../fdli=
> bm_dist/w_gamma_r.o ../../fdlibm_dist/w_hypot.o ../../fdlibm_dist/w_j0.o ..=
> /../fdlibm_dist/w_j1.o ../../fdlibm_dist/w_jn.o ../../fdlibm_dist/w_lgamma.=
> o ../../fdlibm_dist/w_lgamma_r.o ../../fdlibm_dist/w_log.o ../../fdlibm_dis=
> t/w_log10.o ../../fdlibm_dist/w_pow.o ../../fdlibm_dist/w_remainder.o ../..=
> /fdlibm_dist/w_scalb.o ../../fdlibm_dist/w_sinh.o ../../fdlibm_dist/w_sqrt.=
> o   /home/hybld/continuum-working-directory/6/classlib/deploy/lib/libhyfdli=
> bm.a
>      [exec]      [exec] rm -f ../shared/vmi_copyright.o ../shared/vmi.o ../=
> libvmi.so =20
>      [exec]      [exec] rm -f ../shared/luni_copyright.o ../shared/file.o p=
> rocimpl.o ../shared/oos.o ../shared/nethelp.o ../shared/floatbits.o ../shar=
> ed/ois.o helpers.o ../shared/math.o ../shared/luniglob.o ../shared/proxy.o =
> ../shared/cbigint.o ../shared/dblparse.o ../shared/fltparse.o ../shared/net=
> if.o ../shared/process.o ../shared/bigint.o ../shared/osc.o ../shared/socke=
> t.o ../shared/inetadds.o ../shared/filedesc.o ../shared/timezone.o ../share=
> d/OSFileSystem.o OSFileSystemLinux32.o OSMemory.o OSMemoryLinux32.o ../shar=
> ed/OSNetworkSystem.o OSNetworkSystemLinux.o hyenv.o ../libhyluni.so =20
>      [exec]      [exec] rm -f ../shared/vmls.o   /home/hybld/continuum-work=
> ing-directory/6/classlib/deploy/lib/libhyvmls.a
>      [exec]      [exec] rm -f ../shared/main.o ../shared/cmain.o ../shared/=
> launcher_copyright.o ../shared/strbuf.o ../shared/libhlp.o    ../java=20
> 
>      [exec] clean.native:
>      [exec]      [exec] rm -f ../shared/DirectBufferUtil.o ../shared/Addres=
> sUtil.o  ../libhynio.so =20
> 
>      [exec] clean.native:
>      [exec]      [exec] rm -f ../shared/org_apache_harmony_misc_accessors_A=
> rrayAccessorImpl.o ../shared/org_apache_harmony_misc_accessors_Malloc.o ../=
> shared/org_apache_harmony_misc_accessors_MemoryAccessorNativeImpl.o ../shar=
> ed/org_apache_harmony_misc_accessors_ObjectAccessorImpl.o ../shared/org_apa=
> che_harmony_misc_accessors_StringAccessorImpl.o ../libaccessors.so =20
> 
>      [exec] -clean.native.linux:
>      [exec]      [exec] rm -f org_apache_harmony_awt_nativebridge_linux_Err=
> orHandler.o org_apache_harmony_awt_nativebridge_linux_GLX.o org_apache_harm=
> ony_awt_nativebridge_linux_X11.o org_apache_harmony_awt_nativebridge_linux_=
> Xft.o ../libX11Wrapper.so =20
>      [exec]      [exec] rm -f LinuxNativeFont.o ../liblinuxfont.so =20
> 
>      [exec] -clean.native.windows:
> 
>      [exec] clean.native:
>      [exec]      [exec] rm -f ../shared//cmmerror.o ../shared//cmmio.o ../s=
> hared//cmmxforms.o ../shared//NativeCMM.o ../shared//NativeImageFormat.o li=
> blcms.a ../liblcmm.so =20
>      [exec]      [exec] rm -f ../shared//JpegDecoder.o libjpeg.a ../libjpeg=
> decoder.so =20
>      [exec]      [exec] rm -f ../shared//blitter.o ../shared//gifdecoder.o =
> ../shared//LUTTables.o ../shared//pngdecoder.o ../shared//SurfaceDataStruct=
> ure.o libpng.a ../libgl.so =20
> 
>      [exec] clean.native:
> 
>      [exec] clean.native:
>      [exec]      [exec] rm -f ../shared/instrument.o ../shared/inst_agt.o  =
> ../libhyinstrument.so =20
> 
>      [exec] clean-makefile-includes:
>      [exec]    [delete] Deleting directory /home/hybld/continuum-working-di=
> rectory/6/classlib/deploy/build/make
> 
>      [exec] make-clean:
> 
>      [exec] clean-includes:
> 
>      [exec] clean.native.includes:
>      [exec]    [delete] /home/hybld/continuum-working-directory/6/classlib/=
> deploy/include not found.
> 
>      [exec] clean.native.includes:
>      [exec]    [delete] /home/hybld/continuum-working-directory/6/classlib/=
> deploy/include not found.
>      [exec]    [delete] /home/hybld/continuum-working-directory/6/classlib/=
> deploy/jdk/include not found.
> 
>      [exec] clean-overlay-oss:
> 
>      [exec] clean-overlay-oss:
> 
>      [exec] clean-overlay-oss:
> 
>      [exec] clean-overlay-oss:
> 
>      [exec] clean-layout:
>      [exec]    [delete] /home/hybld/continuum-working-directory/6/classlib/=
> deploy/jdk not found.
> 
>      [exec] clean:
> 
>      [exec] build:
>      [exec]      [echo]=20
>      [exec]      [echo] =3D=3D=3D=3D=3D=3D=3D=3D=3D=3D=3D=3D=3D=3D=3D=3D=3D=
> =3D=3D=3D=3D=3D=3D=3D=3D=3D=3D=3D=3D=3D=3D=3D=3D=3D=3D=3D=3D=3D=3D=3D
>      [exec]      [echo] Building Java component archives...
>      [exec]      [echo] =3D=3D=3D=3D=3D=3D=3D=3D=3D=3D=3D=3D=3D=3D=3D=3D=3D=
> =3D=3D=3D=3D=3D=3D=3D=3D=3D=3D=3D=3D=3D=3D=3D=3D=3D=3D=3D=3D=3D=3D=3D
> 
>      [exec] copy-kernel-patternsets:
>      [exec]     [mkdir] Created dir: /home/hybld/continuum-working-director=
> y/6/classlib/deploy/build/patternsets
>      [exec]      [copy] Copying 1 file to /home/hybld/continuum-working-dir=
> ectory/6/classlib/deploy/build/patternsets
>      [exec]      [copy] Copying 1 file to /home/hybld/continuum-working-dir=
> ectory/6/classlib/deploy/build/patternsets
> 
>      [exec] prepare-depends:
> 
>      [exec] check:
>      [exec]      [echo] Checking for depends/jars/yoko/yoko.jar
>      [exec]      [echo] Checking for depends/jars/xalan-j_2.7.0/xalan.jar
>      [exec]      [echo] Checking for depends/jars/xerces_2.8.0/resolver.jar
>      [exec]      [echo] Checking for depends/jars/xerces_2.8.0/xercesImpl.j=
> ar
>      [exec]      [echo] Checking for depends/jars/xerces_2.8.0/xml-apis.jar
>      [exec]      [echo] Checking for depends/jars/junit_3.8.2/junit.jar
>      [exec]      [echo] Checking for depends/jars/bcprov-jdk14-133/signed.b=
> cprov.jar
>      [exec]      [echo] Checking for depends/jars/icu4j_3.4.4/icu4j_3_4_4.j=
> ar
>      [exec]      [echo] Checking for depends/jars/mx4j_3.0.1/mx4j.jar
>      [exec]      [echo] Checking for depends/jars/mx4j_3.0.1/mx4j-remote.ja=
> r
>      [exec]      [echo] Checking for depends/jars/ecj_3.2/ecj_3.2.jar
> 
>      [exec] create-unsigned-bcprov-jar:
> 
>      [exec] check-win:
> 
>      [exec] compile:
>      [exec]     [mkdir] Created dir: /home/hybld/continuum-working-director=
> y/6/classlib/build/classes
>      [exec]     [javac] Compiling 3144 source files to /home/hybld/continuu=
> m-working-directory/6/classlib/build/classes
>      [exec]     [javac] /home/hybld/continuum-working-directory/6/classlib/=
> modules/math/src/main/java/java/math/Division.java:41: warning: unmappable =
> character for encoding ASCII
>      [exec]     [javac]  * @author Instituto Tecnol?gico de C?rdoba
>      [exec]     [javac]                            ^
>      [exec]     [javac] /home/hybld/continuum-working-directory/6/classlib/=
> modules/math/src/main/java/java/math/Division.java:41: warning: unmappable =
> character for encoding ASCII
>      [exec]     [javac]  * @author Instituto Tecnol?gico de C?rdoba
>      [exec]     [javac]                                      ^
>      [exec]     [javac] /home/hybld/continuum-working-directory/6/classlib/=
> modules/math/src/main/java/java/math/Elementary.java:30: warning: unmappabl=
> e character for encoding ASCII
>      [exec]     [javac]  * @author Instituto Tecnol?gico de C?rdoba
>      [exec]     [javac]                            ^
>      [exec]     [javac] /home/hybld/continuum-working-directory/6/classlib/=
> modules/math/src/main/java/java/math/Elementary.java:30: warning: unmappabl=
> e character for encoding ASCII
>      [exec]     [javac]  * @author Instituto Tecnol?gico de C?rdoba
>      [exec]     [javac]                                      ^
>      [exec]     [javac] /home/hybld/continuum-working-directory/6/classlib/=
> modules/awt/src/main/java/common/java/awt/MouseDispatcher.java:362: <T>getL=
> isteners(java.lang.Class<T>) in java.awt.Component cannot be applied to (ja=
> va.lang.Class<capture of ?>)
>      [exec]     [javac]                (src.getListeners(type).length > 0))=
> ) {
>      [exec]     [javac]                    ^
>      [exec]     [javac] /home/hybld/continuum-working-directory/6/classlib/=
> modules/swing/src/main/java/common/javax/swing/UIDefaults.java:109: warning=
> : non-varargs call of varargs method with inexact argument type for last pa=
> rameter;
>      [exec]     [javac] cast to java.lang.Class for a varargs call
>      [exec]     [javac] cast to java.lang.Class[] for a non-varargs call an=
> d to suppress this warning
>      [exec]     [javac]                                     : classObj.getM=
> ethod(methodName, null).invoke(null, null);
>      [exec]     [javac]                                                    =
>                   ^
>      [exec]     [javac] /home/hybld/continuum-working-directory/6/classlib/=
> modules/swing/src/main/java/common/javax/swing/UIDefaults.java:109: warning=
> : non-varargs call of varargs method with inexact argument type for last pa=
> rameter;
>      [exec]     [javac] cast to java.lang.Object for a varargs call
>      [exec]     [javac] cast to java.lang.Object[] for a non-varargs call a=
> nd to suppress this warning
>      [exec]     [javac]                                     : classObj.getM=
> ethod(methodName, null).invoke(null, null);
>      [exec]     [javac]                                                    =
>                                      ^
>      [exec]     [javac] /home/hybld/continuum-working-directory/6/classlib/=
> modules/swing/src/main/java/common/javax/swing/TransferHandler.java:108: wa=
> rning: non-varargs call of varargs method with inexact argument type for la=
> st parameter;
>      [exec]     [javac] cast to java.lang.Object for a varargs call
>      [exec]     [javac] cast to java.lang.Object[] for a non-varargs call a=
> nd to suppress this warning
>      [exec]     [javac]                  value =3D reader.invoke(component,=
>  null);
>      [exec]     [javac]                                                   ^
>      [exec]     [javac] /home/hybld/continuum-working-directory/6/classlib/=
> modules/awt/src/main/java/common/java/awt/ToolkitImpl.java:42: java.awt.Too=
> lkitImpl is not abstract and does not override abstract method mapInputMeth=
> odHighlight(java.awt.im.InputMethodHighlight) in java.awt.Toolkit
>      [exec]     [javac] class ToolkitImpl extends Toolkit {
>      [exec]     [javac] ^
>      [exec]     [javac] /home/hybld/continuum-working-directory/6/classlib/=
> modules/awt/src/main/java/common/java/awt/ToolkitImpl.java:513: mapInputMet=
> hodHighlight(java.awt.im.InputMethodHighlight) in java.awt.ToolkitImpl cann=
> ot override mapInputMethodHighlight(java.awt.im.InputMethodHighlight) in ja=
> va.awt.Toolkit; attempting to use incompatible return type
>      [exec]     [javac] found   : java.util.Map<?,?>
>      [exec]     [javac] required: java.util.Map<java.awt.font.TextAttribute=
> ,?>
>      [exec]     [javac]     public Map<?, ?> mapInputMethodHighlight(InputM=
> ethodHighlight highlight)
>      [exec]     [javac]                      ^
>      [exec]     [javac] /home/hybld/continuum-working-directory/6/classlib/=
> modules/awt/src/main/java/common/java/awt/ToolkitImpl.java:512: method does=
>  not override a method from its superclass
>      [exec]     [javac]     @Override
>      [exec]     [javac]      ^
>      [exec]     [javac] /home/hybld/continuum-working-directory/6/classlib/=
> modules/swing/src/main/java/common/javax/swing/plaf/basic/MenuKeyBindingPro=
> cessor.java:261: warning: non-varargs call of varargs method with inexact a=
> rgument type for last parameter;
>      [exec]     [javac] cast to java.lang.Object for a varargs call
>      [exec]     [javac] cast to java.lang.Object[] for a non-varargs call a=
> nd to suppress this warning
>      [exec]     [javac]                 fireCanceled.invoke(popup, NO_CLASS=
> ES_NO_ARGUMENTS);
>      [exec]     [javac]                                            ^
>      [exec]     [javac] /home/hybld/continuum-working-directory/6/classlib/=
> modules/swing/src/main/java/common/javax/swing/plaf/metal/MetalLookAndFeel.=
> java:1287: warning: non-varargs call of varargs method with inexact argumen=
> t type for last parameter;
>      [exec]     [javac] cast to java.lang.Class for a varargs call
>      [exec]     [javac] cast to java.lang.Class[] for a non-varargs call an=
> d to suppress this warning
>      [exec]     [javac]                         : classObj.getMethod(method=
> Name, null).invoke(null, null);
>      [exec]     [javac]                                                    =
>       ^
>      [exec]     [javac] /home/hybld/continuum-working-directory/6/classlib/=
> modules/swing/src/main/java/common/javax/swing/plaf/metal/MetalLookAndFeel.=
> java:1287: warning: non-varargs call of varargs method with inexact argumen=
> t type for last parameter;
>      [exec]     [javac] cast to java.lang.Object for a varargs call
>      [exec]     [javac] cast to java.lang.Object[] for a non-varargs call a=
> nd to suppress this warning
>      [exec]     [javac]                         : classObj.getMethod(method=
> Name, null).invoke(null, null);
>      [exec]     [javac]                                                    =
>                          ^
>      [exec]     [javac] Note: * uses or overrides a deprecated API.
>      [exec]     [javac] Note: Recompile with -Xlint:deprecation for details=
> .
>      [exec]     [javac] Note: Some input files use unchecked or unsafe oper=
> ations.
>      [exec]     [javac] Note: Recompile with -Xlint:unchecked for details.
>      [exec]     [javac] 4 errors
>      [exec]     [javac] 10 warnings
> 
>      [exec] BUILD FAILED
>      [exec] /home/hybld/continuum-working-directory/6/classlib/build.xml:88=
> : The following error occurred while executing this line:
>      [exec] /home/hybld/continuum-working-directory/6/classlib/make/build-j=
> ava.xml:94: Compile failed; see the compiler error output for details.
> 
>      [exec] Total time: 59 seconds
> 
> BUILD FAILED
> /home/hybld/continuum-working-directory/6/build.xml:118: exec returned: 1
> 
> Total time: 1 minute 3 seconds
> 
> ***************************************************************************=
> *
> 



---------------------------------------------------------------------
Terms of use : http://incubator.apache.org/harmony/mailing.html
To unsubscribe, e-mail: harmony-dev-unsubscribe@incubator.apache.org
For additional commands, e-mail: harmony-dev-help@incubator.apache.org


Mime
View raw message