harmony-dev mailing list archives

Site index · List index
Message view « Date » · « Thread »
Top « Date » · « Thread »
From "Stepan Mishura" <stepan.mish...@gmail.com>
Subject Re: [continuum] BUILD FAILURE: Classlib/win.ia32 Build/Test
Date Thu, 03 Aug 2006 08:57:10 GMT
I'd suggest stop committing new code until the issue is resolved - two
security tests failed (see below)

Thanks,
Stepan.


-----Original Message-----
From: Apache Harmony Build [mailto:nomail@hursley.ibm.com]
Sent: Thursday, August 03, 2006 3:19 PM
To: harmony-commits@incubator.apache.org
Subject: [continuum] BUILD FAILURE: Classlib/win.ia32 Build/Test



Online report :
http://ibmonly.hursley.ibm.com/continuum/win.ia32/servlet/continuum/target/ProjectBuild.vm/view/ProjectBuild/id/6/buildId/2034

Build statistics:

  State: Failed

  Previous State: Ok

  Started at: Thu, 3 Aug 2006 09:06:24 +0100

  Finished at: Thu, 3 Aug 2006 09:18:14 +0100

  Total time: 11m 50s

  Build Trigger: Schedule

  Exit code: 1

  Building machine hostname: hy1

  Operating system : Windows XP(Service Pack 2)

  Java version : 1.5.0_06(Sun Microsystems Inc.)



Changes


classlib\modules\luni\src\test\java\tests\api\java\net\InetSocketAddressTest.java


classlib\modules\luni\src\test\java\tests\api\java\net\Inet6AddressTest.java


classlib\modules\luni\src\test\java\tests\api\java\util\LocaleTest.java


classlib\modules\luni\src\test\resources\serialization\java\net\Inet6Address.golden.0.ser


classlib\modules\luni\src\test\resources\serialization\java\net\Inet6Address.golden.1.ser


classlib\modules\luni\src\main\java\java\net\InetSocketAddress.java


classlib\modules\luni\src\main\java\java\net\URLStreamHandler.java

            classlib\modules\luni\src\main\java\java\net\Inet6Address.java


classlib\modules\luni\src\main\java\org\apache\harmony\luni\internal\locale\ISO3Languages.java


classlib\modules\luni\src\main\java\org\apache\harmony\luni\internal\locale\ISO3Countries.java



****************************************************************************

Output:

****************************************************************************

Buildfile: build.xml

<SNIP>


[exec]     [junit] Tests run: 6, Failures: 1, Errors: 0, Time elapsed: 0 sec

[exec]     [junit] TEST
org.apache.harmony.security.tests.java.security.CodeSource2Test FAILED

[exec]     [junit] Tests run: 26, Failures: 1, Errors: 0, Time elapsed:
3.125 sec

[exec]     [junit] TEST
org.apache.harmony.security.tests.java.security.CodeSourceTest FAILED


<SNIP>

Thanks,
Stepan Mishura
Intel Middleware Products Division

------------------------------------------------------
Terms of use : http://incubator.apache.org/harmony/mailing.html
To unsubscribe, e-mail: harmony-dev-unsubscribe@incubator.apache.org
For additional commands, e-mail: harmony-dev-help@incubator.apache.org

Mime
  • Unnamed multipart/alternative (inline, None, 0 bytes)
View raw message