harmony-dev mailing list archives

Site index · List index
Message view « Date » · « Thread »
Top « Date » · « Thread »
From "Vladimir Ivanov" <ivavladi...@gmail.com>
Subject Re: [continuum] BUILD FAILURE: Classlib/win.ia32 Build/Test
Date Tue, 18 Jul 2006 11:19:03 GMT
Seems, that exclude list was cleaned:
<!--
<exclude
name="org/apache/harmony/text/tests/java/text/CollationKeyTest.java"/>
<exclude name="org/apache/harmony/text/tests/java/text/CollatorTest.java"/>
<exclude
name="org/apache/harmony/text/tests/java/text/DecimalFormatTest.java"/>
<exclude
name="org/apache/harmony/text/tests/java/text/MessageFormatTest.java"/>
-->

 thanks, Vladimir


On 7/18/06, Alexei Zakharov <alexei.zakharov@gmail.com> wrote:
>
> Nathan,
>
> I have the following picture for text with fresh classlib, j9 and WinXP:
>
> run.tests:
>    [mkdir] Created dir:
> C:\Java\harmony\enhanced\classlib\trunk\build\test_repo
> rt
>    [junit] Running
> org.apache.harmony.text.tests.java.text.StringCharacterItera
> torTest
>    [junit] java version 1.5 (subset)
>    [junit] (c) Copyright 1991, 2006 The Apache Software Foundation or its
> licen
> sors, as applicable.
>
>    [junit] Tests run: 3, Failures: 0, Errors: 0, Time elapsed: 0,141 sec
>    [junit] Tests run: 10, Failures: 0, Errors: 0, Time elapsed: 0,031 sec
>    [junit] Tests run: 2, Failures: 0, Errors: 0, Time elapsed: 0 sec
>    [junit] Tests run: 23, Failures: 0, Errors: 0, Time elapsed: 0,031 sec
>    [junit] Tests run: 30, Failures: 0, Errors: 0, Time elapsed: 0,219 sec
>    [junit] Tests run: 18, Failures: 0, Errors: 1, Time elapsed: 0,266 sec
>    [junit] TEST org.apache.harmony.text.tests.java.text.ChoiceFormatTestFAILED
>
>    [junit] Tests run: 10, Failures: 0, Errors: 0, Time elapsed: 0,359 sec
>    [junit] Tests run: 5, Failures: 0, Errors: 0, Time elapsed: 0,032 sec
>    [junit] Tests run: 8, Failures: 0, Errors: 0, Time elapsed: 0,484 sec
>    [junit] Tests run: 6, Failures: 0, Errors: 0, Time elapsed: 0,031 sec
>    [junit] Tests run: 21, Failures: 0, Errors: 0, Time elapsed: 0,015 sec
>    [junit] Tests run: 16, Failures: 0, Errors: 0, Time elapsed: 1,438 sec
>    [junit] Tests run: 30, Failures: 0, Errors: 0, Time elapsed: 0,015 sec
>    [junit] Tests run: 37, Failures: 5, Errors: 0, Time elapsed: 0,406 sec
>    [junit] TEST org.apache.harmony.text.tests.java.text.DecimalFormatTestFAILE
> D
>    [junit] Tests run: 12, Failures: 0, Errors: 0, Time elapsed: 0 sec
>    [junit] Tests run: 2, Failures: 0, Errors: 0, Time elapsed: 0 sec
>    [junit] Tests run: 16, Failures: 2, Errors: 2, Time elapsed: 0,25 sec
>    [junit] TEST org.apache.harmony.text.tests.java.text.MessageFormatTestFAILE
> D
>    [junit] Tests run: 2, Failures: 0, Errors: 0, Time elapsed: 0,016 sec
>    [junit] Tests run: 6, Failures: 0, Errors: 0, Time elapsed: 0,015 sec
>    [junit] Tests run: 2, Failures: 0, Errors: 0, Time elapsed: 0,016 sec
>    [junit] Tests run: 8, Failures: 0, Errors: 0, Time elapsed: 0,015 sec
>    [junit] Tests run: 16, Failures: 0, Errors: 0, Time elapsed: 0,625 sec
>    [junit] Tests run: 19, Failures: 0, Errors: 0, Time elapsed: 0,187 sec
>    [junit] Tests run: 22, Failures: 0, Errors: 0, Time elapsed: 0 sec
>    [junit] Tests FAILED
>
> I assume I can be doing something wrong here. Other modules are clean
> nevertheless.
>
> Regards,
>
> 2006/7/18, Nathan Beyer <nbeyer@kc.rr.com>:
> > Has anyone been able to recreate this failure? My WinXP build is
> successful.
> >
> > > -----Original Message-----
> > > From: Apache Harmony Build [mailto:nomail@hursley.ibm.com]
> > > Sent: Monday, July 17, 2006 7:18 PM
> > > To: harmony-commits@incubator.apache.org
> > > Subject: [continuum] BUILD FAILURE: Classlib/win.ia32 Build/Test
> > >
> > > Online report :
> > >
> http://ibmonly.hursley.ibm.com/continuum/win.ia32/servlet/continuum/target
> > > /ProjectBuild.vm/view/ProjectBuild/id/6/buildId/1807
> > > Build statistics:
> > >   State: Failed
> > >   Previous State: Failed
> > >   Started at: Tue, 18 Jul 2006 01:05:37 +0100
> > >   Finished at: Tue, 18 Jul 2006 01:17:04 +0100
> > >   Total time: 11m 26s
> > >   Build Trigger: Schedule
> > >   Exit code: 1
> > >   Building machine hostname: hy1
> > >   Operating system : Windows XP(Service Pack 2)
> > >   Java version : 1.5.0_06(Sun Microsystems Inc.)
> > >
> > > Changes
> > >
> > > classlib\modules\luni\src\test\java\tests\api\java\io\FileTest.java
> > >
> > >
> classlib\modules\luni\src\test\java\tests\api\java\util\LocaleTest.java
> > >             classlib\modules\luni\src\main\java\java\util\Locale.java
> > >
> > >
> **************************************************************************
> > > **
> > > Output:
> > >
> **************************************************************************
> > > **
> > > Buildfile: build.xml
> > >
> > <SNIP/>
> >
> > >
> > >      [exec] test:
> > >
> > >      [exec] compile.java:
> > >      [exec]      [echo] Compiling TEXT classes
> > >
> > >      [exec] build.jar:
> > >
> > >      [exec] build:
> > >
> > >      [exec] copy.test.resources:
> > >      [exec]      [copy] Copying 2 files to C:\continuum-
> > >
> 1.0.2\apps\continuum\working-directory\6\classlib\modules\text\bin\test
> > >
> > >      [exec] compile.tests:
> > >      [exec]      [echo] Compiling TEXT tests
> > >      [exec]     [javac] Compiling 26 source files to C:\continuum-
> > >
> 1.0.2\apps\continuum\working-directory\6\classlib\modules\text\bin\test
> > >
> > >      [exec] run.tests:
> > >      [exec]     [junit] Running
> > > org.apache.harmony.text.tests.java.text.StringCharacterIteratorTest
> > >      [exec]     [junit] (c) Copyright 1991, 2006 The Apache Software
> > > Foundation or its licensors, as applicable.
> > >      [exec]     [junit] java version 1.5 (subset)
> > >
> > >      [exec]     [junit] Tests run: 3, Failures: 0, Errors: 0, Time
> > > elapsed: 0.156 sec
> > >      [exec]     [junit] Tests run: 10, Failures: 0, Errors: 0, Time
> > > elapsed: 0.031 sec
> > >      [exec]     [junit] Tests run: 2, Failures: 0, Errors: 0, Time
> > > elapsed: 0.031 sec
> > >      [exec]     [junit] Tests run: 23, Failures: 0, Errors: 0, Time
> > > elapsed: 0.11 sec
> > >      [exec]     [junit] Tests run: 30, Failures: 0, Errors: 0, Time
> > > elapsed: 0.156 sec
> > >      [exec]     [junit] Tests run: 18, Failures: 0, Errors: 0, Time
> > > elapsed: 0.11 sec
> > >      [exec]     [junit] Tests run: 10, Failures: 0, Errors: 0, Time
> > > elapsed: 0.079 sec
> > >      [exec]     [junit] Tests run: 5, Failures: 0, Errors: 0, Time
> > > elapsed: 0.016 sec
> > >      [exec]     [junit] Tests run: 8, Failures: 0, Errors: 0, Time
> > > elapsed: 0.234 sec
> > >      [exec]     [junit] Tests run: 6, Failures: 0, Errors: 0, Time
> > > elapsed: 0.015 sec
> > >      [exec]     [junit] Tests run: 21, Failures: 0, Errors: 0, Time
> > > elapsed: 0 sec
> > >      [exec]     [junit] Tests run: 16, Failures: 0, Errors: 0, Time
> > > elapsed: 0.843 sec
> > >      [exec]     [junit] Tests run: 30, Failures: 0, Errors: 0, Time
> > > elapsed: 0.031 sec
> > >      [exec]     [junit] Tests run: 37, Failures: 0, Errors: 0, Time
> > > elapsed: 0.469 sec
> > >      [exec]     [junit] Tests run: 12, Failures: 0, Errors: 0, Time
> > > elapsed: 0 sec
> > >      [exec]     [junit] Tests run: 2, Failures: 0, Errors: 0, Time
> > > elapsed: 0.016 sec
> > >      [exec]     [junit] Tests run: 16, Failures: 1, Errors: 0, Time
> > > elapsed: 0.187 sec
> > >      [exec]     [junit] TEST
> > > org.apache.harmony.text.tests.java.text.MessageFormatTest FAILED
> > >      [exec]     [junit] Tests run: 2, Failures: 0, Errors: 0, Time
> > > elapsed: 0 sec
> > >      [exec]     [junit] Tests run: 6, Failures: 0, Errors: 0, Time
> > > elapsed: 0.016 sec
> > >      [exec]     [junit] Tests run: 2, Failures: 0, Errors: 0, Time
> > > elapsed: 0 sec
> > >      [exec]     [junit] Tests run: 8, Failures: 0, Errors: 0, Time
> > > elapsed: 0 sec
> > >      [exec]     [junit] Tests run: 16, Failures: 0, Errors: 0, Time
> > > elapsed: 0.453 sec
> > >      [exec]     [junit] Tests run: 19, Failures: 0, Errors: 0, Time
> > > elapsed: 0.109 sec
> > >      [exec]     [junit] Tests run: 22, Failures: 0, Errors: 0, Time
> > > elapsed: 0 sec
> > >      [exec]     [junit] Tests FAILED
> > >
> > >      [exec] touch-failures-file:
> > >
> > >      [exec] touch-errors-file:
>
>
> --
> Alexei Zakharov,
> Intel Middleware Product Division
>
> ---------------------------------------------------------------------
> Terms of use : http://incubator.apache.org/harmony/mailing.html
> To unsubscribe, e-mail: harmony-dev-unsubscribe@incubator.apache.org
> For additional commands, e-mail: harmony-dev-help@incubator.apache.org
>
>

Mime
  • Unnamed multipart/alternative (inline, None, 0 bytes)
View raw message