harmony-dev mailing list archives

Site index · List index
Message view « Date » · « Thread »
Top « Date » · « Thread »
From Tim Ellison <t.p.elli...@gmail.com>
Subject [continuum] BUILD FAILURE: Classlib/win.ia32 Build/Test
Date Mon, 17 Jul 2006 13:40:54 GMT
The test below is failing as follows, I have not investigated:


Wrong full date pattern expected:<...full...> but was:<...long...>

junit.framework.ComparisonFailure: Wrong full date pattern
expected:<...full...> but was:<...long...> at
org.apache.harmony.text.tests.java.text.MessageFormatTest.test_applyPatternLjava_lang_String(MessageFormatTest.java:244)
at java.lang.reflect.AccessibleObject.invokeV(AccessibleObject.java:205)



Apache Harmony Build wrote:
> Online report : http://ibmonly.hursley.ibm.com/continuum/win.ia32/servlet/continuum/target/ProjectBuild.vm/view/ProjectBuild/id/6/buildId/1796
> Build statistics:
>   State: Failed
>   Previous State: Failed
>   Started at: Mon, 17 Jul 2006 14:09:15 +0100
>   Finished at: Mon, 17 Jul 2006 14:25:09 +0100
>   Total time: 15m 54s
>   Build Trigger: Schedule
>   Exit code: 1
>   Building machine hostname: hy1
>   Operating system : Windows XP(Service Pack 2)
>   Java version : 1.5.0_06(Sun Microsystems Inc.)
> 

<snip>

>      [exec] compile.tests:
>      [exec]      [echo] Compiling TEXT tests
>      [exec]     [javac] Compiling 26 source files to C:\continuum-1.0.2\apps\continuum\working-directory\6\classlib\modules\text\bin\test
> 
>      [exec] run.tests:
>      [exec]     [junit] Running org.apache.harmony.text.tests.java.text.StringCharacterIteratorTest
>      [exec]     [junit] java version 1.5 (subset)
> 
>      [exec]     [junit] (c) Copyright 1991, 2006 The Apache Software Foundation or its
licensors, as applicable.
>      [exec]     [junit] Tests run: 3, Failures: 0, Errors: 0, Time elapsed: 0.172 sec
>      [exec]     [junit] Tests run: 10, Failures: 0, Errors: 0, Time elapsed: 0.031 sec
>      [exec]     [junit] Tests run: 2, Failures: 0, Errors: 0, Time elapsed: 0.031 sec
>      [exec]     [junit] Tests run: 23, Failures: 0, Errors: 0, Time elapsed: 0.047 sec
>      [exec]     [junit] Tests run: 30, Failures: 0, Errors: 0, Time elapsed: 0.25 sec
>      [exec]     [junit] Tests run: 18, Failures: 0, Errors: 0, Time elapsed: 0.125 sec
>      [exec]     [junit] Tests run: 10, Failures: 0, Errors: 0, Time elapsed: 0.093 sec
>      [exec]     [junit] Tests run: 5, Failures: 0, Errors: 0, Time elapsed: 0.015 sec
>      [exec]     [junit] Tests run: 8, Failures: 0, Errors: 0, Time elapsed: 0.327 sec
>      [exec]     [junit] Tests run: 6, Failures: 0, Errors: 0, Time elapsed: 0.016 sec
>      [exec]     [junit] Tests run: 21, Failures: 0, Errors: 0, Time elapsed: 0.016 sec
>      [exec]     [junit] Tests run: 16, Failures: 0, Errors: 0, Time elapsed: 1.295 sec
>      [exec]     [junit] Tests run: 30, Failures: 0, Errors: 0, Time elapsed: 0.015 sec
>      [exec]     [junit] Tests run: 37, Failures: 0, Errors: 0, Time elapsed: 0.343 sec
>      [exec]     [junit] Tests run: 12, Failures: 0, Errors: 0, Time elapsed: 0 sec
>      [exec]     [junit] Tests run: 2, Failures: 0, Errors: 0, Time elapsed: 0 sec
>      [exec]     [junit] Tests run: 16, Failures: 1, Errors: 0, Time elapsed: 0.187 sec
>      [exec]     [junit] TEST org.apache.harmony.text.tests.java.text.MessageFormatTest
FAILED
>      [exec]     [junit] Tests run: 2, Failures: 0, Errors: 0, Time elapsed: 0 sec
>      [exec]     [junit] Tests run: 6, Failures: 0, Errors: 0, Time elapsed: 0.016 sec
>      [exec]     [junit] Tests run: 2, Failures: 0, Errors: 0, Time elapsed: 0 sec
>      [exec]     [junit] Tests run: 8, Failures: 0, Errors: 0, Time elapsed: 0.016 sec
>      [exec]     [junit] Tests run: 16, Failures: 0, Errors: 0, Time elapsed: 0.764 sec
>      [exec]     [junit] Tests run: 19, Failures: 0, Errors: 0, Time elapsed: 0.312 sec
>      [exec]     [junit] Tests run: 22, Failures: 0, Errors: 0, Time elapsed: 0 sec
>      [exec]     [junit] Tests FAILED
> 

<snip>

-- 

Tim Ellison (t.p.ellison@gmail.com)
IBM Java technology centre, UK.

---------------------------------------------------------------------
Terms of use : http://incubator.apache.org/harmony/mailing.html
To unsubscribe, e-mail: harmony-dev-unsubscribe@incubator.apache.org
For additional commands, e-mail: harmony-dev-help@incubator.apache.org


Mime
View raw message