harmony-dev mailing list archives

Site index · List index
Message view « Date » · « Thread »
Top « Date » · « Thread »
From Geir Magnusson Jr <g...@pobox.com>
Subject Re: [continuum] BUILD FAILURE: Classlib/win.ia32 Build/Test
Date Thu, 29 Jun 2006 09:20:33 GMT
do we have a list of the intermittent failures?

Tim Ellison wrote:
> Apache Harmony Build wrote:
>> Online report : http://ibmonly.hursley.ibm.com/continuum/win.ia32/servlet/continuum/target/ProjectBuild.vm/view/ProjectBuild/id/6/buildId/1435
>> Build statistics:
>>   State: Failed
>>   Previous State: Ok
>>   Started at: Mon, 26 Jun 2006 16:09:03 +0100
>>   Finished at: Mon, 26 Jun 2006 16:22:52 +0100
>>   Total time: 13m 48s
>>   Build Trigger: Schedule
>>   Exit code: 1
>>   Building machine hostname: hy1
>>   Operating system : Windows XP(Service Pack 2)
>>   Java version : 1.5.0_06(Sun Microsystems Inc.)
> 
> <snip>
> 
>>      [exec]     [junit] T2 not closed
>>      [exec]     [junit] T1 not closed
>>      [exec]     [junit] Read fail in capacity64KB, testReadByteBuffer_NonBlocking_ReadWriteRealTooLargeData
not finish.
>>      [exec]     [junit] Tests run: 80, Failures: 1, Errors: 0, Time elapsed: 15.491
sec
>>      [exec]     [junit] TEST org.apache.harmony.tests.java.nio.channels.SocketChannelTest
FAILED
>>      [exec]     [junit] Tests run: 14, Failures: 0, Errors: 0, Time elapsed: 0.313
sec
>>      [exec]     [junit] Tests run: 3, Failures: 0, Errors: 0, Time elapsed: 0 sec
>>      [exec]     [junit] Tests run: 9, Failures: 0, Errors: 0, Time elapsed: 0.126
sec
>>      [exec]     [junit] Tests run: 2, Failures: 0, Errors: 0, Time elapsed: 0.016
sec
>>      [exec]     [junit] Tests run: 6, Failures: 0, Errors: 0, Time elapsed: 0.094
sec
>>      [exec]     [junit] Tests run: 2, Failures: 0, Errors: 0, Time elapsed: 0.016
sec
>>      [exec]     [junit] Tests FAILED
> 
> 
> This test seems to be frequently, if intermittently, failing.
> 
> expected:<7300> but was:<65536>
> 
> junit.framework.AssertionFailedError: expected:<7300> but was:<65536> at
> org.apache.harmony.tests.java.nio.channels.SocketChannelTest.testReadByteBuffer_NonBlocking_ReadWriteRealTooLargeData(SocketChannelTest.java:2518)
> at java.lang.reflect.AccessibleObject.invokeV(AccessibleObject.java:205)
> 
> 
> 
> Regards,
> Tim
> 


---------------------------------------------------------------------
Terms of use : http://incubator.apache.org/harmony/mailing.html
To unsubscribe, e-mail: harmony-dev-unsubscribe@incubator.apache.org
For additional commands, e-mail: harmony-dev-help@incubator.apache.org


Mime
View raw message