harmony-commits mailing list archives

Site index · List index
Message view « Date » · « Thread »
Top « Date » · « Thread »
From "Ilya Leviev (JIRA)" <j...@apache.org>
Subject [jira] Commented: (HARMONY-5341) [drlvm][gc] stress tests org.apache.harmony.test.stress.gc.frag.FragmentationFinalizer.FragmentationFinalizerWaitTest FAILED
Date Wed, 06 Feb 2008 11:45:10 GMT

    [ https://issues.apache.org/jira/browse/HARMONY-5341?page=com.atlassian.jira.plugin.system.issuetabpanels:comment-tabpanel&focusedCommentId=12566097#action_12566097
] 

Ilya Leviev commented on HARMONY-5341:
--------------------------------------


stress.org.apache.harmony.test.stress.gc.frag.FragmentationFinalizer.FragmentationFinalizerWaitTest
hung on Windows_x86 
svn = r617962


TestHarness:ExecUnit	runProc(): Timeout!!!. The test hung (not finished in 180 second).

java version "1.5.0" 
pre-alpha : not complete or compatible
svn = r617962, (Feb  4 2008), Windows/ia32/msvc 1310, release build
http://harmony.apache.org

[concurrent] Starting org.apache.harmony.test.stress.gc.frag.FragmentationFinalizerWaitTest
org.apache.harmony.test.stress.gc.frag.FragmentationFinalizerWaitTest

Apache Harmony Launcher : (c) Copyright 1991, 2007 The Apache Software Foundation or its licensors,
as applicable.
[debug] total = 268435456, used = 1780284, ratio = 13, sizes = 1 - 2097152


> [drlvm][gc] stress tests org.apache.harmony.test.stress.gc.frag.FragmentationFinalizer.FragmentationFinalizerWaitTest
FAILED
> ----------------------------------------------------------------------------------------------------------------------------
>
>                 Key: HARMONY-5341
>                 URL: https://issues.apache.org/jira/browse/HARMONY-5341
>             Project: Harmony
>          Issue Type: Bug
>          Components: DRLVM
>         Environment: Linux_x86_64,Windows_x86
>            Reporter: Ilya Leviev
>            Assignee: Xiao-Feng Li
>
> r606592/
> test org.apache.harmony.test.stress.gc.frag.FragmentationFinalizer.FragmentationFinalizerWaitTest
> log
> java version "1.5.0" 
> pre-alpha : not complete or compatible
> svn = r606592, (Dec 24 2007), Linux/em64t/gcc 4.1.0, release build
> http://harmony.apache.org
> [concurrent] Starting org.apache.harmony.test.stress.gc.frag.FragmentationFinalizerWaitTest
> org.apache.harmony.test.stress.gc.frag.FragmentationFinalizerWaitTest
> test() - [82869.591ms,99.15804829793657%]
> java.lang.AssertionError: Expected 10502, but got 10501
> total: 1, failures:1 (RED) - 83007.205ms
> 1)
> Apache Harmony Launcher : (c) Copyright 1991, 2007 The Apache Software Foundation or
its licensors, as applicable.
> [debug] total = 268402688, used = 2009432, ratio = 13, sizes = 1 - 2097152

-- 
This message is automatically generated by JIRA.
-
You can reply to this email to add a comment to the issue online.


Mime
View raw message