harmony-commits mailing list archives

Site index · List index
Message view « Date » · « Thread »
Top « Date » · « Thread »
From "Ilya Leviev (JIRA)" <j...@apache.org>
Subject [jira] Created: (HARMONY-5213) [drlvm][jvmti] ega scenario fails at SimpleGBeanDataTest.java
Date Wed, 28 Nov 2007 11:48:43 GMT
[drlvm][jvmti] ega scenario fails at SimpleGBeanDataTest.java
-------------------------------------------------------------

                 Key: HARMONY-5213
                 URL: https://issues.apache.org/jira/browse/HARMONY-5213
             Project: Harmony
          Issue Type: Bug
          Components: DRLVM
         Environment: Windows 2003 x86, Linux x86, Linux x86_64
            Reporter: Ilya Leviev



Windows 2003 x86: ega (Eclipse x 48h)

pls. see screenshot

ega scenario fails at SimpleGBeanDataTest.java -  ERROR! Debug was not terminated. STOP.

r595652-r598685

Log:
--- Automated Eclipse EGA scenario for Eclipse 3.2.1 --- 

Eclipse Home = D:\af/build/libs/eclipse-3.2.1-win-x86/eclipse
Tested JRE Home = D:\af\build\checkouts\hdk\target\hdk\jdk\jre
Tested JRE options for Eclipse launching = -showversion -Xmx600M -Xms512M
Time frame for the scenario run = 48 hours 
Delay factor = 6
Kill Eclipse if EGA scenario fails = 1

Start:
	Run Eclipse
	Waiting for 'Workspace Launcher' window
	Window 'Workspace Launcher' appeared
	Activating 'Workspace Launcher' window 
	Waiting for  'Workspace Launcher' window activation
	Window 'Workspace Launcher' is active
	Select D:\af\tests\ega\workspace as workspace
	Press OK button
	Closing window 'Workspace Launcher'
	wait 'Java - Eclipse SDK' window to appear 
	Waiting for 'Java - Eclipse SDK' window
	Window 'Java - Eclipse SDK' appeared
	Waiting for  'Java - Eclipse SDK' window activation
	Window 'Java - Eclipse SDK' is active
	window appeared 

Prepare Eclipse environment:
	Close Welcome page 
	Waiting for  'Java - Eclipse SDK' window activation
	Window 'Java - Eclipse SDK' is active
	Uncheck Project->Build Automatically
	Select Window->Preferences
	wait 'Preferences' window to appear 
	Waiting for 'Preferences' window
	Window 'Preferences' appeared
	Waiting for  'Preferences' window activation
	Window 'Preferences' is active
	window appeared 
	Select Java->Build Path->Classpath Variables
	Create M2_REPO variable
	wait 'New Variable Entry' window to appear 
	Waiting for 'New Variable Entry' window
	Window 'New Variable Entry' appeared
	Waiting for  'New Variable Entry' window activation
	Window 'New Variable Entry' is active
	window appeared 
	Set M2_REPO value to D:\af\tests\ega\project\.m2\repository
	Press OK button
	Closing window 'New Variable Entry'
	Press OK button to apply new preferences
	Waiting for  'Preferences' window activation
	Window 'Preferences' is active
	Closing window 'Preferences'

Import Geronimo modules into workspace: 
	Waiting for 'Java - Eclipse SDK' window
	Window 'Java - Eclipse SDK' appeared
	Waiting for  'Java - Eclipse SDK' window activation
	Window 'Java - Eclipse SDK' is active
	Select File->Import...
	wait 'Import' window to appear 
	Waiting for 'Import' window
	Window 'Import' appeared
	Waiting for  'Import' window activation
	Window 'Import' is active
	window appeared 
	Select import existing project
	Type path to search projects: D:\af\tests\ega\project\geronimo-1.2-beta\modules
	Uncheck all builders
	Import
	Closing window 'Import'

Import testsupport module into workspace: 
	Waiting for 'Java - Eclipse SDK' window
	Window 'Java - Eclipse SDK' appeared
	Waiting for  'Java - Eclipse SDK' window activation
	Window 'Java - Eclipse SDK' is active
	Select File->Import...
	wait 'Import' window to appear 
	Waiting for 'Import' window
	Window 'Import' appeared
	Waiting for  'Import' window activation
	Window 'Import' is active
	window appeared 
	Select import existing project
	Type path to search projects: D:\af\tests\ega\project\geronimo-1.2-beta\testsupport
	Import
	Closing window 'Import'
	Check import result
	Waiting for 'Java - Eclipse SDK' window
	Window 'Java - Eclipse SDK' appeared
	Waiting for  'Java - Eclipse SDK' window activation
	Window 'Java - Eclipse SDK' is active

Start repeatable part: 

-------------------- Iteration 1 start ------------------

Clean all Geronimo modules: 
	Waiting for 'Java - Eclipse SDK' window
	Window 'Java - Eclipse SDK' appeared
	Waiting for  'Java - Eclipse SDK' window activation
	Window 'Java - Eclipse SDK' is active
	Select Project->Clean...
	wait 'Clean' window to appear 
	Waiting for 'Clean' window
	Window 'Clean' appeared
	Waiting for  'Clean' window activation
	Window 'Clean' is active
	window appeared 
	Uncheck start build immediately
	Clean
	Waiting for 'Java - Eclipse SDK' window
	Window 'Java - Eclipse SDK' appeared
	Waiting for  'Java - Eclipse SDK' window activation
	Window 'Java - Eclipse SDK' is active
	Check clean result 

Build all Geronimo modules: 
	Waiting for 'Java - Eclipse SDK' window
	Window 'Java - Eclipse SDK' appeared
	Waiting for  'Java - Eclipse SDK' window activation
	Window 'Java - Eclipse SDK' is active
	Select Project->Build All
	wait 'Building Workspace' window to appear 
	Waiting for  'Building Workspace' window activation
	Window 'Building Workspace' is active
	window appeared 
	Closing window 'Building Workspace'
	Waiting for 'Java - Eclipse SDK' window
	Window 'Java - Eclipse SDK' appeared
	Waiting for  'Java - Eclipse SDK' window activation
	Window 'Java - Eclipse SDK' is active
	Check build result

Open Navigator view: 
	Waiting for 'Java - Eclipse SDK' window
	Window 'Java - Eclipse SDK' appeared
	Waiting for  'Java - Eclipse SDK' window activation
	Window 'Java - Eclipse SDK' is active
	Waiting for 'Java - Eclipse SDK' window
	Window 'Java - Eclipse SDK' appeared
	Waiting for  'Java - Eclipse SDK' window activation
	Window 'Java - Eclipse SDK' is active

Fix org.apache.geronimo.common.propertyeditor.PropertyEditorsTest: 
	Select 'Navigate->Open Resource'
	wait 'Open Resource' window to appear 
	Waiting for 'Open Resource' window
	Window 'Open Resource' appeared
	Waiting for  'Open Resource' window activation
	Window 'Open Resource' is active
	window appeared 
	Type PropertyEditorsTest.java into 'Open Resource' dialog
	Closing window 'Open Resource'
	wait 'Java - PropertyEditorsTest.java - Eclipse SDK' window to appear 
	Waiting for 'Java - PropertyEditorsTest.java - Eclipse SDK' window
	Window 'Java - PropertyEditorsTest.java - Eclipse SDK' appeared
	Waiting for  'Java - PropertyEditorsTest.java - Eclipse SDK' window activation
	Window 'Java - PropertyEditorsTest.java - Eclipse SDK' is active
	window appeared 
	Go to line 'protected void setUp() throws Exception {'
	wait for window 'Go to Line' to appear, 
	Waiting for 'Go to Line' window
	Window 'Go to Line' appeared
	Waiting for  'Go to Line' window activation
	Window 'Go to Line' is active
	window appeared
	Closing window 'Go to Line'
	Waiting for 'Java - PropertyEditorsTest.java - Eclipse SDK' window
	Window 'Java - PropertyEditorsTest.java - Eclipse SDK' appeared
	Waiting for  'Java - PropertyEditorsTest.java - Eclipse SDK' window activation
	Window 'Java - PropertyEditorsTest.java - Eclipse SDK' is active
	Add line Class.forName("org.apache.geronimo.common.propertyeditor.PropertyEditors"); to setUp()
method
	Save PropertyEditorsTest.java 
	Close PropertyEditorsTest.java 
	Closing window 'Java - PropertyEditorsTest.java - Eclipse SDK'
	Waiting for 'Java - Eclipse SDK' window
	Window 'Java - Eclipse SDK' appeared
	Waiting for  'Java - Eclipse SDK' window activation
	Window 'Java - Eclipse SDK' is active

Run JUnit tests from geronimo-common module: 
	Select geronimo-common module
	Waiting for 'Java - Eclipse SDK' window
	Window 'Java - Eclipse SDK' appeared
	Waiting for  'Java - Eclipse SDK' window activation
	Window 'Java - Eclipse SDK' is active
	Select Run->Run...
	wait 'Run' window to appear 
	Waiting for 'Run' window
	Window 'Run' appeared
	Waiting for  'Run' window activation
	Window 'Run' is active
	window appeared 
	Create new JUnit run configuration 
	Run
	Closing window 'Run'
	Waiting for 'Java - Eclipse SDK' window
	Window 'Java - Eclipse SDK' appeared
	Waiting for  'Java - Eclipse SDK' window activation
	Window 'Java - Eclipse SDK' is active
	Check run result
	Waiting for 'Java - Eclipse SDK' window
	Window 'Java - Eclipse SDK' appeared
	Waiting for  'Java - Eclipse SDK' window activation
	Window 'Java - Eclipse SDK' is active

Modify GBeanData class from geronimo-kernel module: 
	Waiting for 'Java - Eclipse SDK' window
	Window 'Java - Eclipse SDK' appeared
	Waiting for  'Java - Eclipse SDK' window activation
	Window 'Java - Eclipse SDK' is active
	Select geronimo-kernel module
	Select Navigate->Go Into
	Open GBeanData.java
	wait 'Java - GBeanData.java - Eclipse SDK' window to appear 
	Waiting for 'Java - GBeanData.java - Eclipse SDK' window
	Window 'Java - GBeanData.java - Eclipse SDK' appeared
	Waiting for  'Java - GBeanData.java - Eclipse SDK' window activation
	Window 'Java - GBeanData.java - Eclipse SDK' is active
	window appeared 
	Select Edit->Find/Replace...
	wait 'Find/Replace' window to appear 
	Waiting for 'Find/Replace' window
	Window 'Find/Replace' appeared
	Waiting for  'Find/Replace' window activation
	Window 'Find/Replace' is active
	window appeared 
	Find getAbstractName() method 
	Waiting for 'Find/Replace' window
	Window 'Find/Replace' appeared
	Waiting for  'Find/Replace' window activation
	Window 'Find/Replace' is active
	Closing window 'Find/Replace'
	Waiting for  'Java - GBeanData.java - Eclipse SDK' window activation
	Window 'Java - GBeanData.java - Eclipse SDK' is active
	Add System.out.println("Method getAbstractName() was called!"); 
	Save GBeanData.java 
	Waiting for 'Java - GBeanData.java - Eclipse SDK' window
	Window 'Java - GBeanData.java - Eclipse SDK' appeared
	Waiting for  'Java - GBeanData.java - Eclipse SDK' window activation
	Window 'Java - GBeanData.java - Eclipse SDK' is active

Create JUnit test: 
	Waiting for 'Java - GBeanData.java - Eclipse SDK' window
	Window 'Java - GBeanData.java - Eclipse SDK' appeared
	Waiting for  'Java - GBeanData.java - Eclipse SDK' window activation
	Window 'Java - GBeanData.java - Eclipse SDK' is active
	Open geronimo-kernel/src/test/java/org/apache/geronimo/gbean folder
	Select File->New->JUnit Test Case
	wait 'New JUnit Test Case' window to appear 
	Waiting for 'New JUnit Test Case' window
	Window 'New JUnit Test Case' appeared
	Waiting for  'New JUnit Test Case' window activation
	Window 'New JUnit Test Case' is active
	Enter SimpleGBeanDataTest as test name 
	Enter org.apache.geronimo.gbean.GBeanData as class under test 
	Press Next button 
	Enter getAbstractName() as method under test 
	Press Finish button 
	Closing window 'New JUnit Test Case'
	Waiting for 'Java - SimpleGBeanDataTest.java - Eclipse SDK' window
	Window 'Java - SimpleGBeanDataTest.java - Eclipse SDK' appeared
	Waiting for  'Java - SimpleGBeanDataTest.java - Eclipse SDK' window activation
	Window 'Java - SimpleGBeanDataTest.java - Eclipse SDK' is active
	Find string fail("Not yet implemented");, 
	Delete string fail("Not yet implemented");, 
	Add string System.out.println(new GBeanData().getAbstractName());, 
	Save SimpleGBeanDataTest.java 
	Close SimpleGBeanDataTest.java 
	Closing window 'Java - SimpleGBeanDataTest.java - Eclipse SDK'
	Waiting for 'Java - GBeanData.java - Eclipse SDK' window
	Window 'Java - GBeanData.java - Eclipse SDK' appeared
	Waiting for  'Java - GBeanData.java - Eclipse SDK' window activation
	Window 'Java - GBeanData.java - Eclipse SDK' is active

Build geronimo-kernel module: 
	Waiting for 'Java - GBeanData.java - Eclipse SDK' window
	Window 'Java - GBeanData.java - Eclipse SDK' appeared
	Waiting for  'Java - GBeanData.java - Eclipse SDK' window activation
	Window 'Java - GBeanData.java - Eclipse SDK' is active
	Select Project->Build Project 
	Waiting for 'Java - GBeanData.java - Eclipse SDK' window
	Window 'Java - GBeanData.java - Eclipse SDK' appeared
	Waiting for  'Java - GBeanData.java - Eclipse SDK' window activation
	Window 'Java - GBeanData.java - Eclipse SDK' is active
	Check build result

Run SimpleGBeanDataTest: 
	Waiting for 'Java - GBeanData.java - Eclipse SDK' window
	Window 'Java - GBeanData.java - Eclipse SDK' appeared
	Waiting for  'Java - GBeanData.java - Eclipse SDK' window activation
	Window 'Java - GBeanData.java - Eclipse SDK' is active
	Select Run->Run As->JUnit Test
	Waiting for 'Java - GBeanData.java - Eclipse SDK' window
	Window 'Java - GBeanData.java - Eclipse SDK' appeared
	Waiting for  'Java - GBeanData.java - Eclipse SDK' window activation
	Window 'Java - GBeanData.java - Eclipse SDK' is active
	Check GBeanTest run result

Set breakpoint in GBeanData.java: 
	Waiting for 'Java - GBeanData.java - Eclipse SDK' window
	Window 'Java - GBeanData.java - Eclipse SDK' appeared
	Waiting for  'Java - GBeanData.java - Eclipse SDK' window activation
	Window 'Java - GBeanData.java - Eclipse SDK' is active
	Go to line System.out.println("Method getAbstractName() was called!");
	wait for window 'Go to Line' to appear, 
	Waiting for 'Go to Line' window
	Window 'Go to Line' appeared
	Waiting for  'Go to Line' window activation
	Window 'Go to Line' is active
	window appeared
	Closing window 'Go to Line'
	Set breakpoint at line 75 System.out.println("Method getAbstractName() was called!");

Debug: 
	Waiting for 'Java - GBeanData.java - Eclipse SDK' window
	Window 'Java - GBeanData.java - Eclipse SDK' appeared
	Waiting for  'Java - GBeanData.java - Eclipse SDK' window activation
	Window 'Java - GBeanData.java - Eclipse SDK' is active
	Select Run->Debug...
	wait 'Debug' window to appear 
	Waiting for 'Debug' window
	Window 'Debug' appeared
	Waiting for  'Debug' window activation
	Window 'Debug' is active
	window appeared 
	Select GBeanTest run configuration 
	Press Debug button
	wait 'Confirm Perspective Switch' window to appear 
	Waiting for 'Confirm Perspective Switch' window
	Window 'Confirm Perspective Switch' appeared
	Waiting for  'Confirm Perspective Switch' window activation
	Window 'Confirm Perspective Switch' is active
	window appeared 
	Press Yes button
	Closing window 'Confirm Perspective Switch'
	Waiting for 'Debug - GBeanData.java - Eclipse SDK' window
	Window 'Debug - GBeanData.java - Eclipse SDK' appeared
	Waiting for  'Debug - GBeanData.java - Eclipse SDK' window activation
	Window 'Debug - GBeanData.java - Eclipse SDK' is active
	Step over 
	Step over 
	Step over 
	Resume 
	Check debug result
	Waiting for 'Debug - SimpleGBeanDataTest.java - Eclipse SDK' window
	Window 'Debug - SimpleGBeanDataTest.java - Eclipse SDK' appeared
	Waiting for  'Debug - SimpleGBeanDataTest.java - Eclipse SDK' window activation
	Window 'Debug - SimpleGBeanDataTest.java - Eclipse SDK' is active
	ERROR! Debug was not terminated. STOP.

An ERROR has ocurred!

Print error screen:
	Open mspaint to save errror screen
	Wait for 'error - Paint' window
	Save error screen
	Exit mspaint
	Switch to Eclipse

Exit Eclipse: 
	Menu "Debug - SimpleGBeanDataTest.java - Eclipse SDK->File->Exit" wasn't found
	Can't exit Eclipse! Trying to kill ...
	Eclipse was killed!
	Eclipse was found and closed.

EGA FAILED!





=======Linux x86 - Linux x86_64=============================




ega scenario fails at SimpleGBeanDataTest.java -  ERROR! Debug was not terminated. STOP.
"""
Step over
[echo] 	wait window 'Debug - SimpleGBeanDataTest.java - Eclipse SDK' to appear ...
[echo]
[echo] ERROR: Window 'Debug - SimpleGBeanDataTest.java - Eclipse SDK' didn't appear for 200
sec!
""""

svn.revision=598265
BUILD FAILED:
	Ant Error Message:
/export/users/cc/cc-EGAx48/scripts/cc-exec-adaptor.xml:104: The following error occurred while
executing this line: /export/users/cc/cc-EGAx48/adaptors/ega/adaptor.xml:58: EGA scenario
failed.

Date of build:	2007-11-27 15:15:27 +0600
Time to build:	22 minutes 43 seconds
Last changed:	11/27/2007 14:53:34
Last log entry:	snapshot

***********************************************************
Errors/Warnings:	(247)
            
[exec] Result: 25
[echo]
[echo]
[echo] ========================== EGA.log =======================
[echo]
[echo] --- Automated EGA scenario for Eclipse 3.2.1 ---
[echo]
[echo]
[echo] Eclipse Home = /export/users/cc/cc-EGAx48/build/libs/eclipse-3.2.l-lnx-x86/eclipse
[echo] Tested JRE Home = /export/users/cc/cc-EGAx48/build/checkouts/snapshot/hdk/jdk
[echo] OS_ARCH = x86
[echo]
[echo] Tested JRE options for Eclipse launching = -showversion -Xmx600M -Xms512M
[echo] Tested JRE options for debug step =
[echo]
[echo] Time frame for the scenario run = 48 hours
[echo] Delay factor = 2
[echo] Kill Eclipse if EGA scenario fails = 1
[echo] Start:
[echo] 	Run Eclipse
[echo] 	Select workspace
[echo] 	wait window 'Workspace Launcher' to appear ...
[echo] 	window 'Workspace Launcher' (23068765) appeared
[echo] 	Select /export/users/cc/cc-EGAx48/tests/ega/workspace as workspace
[echo] 	Press 'OK' button
[echo] 	wait window (23068765) to close ...
[echo] 	window (23068765) successfully closed
[echo]
[echo] Prepare Eclipse environment:
[echo] 	Close Welcome page
[echo] 	wait window 'Java - Eclipse SDK' to appear ...
[echo] 	window 'Java - Eclipse SDK' (23069270) appeared
[echo] 	Uncheck Project->Build Automatically
[echo] 	Select Window->Preferences
[echo] 	wait window 'Preferences' to appear ...
[echo] 	window 'Preferences' (23071412) appeared
[echo] 	Select Java->Build Path->Classpath Variables
[echo] 	Create M2_REPO variable
[echo] 	wait window 'New Variable Entry' to appear ...
[echo] 	window 'New Variable Entry' (23072451) appeared
[echo] 	Set M2_REPO value to /export/users/cc/cc-EGAx48/tests/ega/project/.m2/repository
[echo] 	Press OK button
[echo] 	wait window (23072451) to close ...
[echo] 	window (23072451) successfully closed
[echo] 	Press OK button to apply new preferences
[echo] 	wait window (23071412) to close ...
[echo] 	window (23071412) successfully closed
[echo] 	wait window 'Java - Eclipse SDK' to appear ...
[echo] 	window 'Java - Eclipse SDK' (23069270) appeared
[echo]
[echo] Import geronimo modules into workspace:
[echo] 	Select File->Import...
[echo] 	wait window 'Import' to appear ...
[echo] 	window 'Import' (23075163) appeared
[echo] 	Select import existing project
[echo] 	Type path to search projects: /export/users/cc/cc-EGAx48/tests/ega/project/geronimo-1.2-beta/modules
[echo] 	Uncheck all builders
[echo] 	Import
[echo] 	wait window (23075163) to close ...
[echo] 	window (23075163) successfully closed
[echo]
[echo] Import testsupport module into workspace:
[echo] 	wait window 'Java - Eclipse SDK' to appear ...
[echo] 	window 'Java - Eclipse SDK' (23069270) appeared
[echo] 	Select File->Import...
[echo] 	wait window 'Import' to appear ...
[echo] 	window 'Import' (23083998) appeared
[echo] 	Select import existing project
[echo] 	Type path to search projects: /export/users/cc/cc-EGAx48/tests/ega/project/geronimo-1.2-beta/testsupport
[echo] 	Import
[echo] 	wait window (23083998) to close ...
[echo] 	window (23083998) successfully closed
[echo]
[echo] Start repetable part:
[echo]
[echo] -------------------- Iteration 1 start ------------------
[echo]
[echo] Clean all Geronimo modules:
[echo] 	wait window 'Java - Eclipse SDK' to appear ...
[echo] 	window 'Java - Eclipse SDK' (23069270) appeared
[echo] 	Select Project->Clean...
[echo] 	wait window 'Clean' to appear ...
[echo] 	window 'Clean' (23087539) appeared
[echo] 	Uncheck start build immediatelly
[echo] 	wait window (23087539) to close ...
[echo] 	window (23087539) successfully closed
[echo]
[echo] Build all Geronimo modules:
[echo] 	wait window 'Java - Eclipse SDK' to appear ...
[echo] 	window 'Java - Eclipse SDK' (23069270) appeared
[echo] 	Select Project->Build All
[echo] 	wait window 'Building Workspace' to appear ...
[echo] 	window 'Building Workspace' (23088689) appeared
[echo] 	wait window (23088689) to close ...
[echo] 	window (23088689) successfully closed
[echo] 	wait window 'Java - Eclipse SDK' to appear ...
[echo] 	window 'Java - Eclipse SDK' (23069270) appeared
[echo]
[echo] Open Navigator view:
[echo]
[echo] Fix org.apache.geronimo.common.propertyeditor.PropertyEditorsTest:
[echo] 	Select 'Navigate->Open Resource'
[echo] 	wait window 'Open Resource' to appear ...
[echo] 	window 'Open Resource' (23097395) appeared
[echo] 	Type PropertyEditorsTest.java into 'Open Resource' dialog
[echo] 	wait window (23097395) to close ...
[echo] 	window (23097395) successfully closed
[echo] 	wait window 'Java - PropertyEditorsTest.java - Eclipse SDK' to appear ...
[echo] 	window 'Java - PropertyEditorsTest.java - Eclipse SDK' (23069270) appeared
[echo] 	Go to line 'protected void setUp() throws Exception {'
[echo] 	wait window 'Go to Line' to appear ...
[echo] 	window 'Go to Line' (23099018) appeared
[echo] 	wait window (23099018) to close ...
[echo] 	window (23099018) successfully closed
[echo] 	wait window 'Java - PropertyEditorsTest.java - Eclipse SDK' to appear ...
[echo] 	window 'Java - PropertyEditorsTest.java - Eclipse SDK' (23069270) appeared
[echo] 	Add line Class.forName("org.apache.geronimo.common.propertyeditor.PropertyEditors");
to setUp() method
[echo] 	Save PropertyEditorsTest.java
[echo] 	Close PropertyEditorsTest.java
[echo] 	wait window 'Java - Eclipse SDK' to appear ...
[echo] 	window 'Java - Eclipse SDK' (23069270) appeared
[echo]
[echo] Run JUnit tests from geronimo-common module:
[echo] 	Select geronimo-common module
[echo] 	Open Run->Run
[echo] 	wait window 'Run' to appear ...
[echo] 	window 'Run' (23103376) appeared
[echo] 	Create new JUnit run configuration
[echo] 	Run
[echo] 	wait window (23103376) to close ...
[echo] 	window (23103376) successfully closed
[echo]
[echo] Modify GBeanData class from geronimo-kernel module:
[echo] 	wait window 'Java - Eclipse SDK' to appear ...
[echo] 	window 'Java - Eclipse SDK' (23069270) appeared
[echo] 	Select geronimo-kernel module
[echo] 	Select Navigate->Go Into
[echo] 	Open GBeanData.java
[echo] 	wait window 'Java - GBeanData.java - Eclipse SDK' to appear ...
[echo] 	window 'Java - GBeanData.java - Eclipse SDK' (23069270) appeared
[echo] 	Select Edit->Find/Replace...
[echo] 	wait window 'Find/Replace' to appear ...
[echo] 	window 'Find/Replace' (23111070) appeared
[echo] 	Find getAbstractName() method
[echo] 	wait window (23111070) to close ...
[echo] 	window (23111070) successfully closed
[echo] 	Add System.out.println("Method getAbstractName() was called!");
[echo] 	Save Class.java
[echo]
[echo] Create JUnit test:
[echo] 	Open geronimo-kernel/src/test/java/org/apache/geronimo/gbean folder
[echo] 	Select File->New->JUnit Test Case
[echo] 	wait window 'New JUnit Test Case' to appear ...
[echo] 	window 'New JUnit Test Case' (23119462) appeared
[echo] 	Enter SimpleGBeanDataTest as test name
[echo] 	Enter org.apache.geronimo.gbean.GBeanData as class under test
[echo] 	Press Next button
[echo] 	Enter getAbstractName() as method under test
[echo] 	Press Finish button
[echo] 	wait window (23119462) to close ...
[echo] 	window (23119462) successfully closed
[echo] 	wait window 'Java - SimpleGBeanDataTest.java - Eclipse SDK' to appear ...
[echo] 	window 'Java - SimpleGBeanDataTest.java - Eclipse SDK' (23069270) appeared
[echo] 	Find string fail("Not yet implemented");
[echo] 	Delete string fail("Not yet implemented");
[echo] 	Add string System.out.println(new GBeanData().getAbstractName());
[echo] 	Save SimpleGBeanDataTest.java
[echo] 	Close SimpleGBeanDataTest.java
[echo] 	wait window 'Java - GBeanData.java - Eclipse SDK' to appear ...
[echo] 	window 'Java - GBeanData.java - Eclipse SDK' (23069270) appeared
[echo]
[echo] Build project:
[echo]
[echo] Run SimpleGBeanDataTest:
[echo] 	Select Run->Run As->JUnit Test
[echo]
[echo] Set breakpoint in GBeanData.java:
[echo] 	wait window 'Java - GBeanData.java - Eclipse SDK' to appear ...
[echo] 	window 'Java - GBeanData.java - Eclipse SDK' (23069270) appeared
[echo] 	Go to line: System.out.println("Method getAbstractName() was called!");
[echo] 	wait window 'Go to Line' to appear ...
[echo] 	window 'Go to Line' (23133257) appeared
[echo] 	wait window (23133257) to close ...
[echo] 	window (23133257) successfully closed
[echo] 	Set breakpoint
[echo]
[echo] Debug:
[echo] 	wait window 'Java - GBeanData.java - Eclipse SDK' to appear ...
[echo] 	window 'Java - GBeanData.java - Eclipse SDK' (23069270) appeared
[echo] 	Select Run->Debug...
[echo] 	wait window 'Debug' to appear ...
[echo] 	window 'Debug' (23135050) appeared
[echo] 	Select SimpleGBeanDataTest run configuration
[echo] 	Press Debug button
[echo] 	wait window (23135050) to close ...
[echo] 	window (23135050) successfully closed
[echo] 	wait window 'Confirm Perspective Switch' to appear ...
[echo] 	window 'Confirm Perspective Switch' (23138409) appeared
[echo] 	Press Yes button
[echo] 	wait window (23138409) to close ...
[echo] 	window (23138409) successfully closed
[echo] 	Step over
[echo] 	Step over
[echo] 	wait window 'Debug - SimpleGBeanDataTest.java - Eclipse SDK' to appear ...
[echo]
[echo] ERROR: Window 'Debug - SimpleGBeanDataTest.java - Eclipse SDK' didn't appear for 200
sec!
[echo]
[echo] Print error screen picture:
[echo] 	Picture was saved to /export/users/cc/cc-EGAx48/build/results/ega/20071127_0315/error.xwd
[echo] 	Please, use command 'xwud -in ./error.xwd' to view the error screen picture
[echo]
[echo] Kill Eclipse:
[echo] 	Found 1 Eclipse processes
[echo] 	Process 0:
[echo] 	Eclipse process was killed
[echo]
[echo]
[echo] EGA FAILED!



-- 
This message is automatically generated by JIRA.
-
You can reply to this email to add a comment to the issue online.


Mime
View raw message