harmony-commits mailing list archives

Site index · List index
Message view « Date » · « Thread »
Top « Date » · « Thread »
From "Stepan Mishura (JIRA)" <j...@apache.org>
Subject [jira] Commented: (HARMONY-3903) [testing] BT 2.0 adapter for Functional test suite
Date Wed, 20 Jun 2007 09:08:26 GMT

    [ https://issues.apache.org/jira/browse/HARMONY-3903?page=com.atlassian.jira.plugin.system.issuetabpanels:comment-tabpanel#action_12506458
] 

Stepan Mishura commented on HARMONY-3903:
-----------------------------------------

The infra fails to run funcational suite(r549004) with the following log. Could you check?

Compile_core:
    [javac] Compiling 75 source files to /export/users/smishura/buildtest/branches/2.0/tests/tools/VMTT.dest
    [javac] Note: Some input files use unchecked or unsafe operations.
    [javac] Note: Recompile with -Xlint:unchecked for details.

Jar:
      [jar] Building jar: /export/users/smishura/buildtest/branches/2.0/tests/tools/VMTT.dest/bin/VMTT.jar

ZipVMTT:
      [zip] Building zip: /export/users/smishura/buildtest/branches/2.0/tests/tools/VMTT.dest/VMTT.zip

Default:
     [copy] Warning: Could not find file /export/users/smishura/buildtest/branches/2.0/tests/tools/VMTT.dest/bin/vmtt.jar
to copy.
     [java] Buildfile: build.xml

     [java] depends-check:

     [java] BUILD FAILED
     [java] /export/users/smishura/buildtest/branches/2.0/tests/functional/build.xml:387:
ERROR: Can not find VMTT  : '/export/users/smishura/buildtest/branches/2.0/build/libs/VMTT.jar'

     [java] Total time: 0 seconds
     [echo] 
     [echo] --------
     [echo] WARNING: Target setup of adaptor for Test Suite 'func' FAILED
     [echo] -------- with the following exception:
     [echo] The following error occurred while executing this line:
     [echo] /export/users/smishura/buildtest/branches/2.0/adaptors/func/adaptor.xml:110: The
following error occurred while executing this line:
     [echo] /export/users/smishura/buildtest/branches/2.0/scripts/framework.xml:1067: Java
returned: 1
   [delete] Deleting: /export/users/smishura/buildtest/branches/2.0/build/temp/null1449022487

check-status:
     [echo] 
     [echo] ------
     [echo] ERROR: Setup of Test Suite 'func' FAILED.
     [echo] ------

BUILD FAILED
/export/users/smishura/buildtest/branches/2.0/scripts/framework.xml:492: The following error
occurred while executing this line:
/export/users/smishura/buildtest/branches/2.0/scripts/framework.xml:819: There are Test Suites
failures

Total time: 5 minutes 12 seconds


> [testing] BT 2.0 adapter for Functional test suite
> --------------------------------------------------
>
>                 Key: HARMONY-3903
>                 URL: https://issues.apache.org/jira/browse/HARMONY-3903
>             Project: Harmony
>          Issue Type: Test
>          Components: build - test - ci
>            Reporter: Ilya Neverov
>            Assignee: Stepan Mishura
>            Priority: Minor
>         Attachments: func_bt20.patch, func_bt20.patch, func_ts.bt2.070517.zip
>
>
> I created BT 2.0 adapter for running Functional test suite [HARMONY-3528] in new build-test
infrastructure. The adapter was checked with recent revision of the BT 2.0 framework and with
recent HDK snapshots (ia32, Windows and Linux). That runs completed without BT2 errors but
some test failures occurred.
> This adapter was derived from sources of adapter for the VTS VM testsuite [HARMONY-3206].
And the Functional testsuite depends on some tools contributed along with the VTS VM testsuite
so that suites together form natural train for integration into tests tree of the build-test
infrastructure.
> Thank you
> -Ilya

-- 
This message is automatically generated by JIRA.
-
You can reply to this email to add a comment to the issue online.


Mime
View raw message