harmony-commits mailing list archives

Site index · List index
Message view « Date » · « Thread »
Top « Date » · « Thread »
From "Vladimir Ivanov (JIRA)" <j...@apache.org>
Subject [jira] Commented: (HARMONY-3870) [jdktools][tests] run of jdktools tests leads to debug window on WinXP
Date Wed, 16 May 2007 04:17:16 GMT

    [ https://issues.apache.org/jira/browse/HARMONY-3870?page=com.atlassian.jira.plugin.system.issuetabpanels:comment-tabpanel#action_12496188
] 

Vladimir Ivanov commented on HARMONY-3870:
------------------------------------------

In my case the call of java and java.exe give different results:
------------------------------------------------------
trunk\target\hdk\jdk\bin>java -version
Uncaught exception in main:
java.lang.NoClassDefFoundError: org/apache/harmony/tools/java/EXE/Main
Caused by: java.lang.ClassNotFoundException: org.apache.harmony.tools.java.EXE.Main
        at java.net.URLClassLoader.findClass(URLClassLoader.java:631)
        at java.lang.ClassLoader.loadClass(ClassLoader.java:554)
        at java.lang.ClassLoader$SystemClassLoader.loadClass(ClassLoader.java:942)
        at java.lang.ClassLoader.loadClass(ClassLoader.java:311)
FAILED to invoke JVM.
------------------------------------------------------
trunk\target\hdk\jdk\bin>java.exe -version
Apache Harmony Launcher : (c) Copyright 1991, 2006 The Apache Software Foundation or its licensors,
as applicable.
java version "1.5.0"
pre-alpha : not complete or compatible
svn = r538406, (May 16 2007), Windows/ia32/msvc 1310, release build
http://incubator.apache.org/harmony
-----------------------------------------------------

I'll check that SAMSA module call 'java.exe' instead of 'java'

 thanks, Vladimir

> [jdktools][tests] run of jdktools tests leads to debug window on WinXP
> ----------------------------------------------------------------------
>
>                 Key: HARMONY-3870
>                 URL: https://issues.apache.org/jira/browse/HARMONY-3870
>             Project: Harmony
>          Issue Type: Bug
>          Components: JDK
>            Reporter: Vladimir Ivanov
>         Attachments: screenshot-1.jpg
>
>
> run of jdktools tests on HDK leads to debug window on WinXP if runtime specified as "-Dtest.jre.home=HDK/jdk"
> Note it works fine on JRE ("-Dtest.jre.home=HDK/jdk/jre").
> -------------- execution log -----------------------
>      [exec] run-tests:
>      [exec]      [echo] Running SAMSA tests
>      [exec]      [echo] test.jre.home=C:\cruise_hdk\cc\projects\trunk\target\hdk\jdk\jre
>      [exec]      [echo] Run jdk/bin/java -version in C:\cruise_hdk\cc\projects\trunk\working_jdktools\build\test_report
>      
>      [exec] BUILD FAILED
>      [exec] C:\cruise_hdk\cc\projects\trunk\working_jdktools\build.xml:242: The following
error occurred while executing this line:
>      [exec] C:\cruise_hdk\cc\projects\trunk\working_jdktools\make\build-test.xml:60:
The following error occurred while executing this line:
>      [exec] C:\cruise_hdk\cc\projects\trunk\working_jdktools\make\properties.xml:319:
The following error occurred while executing this line:
>      [exec] C:\cruise_hdk\cc\projects\trunk\working_jdktools\modules\samsa\build.xml:121:
exec returned: -1073741819
> ---------------------------

-- 
This message is automatically generated by JIRA.
-
You can reply to this email to add a comment to the issue online.


Mime
View raw message