harmony-commits mailing list archives: December 2006

Site index · List index
Message list« Previous · 1 · 2 · 3 · 4 · 5 · 6 · 7 · 8 · 9 · 10 · 11 · 12 · 13 · 14 · 15 · 16 · 17 · 18 · 19 · 20 · 21 · 22 · 23 · 24 · 25 · 26 · 27 · 28 · 29 · 30 · 31 · 32 · 33 · 34 · 35 · 36 · 37 · 38 · 39 · 40 · 41 · 42 · 43 · 44 · 45 · 46 · 47 · 48 · 49 · 50 · 51 · 52 · 53 · 54 · 55 · 56 · 57 · 58 · 59 · 60 · 61 · 62 · 63 · 64 · 65 · 66 · Next »Thread · Author · Date
Gregory Shimansky (JIRA) [jira] Assigned: (HARMONY-2392) [drlvm][jvmti] Breakpoints refer to deleted methods when deleting Global_Env Fri, 01 Dec, 14:47
Gregory Shimansky (JIRA) [jira] Assigned: (HARMONY-2394) [drlvm][verifier] VM throws VerifyError when uninitialized object is used in aload/astore instructions Fri, 01 Dec, 14:49
Eugene S. Ostrovsky (JIRA) [jira] Updated: (HARMONY-2377) [drlvm][jvmti] TI events are generated by VM in the incorrect order Fri, 01 Dec, 14:58
Geir Magnusson Jr (JIRA) [jira] Assigned: (HARMONY-2390) [drlvm] SystemTest.testEnvUnmodifiable() fails Fri, 01 Dec, 14:58
Mikhail Fursov (JIRA) [jira] Created: (HARMONY-2396) [drlvm][jit] Jitrino fails to run SpecJBB2005 in -Xem:opt mode Fri, 01 Dec, 15:26
ge...@apache.org svn commit: r481272 - in /harmony/enhanced/drlvm/trunk/vm/vmcore/src/kernel_classes: javasrc/java/lang/System.java javasrc/java/lang/VMExecutionEngine.java native/java_lang_VMExecutionEngine.cpp native/java_lang_VMExecutionEngine.h Fri, 01 Dec, 16:13
Geir Magnusson Jr (JIRA) [jira] Resolved: (HARMONY-2390) [drlvm] SystemTest.testEnvUnmodifiable() fails Fri, 01 Dec, 16:14
Miguel Montes (JIRA) [jira] Updated: (HARMONY-2354) [classlib][html][parser] ContentModelCompatilityTest fails Fri, 01 Dec, 16:18
apetre...@apache.org svn commit: r481324 - /harmony/enhanced/drlvm/trunk/vm/vmcore/src/kernel_classes/javasrc/java/lang/Class.java Fri, 01 Dec, 17:58
[build-test alert] BUILD FAILED WinXP SP2 1CPU msvc debug: drlvm tests
nom...@intel.com   [build-test alert] BUILD FAILED WinXP SP2 1CPU msvc debug: drlvm tests Fri, 01 Dec, 18:05
nom...@intel.com   [build-test alert] BUILD FAILED WinXP SP2 1CPU msvc debug: drlvm tests Tue, 05 Dec, 12:29
Alexey Petrenko (JIRA) [jira] Assigned: (HARMONY-2354) [classlib][html][parser] ContentModelCompatilityTest fails Fri, 01 Dec, 18:31
Alexey Petrenko (JIRA) [jira] Assigned: (HARMONY-2374) [classlib][awt] Missing java2d code for OpenGL pipeline. Fri, 01 Dec, 18:31
[build-test alert] BUILD FIXED linux SUSE 9 gcc debug: classlib over drlvm
nom...@intel.com   [build-test alert] BUILD FIXED linux SUSE 9 gcc debug: classlib over drlvm Fri, 01 Dec, 18:49
nom...@intel.com   [build-test alert] BUILD FIXED linux SUSE 9 gcc debug: classlib over drlvm Sun, 03 Dec, 21:50
nom...@intel.com   [build-test alert] BUILD FIXED linux SUSE 9 gcc debug: classlib over drlvm Mon, 04 Dec, 14:10
nom...@intel.com   [build-test alert] BUILD FIXED linux SUSE 9 gcc debug: classlib over drlvm Tue, 05 Dec, 01:39
nom...@intel.com   [build-test alert] BUILD FIXED linux SUSE 9 gcc debug: classlib over drlvm Tue, 05 Dec, 14:57
[build-test alert] BUILD FIXED WinXP SP2 1CPU msvc debug: classlib over drlvm
nom...@intel.com   [build-test alert] BUILD FIXED WinXP SP2 1CPU msvc debug: classlib over drlvm Fri, 01 Dec, 19:29
nom...@intel.com   [build-test alert] BUILD FIXED WinXP SP2 1CPU msvc debug: classlib over drlvm Sat, 02 Dec, 09:08
nom...@intel.com   [build-test alert] BUILD FIXED WinXP SP2 1CPU msvc debug: classlib over drlvm Sun, 03 Dec, 19:01
nom...@intel.com   [build-test alert] BUILD FIXED WinXP SP2 1CPU msvc debug: classlib over drlvm Mon, 04 Dec, 16:47
nom...@intel.com   [build-test alert] BUILD FIXED WinXP SP2 1CPU msvc debug: classlib over drlvm Tue, 05 Dec, 18:30
hinde...@apache.org svn commit: r481418 - in /harmony/enhanced/classlib/trunk/depends/build: defines.mak defines.mk rules.mak rules.mk Fri, 01 Dec, 21:56
Mark Hindess (JIRA) [jira] Closed: (HARMONY-2323) [classlib][sql] javax.sql.rowset.serial.SerialRef is not implemented yet in Harmony. Fri, 01 Dec, 22:30
[continuum] BUILD FAILURE: Classlib/linux.ia32 Build/Test
nom...@hursley.ibm.com   [continuum] BUILD FAILURE: Classlib/linux.ia32 Build/Test Fri, 01 Dec, 23:16
nom...@hursley.ibm.com   [continuum] BUILD FAILURE: Classlib/linux.ia32 Build/Test Sat, 02 Dec, 21:12
nom...@hursley.ibm.com   [continuum] BUILD FAILURE: Classlib/linux.ia32 Build/Test Sun, 03 Dec, 04:04
nom...@hursley.ibm.com   [continuum] BUILD FAILURE: Classlib/linux.ia32 Build/Test Sun, 03 Dec, 19:06
nom...@hursley.ibm.com   [continuum] BUILD FAILURE: Classlib/linux.ia32 Build/Test Sun, 03 Dec, 20:58
nom...@hursley.ibm.com   [continuum] BUILD FAILURE: Classlib/linux.ia32 Build/Test Sun, 03 Dec, 23:05
nom...@hursley.ibm.com   [continuum] BUILD FAILURE: Classlib/linux.ia32 Build/Test Mon, 04 Dec, 06:12
nom...@hursley.ibm.com   [continuum] BUILD FAILURE: Classlib/linux.ia32 Build/Test Mon, 04 Dec, 22:03
nom...@hursley.ibm.com   [continuum] BUILD FAILURE: Classlib/linux.ia32 Build/Test Tue, 05 Dec, 08:14
nom...@hursley.ibm.com   [continuum] BUILD FAILURE: Classlib/linux.ia32 Build/Test Tue, 05 Dec, 09:59
nom...@hursley.ibm.com   [continuum] BUILD FAILURE: Classlib/linux.ia32 Build/Test Tue, 05 Dec, 11:04
nom...@hursley.ibm.com   [continuum] BUILD FAILURE: Classlib/linux.ia32 Build/Test Tue, 05 Dec, 13:04
nom...@hursley.ibm.com   [continuum] BUILD FAILURE: Classlib/linux.ia32 Build/Test Tue, 05 Dec, 15:05
nom...@hursley.ibm.com   [continuum] BUILD FAILURE: Classlib/linux.ia32 Build/Test Tue, 05 Dec, 19:04
nom...@hursley.ibm.com   [continuum] BUILD FAILURE: Classlib/linux.ia32 Build/Test Tue, 05 Dec, 21:05
nom...@hursley.ibm.com   [continuum] BUILD FAILURE: Classlib/linux.ia32 Build/Test Wed, 06 Dec, 01:58
nom...@hursley.ibm.com   [continuum] BUILD FAILURE: Classlib/linux.ia32 Build/Test Wed, 06 Dec, 07:18
nom...@hursley.ibm.com   [continuum] BUILD FAILURE: Classlib/linux.ia32 Build/Test Wed, 06 Dec, 08:58
nom...@hursley.ibm.com   [continuum] BUILD FAILURE: Classlib/linux.ia32 Build/Test Wed, 06 Dec, 14:04
nom...@hursley.ibm.com   [continuum] BUILD FAILURE: Classlib/linux.ia32 Build/Test Fri, 08 Dec, 11:28
nom...@hursley.ibm.com   [continuum] BUILD FAILURE: Classlib/linux.ia32 Build/Test Mon, 11 Dec, 08:13
nom...@hursley.ibm.com   [continuum] BUILD FAILURE: Classlib/linux.ia32 Build/Test Mon, 11 Dec, 19:06
nom...@hursley.ibm.com   [continuum] BUILD FAILURE: Classlib/linux.ia32 Build/Test Tue, 12 Dec, 09:11
nom...@hursley.ibm.com   [continuum] BUILD FAILURE: Classlib/linux.ia32 Build/Test Tue, 12 Dec, 12:04
nom...@hursley.ibm.com   [continuum] BUILD FAILURE: Classlib/linux.ia32 Build/Test Wed, 13 Dec, 00:18
nom...@hursley.ibm.com   [continuum] BUILD FAILURE: Classlib/linux.ia32 Build/Test Wed, 13 Dec, 22:11
nom...@hursley.ibm.com   [continuum] BUILD FAILURE: Classlib/linux.ia32 Build/Test Thu, 14 Dec, 07:08
nom...@hursley.ibm.com   [continuum] BUILD FAILURE: Classlib/linux.ia32 Build/Test Thu, 14 Dec, 09:19
nom...@hursley.ibm.com   [continuum] BUILD FAILURE: Classlib/linux.ia32 Build/Test Thu, 14 Dec, 14:05
nom...@hursley.ibm.com   [continuum] BUILD FAILURE: Classlib/linux.ia32 Build/Test Thu, 14 Dec, 17:19
nom...@hursley.ibm.com   [continuum] BUILD FAILURE: Classlib/linux.ia32 Build/Test Thu, 14 Dec, 19:18
nom...@hursley.ibm.com   [continuum] BUILD FAILURE: Classlib/linux.ia32 Build/Test Fri, 15 Dec, 07:07
nom...@hursley.ibm.com   [continuum] BUILD FAILURE: Classlib/linux.ia32 Build/Test Fri, 15 Dec, 12:19
nom...@hursley.ibm.com   [continuum] BUILD FAILURE: Classlib/linux.ia32 Build/Test Fri, 15 Dec, 16:17
nom...@hursley.ibm.com   [continuum] BUILD FAILURE: Classlib/linux.ia32 Build/Test Sat, 16 Dec, 14:07
nom...@hursley.ibm.com   [continuum] BUILD FAILURE: Classlib/linux.ia32 Build/Test Sun, 17 Dec, 07:07
nom...@hursley.ibm.com   [continuum] BUILD FAILURE: Classlib/linux.ia32 Build/Test Mon, 18 Dec, 06:04
nom...@hursley.ibm.com   [continuum] BUILD FAILURE: Classlib/linux.ia32 Build/Test Tue, 19 Dec, 05:04
nom...@hursley.ibm.com   [continuum] BUILD FAILURE: Classlib/linux.ia32 Build/Test Tue, 19 Dec, 06:01
nom...@hursley.ibm.com   [continuum] BUILD FAILURE: Classlib/linux.ia32 Build/Test Tue, 19 Dec, 07:02
nom...@hursley.ibm.com   [continuum] BUILD FAILURE: Classlib/linux.ia32 Build/Test Tue, 19 Dec, 08:01
nom...@hursley.ibm.com   [continuum] BUILD FAILURE: Classlib/linux.ia32 Build/Test Tue, 19 Dec, 09:01
nom...@hursley.ibm.com   [continuum] BUILD FAILURE: Classlib/linux.ia32 Build/Test Wed, 20 Dec, 07:09
[continuum] BUILD ERROR: Classlib/linux.ia32 Build/Test
nom...@hursley.ibm.com   [continuum] BUILD ERROR: Classlib/linux.ia32 Build/Test Sat, 02 Dec, 00:00
nom...@hursley.ibm.com   [continuum] BUILD ERROR: Classlib/linux.ia32 Build/Test Mon, 04 Dec, 00:00
nom...@hursley.ibm.com   [continuum] BUILD ERROR: Classlib/linux.ia32 Build/Test Wed, 06 Dec, 00:00
nom...@hursley.ibm.com   [continuum] BUILD ERROR: Classlib/linux.ia32 Build/Test Thu, 07 Dec, 00:00
nom...@hursley.ibm.com   [continuum] BUILD ERROR: Classlib/linux.ia32 Build/Test Sun, 10 Dec, 00:00
nom...@hursley.ibm.com   [continuum] BUILD ERROR: Classlib/linux.ia32 Build/Test Mon, 11 Dec, 00:00
nom...@hursley.ibm.com   [continuum] BUILD ERROR: Classlib/linux.ia32 Build/Test Tue, 12 Dec, 00:00
nom...@hursley.ibm.com   [continuum] BUILD ERROR: Classlib/linux.ia32 Build/Test Thu, 14 Dec, 00:00
nom...@hursley.ibm.com   [continuum] BUILD ERROR: Classlib/linux.ia32 Build/Test Fri, 15 Dec, 00:00
nom...@hursley.ibm.com   [continuum] BUILD ERROR: Classlib/linux.ia32 Build/Test Sat, 16 Dec, 00:00
nom...@hursley.ibm.com   [continuum] BUILD ERROR: Classlib/linux.ia32 Build/Test Sun, 17 Dec, 00:00
nom...@hursley.ibm.com   [continuum] BUILD ERROR: Classlib/linux.ia32 Build/Test Mon, 18 Dec, 00:00
nom...@hursley.ibm.com   [continuum] BUILD ERROR: Classlib/linux.ia32 Build/Test Mon, 18 Dec, 12:47
nom...@hursley.ibm.com   [continuum] BUILD ERROR: Classlib/linux.ia32 Build/Test Mon, 18 Dec, 13:07
nom...@hursley.ibm.com   [continuum] BUILD ERROR: Classlib/linux.ia32 Build/Test Mon, 18 Dec, 14:07
nom...@hursley.ibm.com   [continuum] BUILD ERROR: Classlib/linux.ia32 Build/Test Mon, 18 Dec, 14:55
nom...@hursley.ibm.com   [continuum] BUILD ERROR: Classlib/linux.ia32 Build/Test Mon, 18 Dec, 14:55
nom...@hursley.ibm.com   [continuum] BUILD ERROR: Classlib/linux.ia32 Build/Test Mon, 18 Dec, 15:07
nom...@hursley.ibm.com   [continuum] BUILD ERROR: Classlib/linux.ia32 Build/Test Tue, 19 Dec, 00:00
nom...@hursley.ibm.com   [continuum] BUILD ERROR: Classlib/linux.ia32 Build/Test Wed, 20 Dec, 00:00
[build-test alert] BUILD FAILED linux SUSE 9 gcc debug: classlib
nom...@intel.com   [build-test alert] BUILD FAILED linux SUSE 9 gcc debug: classlib Sat, 02 Dec, 00:34
nom...@intel.com   [build-test alert] BUILD FAILED linux SUSE 9 gcc debug: classlib Sat, 02 Dec, 20:21
nom...@intel.com   [build-test alert] BUILD FAILED linux SUSE 9 gcc debug: classlib Sun, 03 Dec, 22:48
nom...@intel.com   [build-test alert] BUILD FAILED linux SUSE 9 gcc debug: classlib Mon, 04 Dec, 05:12
nom...@intel.com   [build-test alert] BUILD FAILED linux SUSE 9 gcc debug: classlib Mon, 04 Dec, 11:42
nom...@intel.com   [build-test alert] BUILD FAILED linux SUSE 9 gcc debug: classlib Mon, 04 Dec, 21:16
nom...@intel.com   [build-test alert] BUILD FAILED linux SUSE 9 gcc debug: classlib Tue, 05 Dec, 09:02
nom...@intel.com   [build-test alert] BUILD FAILED linux SUSE 9 gcc debug: classlib Tue, 05 Dec, 15:49
[build-test alert] BUILD FIXED WinXP SP2 1CPU msvc debug: classlib
nom...@intel.com   [build-test alert] BUILD FIXED WinXP SP2 1CPU msvc debug: classlib Sat, 02 Dec, 04:54
nom...@intel.com   [build-test alert] BUILD FIXED WinXP SP2 1CPU msvc debug: classlib Mon, 04 Dec, 18:58
nom...@intel.com   [build-test alert] BUILD FIXED WinXP SP2 1CPU msvc debug: classlib Tue, 05 Dec, 14:43
[build-test alert] BUILD FAILED WinXP SP2 1CPU msvc debug: classlib over drlvm
nom...@intel.com   [build-test alert] BUILD FAILED WinXP SP2 1CPU msvc debug: classlib over drlvm Sat, 02 Dec, 07:03
nom...@intel.com   [build-test alert] BUILD FAILED WinXP SP2 1CPU msvc debug: classlib over drlvm Sat, 02 Dec, 21:59
nom...@intel.com   [build-test alert] BUILD FAILED WinXP SP2 1CPU msvc debug: classlib over drlvm Mon, 04 Dec, 13:48
nom...@intel.com   [build-test alert] BUILD FAILED WinXP SP2 1CPU msvc debug: classlib over drlvm Tue, 05 Dec, 12:30
nom...@intel.com   [build-test alert] BUILD FAILED WinXP SP2 1CPU msvc debug: classlib over drlvm Wed, 06 Dec, 08:37
hinde...@apache.org svn commit: r481540 - in /harmony/enhanced/classlib/trunk/modules/portlib/src/main/native/port: linux/hysock.c windows/hysock.c Sat, 02 Dec, 10:14
hinde...@apache.org svn commit: r481541 - /harmony/enhanced/classlib/trunk/modules/portlib/src/main/native/port/linux/hysock.c Sat, 02 Dec, 10:16
[continuum] BUILD SUCCESSFUL: Classlib/linux.ia32 Build/Test
nom...@hursley.ibm.com   [continuum] BUILD SUCCESSFUL: Classlib/linux.ia32 Build/Test Sat, 02 Dec, 12:06
nom...@hursley.ibm.com   [continuum] BUILD SUCCESSFUL: Classlib/linux.ia32 Build/Test Sun, 03 Dec, 00:04
nom...@hursley.ibm.com   [continuum] BUILD SUCCESSFUL: Classlib/linux.ia32 Build/Test Mon, 04 Dec, 02:04
nom...@hursley.ibm.com   [continuum] BUILD SUCCESSFUL: Classlib/linux.ia32 Build/Test Mon, 04 Dec, 12:05
nom...@hursley.ibm.com   [continuum] BUILD SUCCESSFUL: Classlib/linux.ia32 Build/Test Tue, 05 Dec, 00:02
nom...@hursley.ibm.com   [continuum] BUILD SUCCESSFUL: Classlib/linux.ia32 Build/Test Wed, 06 Dec, 10:03
nom...@hursley.ibm.com   [continuum] BUILD SUCCESSFUL: Classlib/linux.ia32 Build/Test Wed, 06 Dec, 16:04
nom...@hursley.ibm.com   [continuum] BUILD SUCCESSFUL: Classlib/linux.ia32 Build/Test Thu, 07 Dec, 06:57
nom...@hursley.ibm.com   [continuum] BUILD SUCCESSFUL: Classlib/linux.ia32 Build/Test Fri, 08 Dec, 13:04
nom...@hursley.ibm.com   [continuum] BUILD SUCCESSFUL: Classlib/linux.ia32 Build/Test Mon, 11 Dec, 03:59
nom...@hursley.ibm.com   [continuum] BUILD SUCCESSFUL: Classlib/linux.ia32 Build/Test Mon, 11 Dec, 15:05
nom...@hursley.ibm.com   [continuum] BUILD SUCCESSFUL: Classlib/linux.ia32 Build/Test Tue, 12 Dec, 06:59
nom...@hursley.ibm.com   [continuum] BUILD SUCCESSFUL: Classlib/linux.ia32 Build/Test Tue, 12 Dec, 13:58
nom...@hursley.ibm.com   [continuum] BUILD SUCCESSFUL: Classlib/linux.ia32 Build/Test Wed, 13 Dec, 06:05
nom...@hursley.ibm.com   [continuum] BUILD SUCCESSFUL: Classlib/linux.ia32 Build/Test Thu, 14 Dec, 10:58
nom...@hursley.ibm.com   [continuum] BUILD SUCCESSFUL: Classlib/linux.ia32 Build/Test Thu, 14 Dec, 20:58
nom...@hursley.ibm.com   [continuum] BUILD SUCCESSFUL: Classlib/linux.ia32 Build/Test Fri, 15 Dec, 08:57
nom...@hursley.ibm.com   [continuum] BUILD SUCCESSFUL: Classlib/linux.ia32 Build/Test Fri, 15 Dec, 14:05
nom...@hursley.ibm.com   [continuum] BUILD SUCCESSFUL: Classlib/linux.ia32 Build/Test Fri, 15 Dec, 18:05
nom...@hursley.ibm.com   [continuum] BUILD SUCCESSFUL: Classlib/linux.ia32 Build/Test Sun, 17 Dec, 23:06
nom...@hursley.ibm.com   [continuum] BUILD SUCCESSFUL: Classlib/linux.ia32 Build/Test Mon, 18 Dec, 05:06
nom...@hursley.ibm.com   [continuum] BUILD SUCCESSFUL: Classlib/linux.ia32 Build/Test Mon, 18 Dec, 11:21
nom...@hursley.ibm.com   [continuum] BUILD SUCCESSFUL: Classlib/linux.ia32 Build/Test Mon, 18 Dec, 18:42
nom...@hursley.ibm.com   [continuum] BUILD SUCCESSFUL: Classlib/linux.ia32 Build/Test Tue, 19 Dec, 15:01
nom...@hursley.ibm.com   [continuum] BUILD SUCCESSFUL: Classlib/linux.ia32 Build/Test Wed, 20 Dec, 02:05
nom...@hursley.ibm.com   [continuum] BUILD SUCCESSFUL: Classlib/linux.ia32 Build/Test Wed, 20 Dec, 13:52
[build-test alert] BUILD FAILED WinXP SP2 1CPU msvc debug: classlib
nom...@intel.com   [build-test alert] BUILD FAILED WinXP SP2 1CPU msvc debug: classlib Sat, 02 Dec, 12:41
nom...@intel.com   [build-test alert] BUILD FAILED WinXP SP2 1CPU msvc debug: classlib Mon, 04 Dec, 21:57
hinde...@apache.org svn commit: r481564 - /harmony/enhanced/classlib/trunk/modules/portlib/src/main/native/port/linux/x86_64/hysignal_context.c Sat, 02 Dec, 14:32
[build-test alert] BUILD FAILED linux SUSE 9 gcc debug: classlib over drlvm
nom...@intel.com   [build-test alert] BUILD FAILED linux SUSE 9 gcc debug: classlib over drlvm Sat, 02 Dec, 19:30
nom...@intel.com   [build-test alert] BUILD FAILED linux SUSE 9 gcc debug: classlib over drlvm Mon, 04 Dec, 10:53
nom...@intel.com   [build-test alert] BUILD FAILED linux SUSE 9 gcc debug: classlib over drlvm Mon, 04 Dec, 21:22
nom...@intel.com   [build-test alert] BUILD FAILED linux SUSE 9 gcc debug: classlib over drlvm Tue, 05 Dec, 11:39
nom...@intel.com   [build-test alert] BUILD FAILED linux SUSE 9 gcc debug: classlib over drlvm Wed, 06 Dec, 12:16
apetre...@apache.org svn commit: r481609 - in /harmony/enhanced/classlib/trunk/modules/swing: make/ src/main/java/common/javax/swing/text/html/parser/ Sat, 02 Dec, 19:31
hinde...@apache.org svn commit: r481644 - in /harmony/enhanced/classlib/trunk/modules/portlib/src/main/native/port/linux: ./ ia64/ linux.ia64/ linux.x86/ linux.x86_64/ x86/ x86_64/ Sat, 02 Dec, 22:22
hinde...@apache.org svn commit: r481691 - /harmony/enhanced/classlib/trunk/modules/luni/build.xml Sun, 03 Dec, 02:59
Andrew Zhang (JIRA) [jira] Created: (HARMONY-2397) [classlib][sql] javax.sql.rowset.serial.SerialDatalink is not implemented yet in Harmony. Sun, 03 Dec, 03:33
Andrew Zhang (JIRA) [jira] Updated: (HARMONY-2397) [classlib][sql] javax.sql.rowset.serial.SerialDatalink is not implemented yet in Harmony. Sun, 03 Dec, 03:38
Xiao-Feng Li (JIRA) [jira] Created: (HARMONY-2398) [DRLVM][GC] patch for GCv5 alloc helper inlining Sun, 03 Dec, 08:19
[jira] Updated: (HARMONY-2398) [DRLVM][GC] patch for GCv5 alloc helper inlining
Xiao-Feng Li (JIRA)   [jira] Updated: (HARMONY-2398) [DRLVM][GC] patch for GCv5 alloc helper inlining Sun, 03 Dec, 08:21
Xiao-Feng Li (JIRA)   [jira] Updated: (HARMONY-2398) [DRLVM][GC] patch for GCv5 alloc helper inlining Tue, 05 Dec, 03:12
nom...@intel.com [build-test alert] BUILD FAILED linux SUSE 9 64 bit gcc debug: classlib over drlvm Sun, 03 Dec, 10:58
stef...@apache.org svn commit: r481797 - /harmony/enhanced/buildtest/trunk/build.xml Sun, 03 Dec, 16:33
stef...@apache.org svn commit: r481820 - /harmony/enhanced/classlib/trunk/make/depends.properties Sun, 03 Dec, 17:15
stef...@apache.org svn commit: r481830 - /harmony/enhanced/buildtest/trunk/build.xml Sun, 03 Dec, 17:29
Nathan Beyer (JIRA) [jira] Assigned: (HARMONY-2397) [classlib][sql] javax.sql.rowset.serial.SerialDatalink is not implemented yet in Harmony. Sun, 03 Dec, 19:02
ndbe...@apache.org svn commit: r481858 - in /harmony/enhanced/classlib/trunk/modules/sql/src: main/java/javax/sql/rowset/serial/ main/java/org/apache/harmony/sql/internal/nls/ test/java/org/apache/harmony/sql/tests/javax/sql/rowset/serial/ Sun, 03 Dec, 19:03
Message list« Previous · 1 · 2 · 3 · 4 · 5 · 6 · 7 · 8 · 9 · 10 · 11 · 12 · 13 · 14 · 15 · 16 · 17 · 18 · 19 · 20 · 21 · 22 · 23 · 24 · 25 · 26 · 27 · 28 · 29 · 30 · 31 · 32 · 33 · 34 · 35 · 36 · 37 · 38 · 39 · 40 · 41 · 42 · 43 · 44 · 45 · 46 · 47 · 48 · 49 · 50 · 51 · 52 · 53 · 54 · 55 · 56 · 57 · 58 · 59 · 60 · 61 · 62 · 63 · 64 · 65 · 66 · Next »Thread · Author · Date
Box list
Oct 20115
Sep 20111
Aug 20112
Jul 201117
Jun 20113
May 20111
Apr 20112
Mar 20114
Feb 20112
Jan 201111
Dec 201022
Nov 201091
Oct 2010178
Sep 2010615
Aug 2010357
Jul 2010447
Jun 2010441
May 2010220
Apr 2010277
Mar 2010439
Feb 2010228
Jan 2010171
Dec 2009150
Nov 2009228
Oct 2009483
Sep 2009299
Aug 2009341
Jul 2009536
Jun 2009485
May 2009361
Apr 2009695
Mar 2009189
Feb 2009188
Jan 2009247
Dec 2008346
Nov 2008231
Oct 2008166
Sep 2008312
Aug 2008252
Jul 2008403
Jun 2008383
May 2008723
Apr 20081465
Mar 20081205
Feb 20081117
Jan 2008934
Dec 20071396
Nov 20071890
Oct 20071733
Sep 20071336
Aug 20071515
Jul 20071864
Jun 20073026
May 20072530
Apr 20072185
Mar 20072652
Feb 20072031
Jan 20072963
Dec 20063629
Nov 20063413
Oct 20063036
Sep 20062851
Aug 20062717
Jul 20062255
Jun 20061714
May 20061325
Apr 20061356
Mar 2006917
Feb 2006190
Jan 2006233
Dec 2005122
Nov 2005258
Oct 2005153
Sep 200522
Aug 20053
Jul 20056
Jun 200512