harmony-commits mailing list archives: December 2006

Site index · List index
Message list« Previous · 1 · 2 · 3 · 4 · 5 · 6 · 7 · 8 · 9 · 10 · 11 · 12 · 13 · 14 · 15 · 16 · 17 · 18 · 19 · 20 · 21 · 22 · 23 · 24 · 25 · 26 · 27 · 28 · 29 · 30 · 31 · 32 · 33 · 34 · 35 · 36 · 37 · Next »Thread · Author · Date
nom...@intel.com [build-test alert] BUILD SUCCEEDED Windows XP SP2 msvc debug: classlib over ibmvm Fri, 15 Dec, 18:26
Alexander Kleymenov (JIRA) [jira] Commented: (HARMONY-2416) [drlvm][testing] JVM crash handling implementation Fri, 15 Dec, 18:32
nom...@intel.com [build-test alert] BUILD FAILED Linux SUSE 9 gcc debug: classlib over ibmvm Fri, 15 Dec, 18:59
Mikhail Markov (JIRA) [jira] Commented: (HARMONY-1967) [classlib][rmi] RMI runtime could not load class with null thread context classloader Fri, 15 Dec, 19:17
Mikhail Markov (JIRA) [jira] Commented: (HARMONY-1970) [classlib][rmi] Could not get proxy ActivationSystem via ActivationGroup.getSystem() method Fri, 15 Dec, 19:17
Alexei Zakharov (JIRA) [jira] Closed: (HARMONY-1967) [classlib][rmi] RMI runtime could not load class with null thread context classloader Fri, 15 Dec, 19:19
Alexei Zakharov (JIRA) [jira] Closed: (HARMONY-1970) [classlib][rmi] Could not get proxy ActivationSystem via ActivationGroup.getSystem() method Fri, 15 Dec, 19:21
Alexei Zakharov (JIRA) [jira] Updated: (HARMONY-1691) [claaslib][rmi]java.rmi.server.LogStream.write(byte[], int,int) does not throw IndexOutOfBoundsException in case of boundary violation Fri, 15 Dec, 19:23
nom...@intel.com [build-test alert] BUILD SUCCEEDED Linux SUSE 9 gcc debug: classlib over ibmvm Fri, 15 Dec, 21:26
nom...@hursley.ibm.com [continuum] BUILD ERROR: Classlib/linux.ia32 Build/Test Sat, 16 Dec, 00:00
Leo Li (JIRA) [jira] Commented: (HARMONY-2724) [classlib][security]AlgorithmParameters.init(byte[] params, String spec) throws NullPointerException while spec is Null on Harmony while not on RI. Sat, 16 Dec, 00:46
Anton Luht (JIRA) [jira] Commented: (HARMONY-828) Preferences.nodeExists() throws IllegalArgumentException on a long path Sat, 16 Dec, 08:24
Stepan Mishura (JIRA) [jira] Assigned: (HARMONY-2733) [java][security]AlgorithmParameters.getParamterSpec should throw NullPointerException if the input AlgorithmSpec class is null. Sat, 16 Dec, 11:28
Stepan Mishura (JIRA) [jira] Updated: (HARMONY-2733) [java][security]AlgorithmParameters.getParamterSpec should throw NullPointerException if the input AlgorithmSpec class is null. Sat, 16 Dec, 11:28
Stepan Mishura (JIRA) [jira] Assigned: (HARMONY-2676) [classlib][security]AlgorithmParameterGenerator.init() fails to throw InvalidParameterException while the input size is illegal for a specified algorithm while RI does. Sat, 16 Dec, 11:30
Stepan Mishura (JIRA) [jira] Updated: (HARMONY-2676) [classlib][security]AlgorithmParameterGenerator.init() fails to throw InvalidParameterException while the input size is illegal for a specified algorithm while RI does. Sat, 16 Dec, 11:30
Stepan Mishura (JIRA) [jira] Assigned: (HARMONY-2678) [classlib][security]AlgorithmParameters fails to getInstance from "OAEP" Sat, 16 Dec, 11:32
Stepan Mishura (JIRA) [jira] Updated: (HARMONY-2678) [classlib][security]AlgorithmParameters fails to getInstance from "OAEP" Sat, 16 Dec, 11:32
Stepan Mishura (JIRA) [jira] Assigned: (HARMONY-2750) [Classlib][crypto] Wrong words in crypto module Sat, 16 Dec, 11:46
smish...@apache.org svn commit: r487792 - in /harmony/enhanced/classlib/trunk/modules/crypto/src: main/java/javax/crypto/ test/api/java.injected/javax/crypto/ test/api/java/org/apache/harmony/crypto/tests/javax/crypto/ test/api/java/org/apache/harmony/crypto/tests/javax/c... Sat, 16 Dec, 12:06
Stepan Mishura (JIRA) [jira] Resolved: (HARMONY-2750) [Classlib][crypto] Wrong words in crypto module Sat, 16 Dec, 12:09
nom...@intel.com [build-test alert] BUILD FAILED Linux SUSE 9 64bit gcc debug: drlvm tests Sat, 16 Dec, 12:35
nom...@hursley.ibm.com [continuum] BUILD FAILURE: Classlib/linux.ia32 Build/Test Sat, 16 Dec, 14:07
nom...@intel.com [build-test alert] BUILD SUCCEEDED Linux SUSE 9 64bit gcc debug: drlvm tests Sat, 16 Dec, 14:55
nom...@hursley.ibm.com [continuum] BUILD ERROR: Classlib/linux.ia32 Build/Test Sun, 17 Dec, 00:00
Andrew Zhang (JIRA) [jira] Commented: (HARMONY-2725) [classlib][sql] RI throws SerialException when both parameters in SerialBlob.getBytes(long pos, int len) are valid. Sun, 17 Dec, 01:53
gshiman...@apache.org svn commit: r487928 - in /harmony/enhanced/drlvm/trunk/vm/vmcore: include/Class.h src/class_support/Prepare.cpp src/jni/jni_array.cpp src/jvmti/jvmti_object.cpp src/object/vm_arrays.cpp src/thread/object_generic.cpp src/util/vm_strings.cpp Sun, 17 Dec, 02:16
Gregory Shimansky (JIRA) [jira] Resolved: (HARMONY-2529) [drlvm] crash, very large arrays used incorrectly Sun, 17 Dec, 02:18
nom...@intel.com [build-test alert] BUILD FAILED Linux SUSE 9 64bit gcc debug: drlvm tests Sun, 17 Dec, 02:31
nom...@intel.com [build-test alert] BUILD FAILED Linux SUSE 9 64bit gcc debug: classlib over drlvm Sun, 17 Dec, 03:55
nom...@intel.com [build-test alert] BUILD SUCCEEDED Linux SUSE 9 64bit gcc debug: classlib over drlvm Sun, 17 Dec, 05:35
ndbe...@apache.org svn commit: r487943 - /harmony/standard/tools/FindBugs/exclusionFilter.xml Sun, 17 Dec, 05:41
ndbe...@apache.org svn commit: r487944 - /harmony/enhanced/classlib/trunk/modules/archive/src/main/java/java/util/jar/Manifest.java Sun, 17 Dec, 05:54
nom...@intel.com [build-test alert] BUILD SUCCEEDED Linux SUSE 9 64bit gcc debug: drlvm tests Sun, 17 Dec, 06:27
nom...@hursley.ibm.com [continuum] BUILD FAILURE: Classlib/linux.ia32 Build/Test Sun, 17 Dec, 07:07
nom...@intel.com [build-test alert] BUILD FAILED Linux SUSE 9 64bit gcc debug: drlvm tests Sun, 17 Dec, 08:11
nom...@intel.com [build-test alert] BUILD SUCCEEDED Linux SUSE 9 64bit gcc debug: drlvm tests Sun, 17 Dec, 10:35
Alexei Zakharov (JIRA) [jira] Closed: (HARMONY-2725) [classlib][sql] RI throws SerialException when both parameters in SerialBlob.getBytes(long pos, int len) are valid. Sun, 17 Dec, 10:58
Robin Garner (JIRA) [jira] Created: (HARMONY-2759) Build failure because Division.java contains non UTF-8 characters Sun, 17 Dec, 12:11
a...@apache.org svn commit: r488051 - /harmony/enhanced/classlib/trunk/make/build-test.xml Sun, 17 Dec, 21:18
Vasily Zakharov (JIRA) [jira] Commented: (HARMONY-1686) [luni][jndi] javax.naming.directory.InitialContext.composeName(null,Name) does not throw unspecified NPE Sun, 17 Dec, 21:26
Alexei Zakharov (JIRA) [jira] Resolved: (HARMONY-2349) [classlib][testing] detect crashes by the empty report files Sun, 17 Dec, 21:49
nom...@intel.com [build-test alert] BUILD FAILED Windows XP SP2 msvc debug: classlib over ibmvm Sun, 17 Dec, 22:05
nom...@hursley.ibm.com [continuum] BUILD SUCCESSFUL: Classlib/linux.ia32 Build/Test Sun, 17 Dec, 23:06
nom...@intel.com [build-test alert] BUILD SUCCEEDED Windows XP SP2 msvc debug: classlib over ibmvm Sun, 17 Dec, 23:38
nom...@hursley.ibm.com [continuum] BUILD ERROR: Classlib/linux.ia32 Build/Test Mon, 18 Dec, 00:00
Richard Liang (JIRA) [jira] Assigned: (HARMONY-2495) [classlib][beans] java.beans.EventHandler.invoke( Object,Method method,Object[] arguments) does not throw unspecified NPE if method==null Mon, 18 Dec, 02:31
Leo Li (JIRA) [jira] Created: (HARMONY-2760) [classlib][security]Provider.constructor throws NullPointerException while name or info is null while RI does not. Mon, 18 Dec, 02:58
Leo Li (JIRA) [jira] Updated: (HARMONY-2760) [classlib][security]Provider.constructor throws NullPointerException while name or info is null while RI does not. Mon, 18 Dec, 03:00
Paulex Yang (JIRA) [jira] Assigned: (HARMONY-2760) [classlib][security]Provider.constructor throws NullPointerException while name or info is null while RI does not. Mon, 18 Dec, 03:02
lian...@apache.org svn commit: r488103 - in /harmony/enhanced/classlib/trunk/modules/beans/src: main/java/java/beans/ main/java/org/apache/harmony/beans/internal/nls/ test/java/org/apache/harmony/beans/tests/java/beans/ Mon, 18 Dec, 03:05
Richard Liang (JIRA) [jira] Resolved: (HARMONY-2495) [classlib][beans] java.beans.EventHandler.invoke( Object,Method method,Object[] arguments) does not throw unspecified NPE if method==null Mon, 18 Dec, 03:09
Paulex Yang (JIRA) [jira] Updated: (HARMONY-2752) [classlib][text] RulesBasedCollator uses too much memory Mon, 18 Dec, 03:11
nom...@intel.com [build-test alert] BUILD FAILED Linux SUSE 9 64bit gcc debug: drlvm tests Mon, 18 Dec, 03:18
nom...@intel.com [build-test alert] BUILD FAILED Windows XP msvc debug: classlib EHWA Mon, 18 Dec, 03:49
Leo Li (JIRA) [jira] Created: (HARMONY-2761) [classlib][security] Security.getProviders throws NumberFormatException unexpectedly Mon, 18 Dec, 03:50
nom...@intel.com [build-test alert] BUILD SUCCEEDED Windows XP msvc debug: classlib EHWA Mon, 18 Dec, 04:27
Mikhail Loenko (JIRA) [jira] Closed: (HARMONY-511) Stress test proposal on site Mon, 18 Dec, 04:45
ndbe...@apache.org svn commit: r488119 - /harmony/README Mon, 18 Dec, 04:52
py...@apache.org svn commit: r488120 - in /harmony/enhanced/classlib/trunk/modules/security/src: main/java/common/java/security/Provider.java test/api/java/org/apache/harmony/security/tests/java/security/ProviderTest.java Mon, 18 Dec, 04:53
Paulex Yang (JIRA) [jira] Resolved: (HARMONY-2760) [classlib][security]Provider.constructor throws NullPointerException while name or info is null while RI does not. Mon, 18 Dec, 04:55
ndbe...@apache.org svn commit: r488121 - /harmony/KEYS Mon, 18 Dec, 04:58
Stepan Mishura (JIRA) [jira] Assigned: (HARMONY-2761) [classlib][security] Security.getProviders throws NumberFormatException unexpectedly Mon, 18 Dec, 04:59
Stepan Mishura (JIRA) [jira] Updated: (HARMONY-2761) [classlib][security] Security.getProviders throws NumberFormatException unexpectedly Mon, 18 Dec, 04:59
nom...@hursley.ibm.com [continuum] BUILD SUCCESSFUL: Classlib/linux.ia32 Build/Test Mon, 18 Dec, 05:06
smish...@apache.org svn commit: r488123 - in /harmony/enhanced/classlib/trunk/make: build-java.xml depends.properties Mon, 18 Dec, 05:06
ndbe...@apache.org svn commit: r488128 - /harmony/enhanced/classlib/trunk/modules/math/src/main/java/java/math/Division.java Mon, 18 Dec, 05:22
Nathan Beyer (JIRA) [jira] Assigned: (HARMONY-2759) Build failure because Division.java contains non UTF-8 characters Mon, 18 Dec, 05:24
Nathan Beyer (JIRA) [jira] Resolved: (HARMONY-2759) Build failure because Division.java contains non UTF-8 characters Mon, 18 Dec, 05:26
Vladimir Ivanov (JIRA) [jira] Commented: (HARMONY-1685) [classlib][text] no NPE for NumberFormat.parseObject("test", null)) Mon, 18 Dec, 05:35
nom...@intel.com [build-test alert] BUILD FAILED Linux SUSE 9 gcc debug: classlib over ibmvm Mon, 18 Dec, 05:45
nom...@hursley.ibm.com [continuum] BUILD FAILURE: Classlib/linux.ia32 Build/Test Mon, 18 Dec, 06:04
Stepan Mishura (JIRA) [jira] Commented: (HARMONY-2678) [classlib][security]AlgorithmParameters fails to getInstance from "OAEP" Mon, 18 Dec, 06:20
Vladimir Ivanov (JIRA) [jira] Commented: (HARMONY-2349) [classlib][testing] detect crashes by the empty report files Mon, 18 Dec, 07:06
nom...@intel.com [build-test alert] BUILD FAILED Linux SUSE 9 gcc debug: classlib over drlvm Mon, 18 Dec, 07:29
Artem Aliev (JIRA) [jira] Updated: (HARMONY-2420) [classlib][prefs] java.util.prefs.AbstractPreferences.exportNode(OutputStream) and java.util.prefs.AbstractPreferences.exportSubtree(OutputStream) throws AssertionError instead of NPE in a case when OutputStream is null Mon, 18 Dec, 07:43
Leo Li (JIRA) [jira] Created: (HARMONY-2762) [classlib][security]UnresolvedPermission fails in serialization. Mon, 18 Dec, 07:51
Vladimir Ivanov (JIRA) [jira] Updated: (HARMONY-2438) [classlib][swing] intermittent failures of swing module tests, once mode Mon, 18 Dec, 08:13
nom...@intel.com [build-test alert] BUILD SUCCEEDED Linux SUSE 9 gcc debug: classlib over ibmvm Mon, 18 Dec, 08:20
Leo Li (JIRA) [jira] Updated: (HARMONY-2762) [classlib][security]UnresolvedPermission fails in serialization. Mon, 18 Dec, 08:22
Alexey A. Ivanov (JIRA) [jira] Commented: (HARMONY-2438) [classlib][swing] intermittent failures of swing module tests, once mode Mon, 18 Dec, 08:24
Vladimir Ivanov (JIRA) [jira] Commented: (HARMONY-2438) [classlib][swing] intermittent failures of swing module tests, once mode Mon, 18 Dec, 09:00
Leo Li (JIRA) [jira] Commented: (HARMONY-2762) [classlib][security]UnresolvedPermission fails in serialization. Mon, 18 Dec, 09:06
nom...@intel.com [build-test alert] BUILD SUCCEEDED Linux SUSE 9 64bit gcc debug: drlvm tests Mon, 18 Dec, 09:06
Leo Li (JIRA) [jira] Commented: (HARMONY-2760) [classlib][security]Provider.constructor throws NullPointerException while name or info is null while RI does not. Mon, 18 Dec, 09:10
Elena Semukhina (JIRA) [jira] Created: (HARMONY-2763) [drlvm][smoke tests] Internal VM properties are set incorrectly for test runs. Mon, 18 Dec, 09:40
Elena Semukhina (JIRA) [jira] Updated: (HARMONY-2763) [drlvm][smoke tests] Internal VM properties are set incorrectly for test runs. Mon, 18 Dec, 09:44
Elena Semukhina (JIRA) [jira] Updated: (HARMONY-2763) [drlvm][smoke tests] Internal VM properties are set incorrectly for test runs. Mon, 18 Dec, 09:44
nom...@intel.com [build-test alert] BUILD SUCCEEDED Linux SUSE 9 gcc debug: classlib over drlvm Mon, 18 Dec, 10:00
nom...@intel.com [build-test alert] BUILD FAILED Linux SUSE 9 64bit gcc debug: drlvm tests Mon, 18 Dec, 10:04
Leo Li (JIRA) [jira] Commented: (HARMONY-2761) [classlib][security] Security.getProviders throws NumberFormatException unexpectedly Mon, 18 Dec, 10:06
Denis Kishenko (JIRA) [jira] Created: (HARMONY-2764) [classlib][swing] javax.swing.plaf.basic.BasicButtonListener.processMouseEvent() does not throw unspecified NPE Mon, 18 Dec, 10:27
Alexey Petrenko (JIRA) [jira] Closed: (HARMONY-735) classlib native-src cannot compile with Visual Studio C++ Express Mon, 18 Dec, 10:29
hinde...@apache.org svn commit: r488211 - /harmony/enhanced/classlib/trunk/depends/jars/ Mon, 18 Dec, 10:38
Alexei Zakharov (JIRA) [jira] Closed: (HARMONY-2349) [classlib][testing] detect crashes by the empty report files Mon, 18 Dec, 10:46
Alexei Zakharov (JIRA) [jira] Closed: (HARMONY-1685) [classlib][text] no NPE for NumberFormat.parseObject("test", null)) Mon, 18 Dec, 10:50
Alexey Varlamov (JIRA) [jira] Assigned: (HARMONY-2763) [drlvm][smoke tests] Internal VM properties are set incorrectly for test runs. Mon, 18 Dec, 10:50
var...@apache.org svn commit: r488221 - in /harmony/enhanced/drlvm/trunk/build/make/targets: jvmti.test.xml kernel.test.xml smoke.test.xml Mon, 18 Dec, 10:56
Alexey Varlamov (JIRA) [jira] Closed: (HARMONY-2763) [drlvm][smoke tests] Internal VM properties are set incorrectly for test runs. Mon, 18 Dec, 10:59
Vladimir Ivanov (JIRA) [jira] Updated: (HARMONY-2438) [classlib][swing] intermittent failures of swing module tests, once mode Mon, 18 Dec, 11:05
Message list« Previous · 1 · 2 · 3 · 4 · 5 · 6 · 7 · 8 · 9 · 10 · 11 · 12 · 13 · 14 · 15 · 16 · 17 · 18 · 19 · 20 · 21 · 22 · 23 · 24 · 25 · 26 · 27 · 28 · 29 · 30 · 31 · 32 · 33 · 34 · 35 · 36 · 37 · Next »Thread · Author · Date
Box list
Oct 20115
Sep 20111
Aug 20112
Jul 201117
Jun 20113
May 20111
Apr 20112
Mar 20114
Feb 20112
Jan 201111
Dec 201022
Nov 201091
Oct 2010178
Sep 2010615
Aug 2010357
Jul 2010447
Jun 2010441
May 2010220
Apr 2010277
Mar 2010439
Feb 2010228
Jan 2010171
Dec 2009150
Nov 2009228
Oct 2009483
Sep 2009299
Aug 2009341
Jul 2009536
Jun 2009485
May 2009361
Apr 2009695
Mar 2009189
Feb 2009188
Jan 2009247
Dec 2008346
Nov 2008231
Oct 2008166
Sep 2008312
Aug 2008252
Jul 2008403
Jun 2008383
May 2008723
Apr 20081465
Mar 20081205
Feb 20081117
Jan 2008934
Dec 20071396
Nov 20071890
Oct 20071733
Sep 20071336
Aug 20071515
Jul 20071864
Jun 20073026
May 20072530
Apr 20072185
Mar 20072652
Feb 20072031
Jan 20072963
Dec 20063629
Nov 20063413
Oct 20063036
Sep 20062851
Aug 20062717
Jul 20062255
Jun 20061714
May 20061325
Apr 20061356
Mar 2006917
Feb 2006190
Jan 2006233
Dec 2005122
Nov 2005258
Oct 2005153
Sep 200522
Aug 20053
Jul 20056
Jun 200512