harmony-commits mailing list archives: December 2006

Site index · List index
Message list« Previous · 1 · 2 · 3 · 4 · 5 · 6 · 7 · 8 · 9 · 10 · 11 · 12 · 13 · 14 · 15 · 16 · 17 · 18 · 19 · 20 · 21 · 22 · 23 · 24 · 25 · 26 · 27 · 28 · 29 · 30 · 31 · 32 · 33 · 34 · 35 · 36 · 37 · Next »Thread · Author · Date
nadi...@apache.org svn commit: r483443 - in /harmony/standard/site: docs/subcomponents/drlvm/JVMTI-PopFrame.html docs/subcomponents/drlvm/index.html xdocs/subcomponents/drlvm/JVMTI-PopFrame.xml xdocs/subcomponents/drlvm/index.xml Thu, 07 Dec, 13:17
nadi...@apache.org svn commit: r483448 - in /harmony/standard/site: docs/subcomponents/drlvm/ xdocs/subcomponents/drlvm/ Thu, 07 Dec, 13:31
nadi...@apache.org svn commit: r484641 - in /harmony/standard/site: docs/get-involved.html xdocs/get-involved.xml Fri, 08 Dec, 15:31
nadi...@apache.org svn commit: r485622 - in /harmony/standard/site: docs/quickhelp_contributors.html xdocs/quickhelp_contributors.xml Mon, 11 Dec, 11:39
nadi...@apache.org svn commit: r486246 - in /harmony/standard/site: docs/get-involved.html xdocs/get-involved.xml Tue, 12 Dec, 17:24
nadi...@apache.org svn commit: r486247 - /harmony/standard/site/README.txt Tue, 12 Dec, 17:25
nadi...@apache.org svn commit: r487252 - /harmony/standard/site/xdocs/stylesheets/site.vsl Thu, 14 Dec, 16:44
nadi...@apache.org svn commit: r488353 - in /harmony/standard/site: docs/subcomponents/drlvm/JIT.html xdocs/subcomponents/drlvm/Jitrino.html Mon, 18 Dec, 17:31
nadi...@apache.org svn commit: r488357 - in /harmony/enhanced/drlvm/trunk/vm/doc: build.xml doc.properties vm.cfg Mon, 18 Dec, 17:34
nadi...@apache.org svn commit: r488360 - in /harmony/enhanced/drlvm/trunk/vm/doc: DeveloperGuide.htm GettingStarted.htm conventions.htm drl.css Mon, 18 Dec, 17:37
nadi...@apache.org svn commit: r488652 - in /harmony/standard/site: ./ docs/subcomponents/buildtest/site.css docs/subcomponents/classlibrary/site.css Tue, 19 Dec, 12:15
nadi...@apache.org svn commit: r488658 - /harmony/enhanced/drlvm/trunk/vm/doc/images/ Tue, 19 Dec, 12:31
ndbe...@apache.org svn commit: r481858 - in /harmony/enhanced/classlib/trunk/modules/sql/src: main/java/javax/sql/rowset/serial/ main/java/org/apache/harmony/sql/internal/nls/ test/java/org/apache/harmony/sql/tests/javax/sql/rowset/serial/ Sun, 03 Dec, 19:03
ndbe...@apache.org svn commit: r481859 - /harmony/enhanced/classlib/trunk/modules/sql/src/test/java/org/apache/harmony/sql/tests/javax/sql/rowset/serial/SerialRefTest.java Sun, 03 Dec, 19:06
ndbe...@apache.org svn commit: r481897 - in /harmony/enhanced/classlib/trunk/modules/beans/src: main/java/java/beans/Beans.java test/java/org/apache/harmony/beans/tests/java/beans/BeansTest.java Sun, 03 Dec, 21:19
ndbe...@apache.org svn commit: r481908 - /harmony/enhanced/classlib/trunk/modules/beans/src/main/java/java/beans/Beans.java Sun, 03 Dec, 21:31
ndbe...@apache.org svn commit: r481987 - /harmony/enhanced/classlib/trunk/modules/swing/make/ Sun, 03 Dec, 23:35
ndbe...@apache.org svn commit: r482055 - in /harmony/enhanced/classlib/trunk/modules/beans/src/test: java/org/apache/harmony/beans/tests/java/beans/beancontext/BeanContextSupportTest.java resources/serialization/java/beans/beancontext/BeanContextSupport.ser Mon, 04 Dec, 04:15
ndbe...@apache.org svn commit: r485471 - /harmony/enhanced/classlib/trunk/modules/luni/src/main/java/java/lang/SecurityManager.java Mon, 11 Dec, 02:59
ndbe...@apache.org svn commit: r485488 - in /harmony/enhanced/classlib/trunk/modules/archive/src/test/java/org/apache/harmony/archive/tests/java/util: jar/AttributesTest.java zip/CheckedInputStreamTest.java zip/DeflaterOutputStreamTest.java zip/DeflaterTest.java Mon, 11 Dec, 04:12
ndbe...@apache.org svn commit: r485491 - /harmony/enhanced/classlib/trunk/modules/archive/src/test/java/org/apache/harmony/archive/tests/java/util/zip/ZipInputStreamTest.java Mon, 11 Dec, 04:22
ndbe...@apache.org svn commit: r487943 - /harmony/standard/tools/FindBugs/exclusionFilter.xml Sun, 17 Dec, 05:41
ndbe...@apache.org svn commit: r487944 - /harmony/enhanced/classlib/trunk/modules/archive/src/main/java/java/util/jar/Manifest.java Sun, 17 Dec, 05:54
ndbe...@apache.org svn commit: r488119 - /harmony/README Mon, 18 Dec, 04:52
ndbe...@apache.org svn commit: r488121 - /harmony/KEYS Mon, 18 Dec, 04:58
ndbe...@apache.org svn commit: r488128 - /harmony/enhanced/classlib/trunk/modules/math/src/main/java/java/math/Division.java Mon, 18 Dec, 05:22
ndbe...@apache.org svn commit: r489569 - /harmony/standard/tools/FindBugs/exclusionFilter.xml Fri, 22 Dec, 07:04
ndbe...@apache.org svn commit: r489924 - /harmony/enhanced/classlib/trunk/modules/awt/src/test/api/java/common/java/awt/KeyboardFocusManagerTest.java Sat, 23 Dec, 20:15
ndbe...@apache.org svn commit: r489969 - in /harmony/enhanced/classlib/trunk/modules/prefs/src: main/java/java/util/prefs/AbstractPreferences.java test/java/org/apache/harmony/prefs/tests/java/util/prefs/AbstractPreferencesTest.java Sun, 24 Dec, 03:01
ndbe...@apache.org svn commit: r489985 - /harmony/enhanced/classlib/trunk/modules/prefs/src/main/java/java/util/prefs/AbstractPreferences.java Sun, 24 Dec, 05:27
ndbe...@apache.org svn commit: r489986 - /harmony/enhanced/classlib/trunk/modules/prefs/src/main/java/java/util/prefs/AbstractPreferences.java Sun, 24 Dec, 05:32
ndbe...@apache.org svn commit: r489987 - /harmony/standard/tools/FindBugs/exclusionFilter.xml Sun, 24 Dec, 05:38
ndbe...@apache.org svn commit: r489990 - in /harmony/enhanced/classlib/trunk/modules/prefs/src/main/java/java/util/prefs: FilePreferencesFactoryImpl.java FilePreferencesImpl.java Preferences.java RegistryPreferencesFactoryImpl.java RegistryPreferencesImpl.java Sun, 24 Dec, 06:38
ndbe...@apache.org svn commit: r489993 - /harmony/enhanced/classlib/trunk/modules/regex/src/main/java/java/util/regex/ Sun, 24 Dec, 07:06
nom...@hursley.ibm.com [continuum] BUILD FAILURE: Classlib/linux.ia32 Build/Test Fri, 01 Dec, 23:16
nom...@hursley.ibm.com [continuum] BUILD ERROR: Classlib/linux.ia32 Build/Test Sat, 02 Dec, 00:00
nom...@hursley.ibm.com [continuum] BUILD SUCCESSFUL: Classlib/linux.ia32 Build/Test Sat, 02 Dec, 12:06
nom...@hursley.ibm.com [continuum] BUILD FAILURE: Classlib/linux.ia32 Build/Test Sat, 02 Dec, 21:12
nom...@hursley.ibm.com [continuum] BUILD SUCCESSFUL: Classlib/linux.ia32 Build/Test Sun, 03 Dec, 00:04
nom...@hursley.ibm.com [continuum] BUILD FAILURE: Classlib/linux.ia32 Build/Test Sun, 03 Dec, 04:04
nom...@hursley.ibm.com [continuum] BUILD FAILURE: Classlib/linux.ia32 Build/Test Sun, 03 Dec, 19:06
nom...@hursley.ibm.com [continuum] BUILD FAILURE: Classlib/linux.ia32 Build/Test Sun, 03 Dec, 20:58
nom...@hursley.ibm.com [continuum] BUILD FAILURE: Classlib/linux.ia32 Build/Test Sun, 03 Dec, 23:05
nom...@hursley.ibm.com [continuum] BUILD ERROR: Classlib/linux.ia32 Build/Test Mon, 04 Dec, 00:00
nom...@hursley.ibm.com [continuum] BUILD SUCCESSFUL: Classlib/linux.ia32 Build/Test Mon, 04 Dec, 02:04
nom...@hursley.ibm.com [continuum] BUILD FAILURE: Classlib/linux.ia32 Build/Test Mon, 04 Dec, 06:12
nom...@hursley.ibm.com [continuum] BUILD SUCCESSFUL: Classlib/linux.ia32 Build/Test Mon, 04 Dec, 12:05
nom...@hursley.ibm.com [continuum] BUILD FAILURE: Classlib/linux.ia32 Build/Test Mon, 04 Dec, 22:03
nom...@hursley.ibm.com [continuum] BUILD SUCCESSFUL: Classlib/linux.ia32 Build/Test Tue, 05 Dec, 00:02
nom...@hursley.ibm.com [continuum] BUILD FAILURE: Classlib/linux.ia32 Build/Test Tue, 05 Dec, 08:14
nom...@hursley.ibm.com [continuum] BUILD FAILURE: Classlib/linux.ia32 Build/Test Tue, 05 Dec, 09:59
nom...@hursley.ibm.com [continuum] BUILD FAILURE: Classlib/linux.ia32 Build/Test Tue, 05 Dec, 11:04
nom...@hursley.ibm.com [continuum] BUILD FAILURE: Classlib/linux.ia32 Build/Test Tue, 05 Dec, 13:04
nom...@hursley.ibm.com [continuum] BUILD FAILURE: Classlib/linux.ia32 Build/Test Tue, 05 Dec, 15:05
nom...@hursley.ibm.com [continuum] BUILD FAILURE: Classlib/linux.ia32 Build/Test Tue, 05 Dec, 19:04
nom...@hursley.ibm.com [continuum] BUILD FAILURE: Classlib/linux.ia32 Build/Test Tue, 05 Dec, 21:05
nom...@hursley.ibm.com [continuum] BUILD ERROR: Classlib/linux.ia32 Build/Test Wed, 06 Dec, 00:00
nom...@hursley.ibm.com [continuum] BUILD FAILURE: Classlib/linux.ia32 Build/Test Wed, 06 Dec, 01:58
nom...@hursley.ibm.com [continuum] BUILD FAILURE: Classlib/linux.ia32 Build/Test Wed, 06 Dec, 07:18
nom...@hursley.ibm.com [continuum] BUILD FAILURE: Classlib/linux.ia32 Build/Test Wed, 06 Dec, 08:58
nom...@hursley.ibm.com [continuum] BUILD SUCCESSFUL: Classlib/linux.ia32 Build/Test Wed, 06 Dec, 10:03
nom...@hursley.ibm.com [continuum] BUILD FAILURE: Classlib/linux.ia32 Build/Test Wed, 06 Dec, 14:04
nom...@hursley.ibm.com [continuum] BUILD SUCCESSFUL: Classlib/linux.ia32 Build/Test Wed, 06 Dec, 16:04
nom...@hursley.ibm.com [continuum] BUILD ERROR: Classlib/linux.ia32 Build/Test Thu, 07 Dec, 00:00
nom...@hursley.ibm.com [continuum] BUILD SUCCESSFUL: Classlib/linux.ia32 Build/Test Thu, 07 Dec, 06:57
nom...@hursley.ibm.com [continuum] BUILD FAILURE: Classlib/linux.ia32 Build/Test Fri, 08 Dec, 11:28
nom...@hursley.ibm.com [continuum] BUILD SUCCESSFUL: Classlib/linux.ia32 Build/Test Fri, 08 Dec, 13:04
nom...@hursley.ibm.com [continuum] BUILD ERROR: Classlib/linux.ia32 Build/Test Sun, 10 Dec, 00:00
nom...@hursley.ibm.com [continuum] BUILD ERROR: Classlib/linux.ia32 Build/Test Mon, 11 Dec, 00:00
nom...@hursley.ibm.com [continuum] BUILD SUCCESSFUL: Classlib/linux.ia32 Build/Test Mon, 11 Dec, 03:59
nom...@hursley.ibm.com [continuum] BUILD FAILURE: Classlib/linux.ia32 Build/Test Mon, 11 Dec, 08:13
nom...@hursley.ibm.com [continuum] BUILD SUCCESSFUL: Classlib/linux.ia32 Build/Test Mon, 11 Dec, 15:05
nom...@hursley.ibm.com [continuum] BUILD FAILURE: Classlib/linux.ia32 Build/Test Mon, 11 Dec, 19:06
nom...@hursley.ibm.com [continuum] BUILD ERROR: Classlib/linux.ia32 Build/Test Tue, 12 Dec, 00:00
nom...@hursley.ibm.com [continuum] BUILD SUCCESSFUL: Classlib/linux.ia32 Build/Test Tue, 12 Dec, 06:59
nom...@hursley.ibm.com [continuum] BUILD FAILURE: Classlib/linux.ia32 Build/Test Tue, 12 Dec, 09:11
nom...@hursley.ibm.com [continuum] BUILD FAILURE: Classlib/linux.ia32 Build/Test Tue, 12 Dec, 12:04
nom...@hursley.ibm.com [continuum] BUILD SUCCESSFUL: Classlib/linux.ia32 Build/Test Tue, 12 Dec, 13:58
nom...@hursley.ibm.com [continuum] BUILD FAILURE: Classlib/linux.ia32 Build/Test Wed, 13 Dec, 00:18
nom...@hursley.ibm.com [continuum] BUILD SUCCESSFUL: Classlib/linux.ia32 Build/Test Wed, 13 Dec, 06:05
nom...@hursley.ibm.com [continuum] BUILD FAILURE: Classlib/linux.ia32 Build/Test Wed, 13 Dec, 22:11
nom...@hursley.ibm.com [continuum] BUILD ERROR: Classlib/linux.ia32 Build/Test Thu, 14 Dec, 00:00
nom...@hursley.ibm.com [continuum] BUILD FAILURE: Classlib/linux.ia32 Build/Test Thu, 14 Dec, 07:08
nom...@hursley.ibm.com [continuum] BUILD FAILURE: Classlib/linux.ia32 Build/Test Thu, 14 Dec, 09:19
nom...@hursley.ibm.com [continuum] BUILD SUCCESSFUL: Classlib/linux.ia32 Build/Test Thu, 14 Dec, 10:58
nom...@hursley.ibm.com [continuum] BUILD FAILURE: Classlib/linux.ia32 Build/Test Thu, 14 Dec, 14:05
nom...@hursley.ibm.com [continuum] BUILD FAILURE: Classlib/linux.ia32 Build/Test Thu, 14 Dec, 17:19
nom...@hursley.ibm.com [continuum] BUILD FAILURE: Classlib/linux.ia32 Build/Test Thu, 14 Dec, 19:18
nom...@hursley.ibm.com [continuum] BUILD SUCCESSFUL: Classlib/linux.ia32 Build/Test Thu, 14 Dec, 20:58
nom...@hursley.ibm.com [continuum] BUILD ERROR: Classlib/linux.ia32 Build/Test Fri, 15 Dec, 00:00
nom...@hursley.ibm.com [continuum] BUILD FAILURE: Classlib/linux.ia32 Build/Test Fri, 15 Dec, 07:07
nom...@hursley.ibm.com [continuum] BUILD SUCCESSFUL: Classlib/linux.ia32 Build/Test Fri, 15 Dec, 08:57
nom...@hursley.ibm.com [continuum] BUILD FAILURE: Classlib/linux.ia32 Build/Test Fri, 15 Dec, 12:19
nom...@hursley.ibm.com [continuum] BUILD SUCCESSFUL: Classlib/linux.ia32 Build/Test Fri, 15 Dec, 14:05
nom...@hursley.ibm.com [continuum] BUILD FAILURE: Classlib/linux.ia32 Build/Test Fri, 15 Dec, 16:17
nom...@hursley.ibm.com [continuum] BUILD SUCCESSFUL: Classlib/linux.ia32 Build/Test Fri, 15 Dec, 18:05
nom...@hursley.ibm.com [continuum] BUILD ERROR: Classlib/linux.ia32 Build/Test Sat, 16 Dec, 00:00
nom...@hursley.ibm.com [continuum] BUILD FAILURE: Classlib/linux.ia32 Build/Test Sat, 16 Dec, 14:07
nom...@hursley.ibm.com [continuum] BUILD ERROR: Classlib/linux.ia32 Build/Test Sun, 17 Dec, 00:00
nom...@hursley.ibm.com [continuum] BUILD FAILURE: Classlib/linux.ia32 Build/Test Sun, 17 Dec, 07:07
Message list« Previous · 1 · 2 · 3 · 4 · 5 · 6 · 7 · 8 · 9 · 10 · 11 · 12 · 13 · 14 · 15 · 16 · 17 · 18 · 19 · 20 · 21 · 22 · 23 · 24 · 25 · 26 · 27 · 28 · 29 · 30 · 31 · 32 · 33 · 34 · 35 · 36 · 37 · Next »Thread · Author · Date
Box list
Nov 20119
Oct 20115
Sep 20111
Aug 20112
Jul 201117
Jun 20113
May 20111
Apr 20112
Mar 20114
Feb 20112
Jan 201111
Dec 201022
Nov 201091
Oct 2010178
Sep 2010615
Aug 2010357
Jul 2010447
Jun 2010441
May 2010220
Apr 2010277
Mar 2010439
Feb 2010228
Jan 2010171
Dec 2009150
Nov 2009228
Oct 2009483
Sep 2009299
Aug 2009341
Jul 2009536
Jun 2009485
May 2009361
Apr 2009695
Mar 2009189
Feb 2009188
Jan 2009247
Dec 2008346
Nov 2008231
Oct 2008166
Sep 2008312
Aug 2008252
Jul 2008403
Jun 2008383
May 2008723
Apr 20081465
Mar 20081205
Feb 20081117
Jan 2008934
Dec 20071396
Nov 20071890
Oct 20071733
Sep 20071336
Aug 20071515
Jul 20071864
Jun 20073026
May 20072530
Apr 20072185
Mar 20072652
Feb 20072031
Jan 20072963
Dec 20063629
Nov 20063413
Oct 20063036
Sep 20062851
Aug 20062717
Jul 20062255
Jun 20061714
May 20061325
Apr 20061356
Mar 2006917
Feb 2006190
Jan 2006233
Dec 2005122
Nov 2005258
Oct 2005153
Sep 200522
Aug 20053
Jul 20056
Jun 200512