harmony-commits mailing list archives

Site index · List index
Message view « Date » · « Thread »
Top « Date » · « Thread »
From "Pavel Dolgov (JIRA)" <j...@apache.org>
Subject [jira] Updated: (HARMONY-2499) [classlib][awt] java.awt.event.KeyEvent.getKeyText() throws unexpected StringIndexOutOfBoundsException for unknown key code
Date Wed, 06 Dec 2006 14:32:22 GMT
     [ http://issues.apache.org/jira/browse/HARMONY-2499?page=all ]

Pavel Dolgov updated HARMONY-2499:
----------------------------------

    Description: 
Test case:
--------------
import java.awt.AWTKeyStroke;
import java.awt.Container;
import java.awt.event.KeyEvent;

import junit.framework.TestCase;

public class TheTest extends TestCase {

    public static void main(String args[]) {
        junit.textui.TestRunner.run(TheTest.class);
    }

    public void testcase1() {
        KeyEvent evt = new KeyEvent(new Container(), 1, 2, 3, 4, 'a');
        AWTKeyStroke str = AWTKeyStroke.getAWTKeyStrokeForEvent(evt);
        assertNull(str);
    }

    public void testcase2() {
        assertEquals("Unknown keyCode: 0x4", KeyEvent.getKeyText(4));
    }
}

RI output:
-------------
..
Time: 0,15

OK (2 tests)


Harmony output:
-------------
.F.E
Time: 0.501
There was 1 error:
1) testcase2(TheTest)java.lang.StringIndexOutOfBoundsException
	at java.lang.String.charAt(String.java:591)
	at java.awt.event.KeyEvent.getDefaultName(KeyEvent.java:488)
	at java.awt.event.KeyEvent.getKeyText(KeyEvent.java:476)
	at TheTest.testcase2(TheTest.java:20)
	at java.lang.reflect.VMReflection.invokeMethod(Native Method)
	at TheTest.main(TheTest.java:10)
There was 1 failure:
1) testcase1(TheTest)junit.framework.AssertionFailedError
	at TheTest.testcase1(TheTest.java:15)
	at java.lang.reflect.VMReflection.invokeMethod(Native Method)
	at TheTest.main(TheTest.java:10)

FAILURES!!!
Tests run: 2,  Failures: 1,  Errors: 1


  was:
Test case:
--------------
import java.awt.AWTKeyStroke;
import java.awt.Container;
import java.awt.event.KeyEvent;

import junit.framework.TestCase;

public class TheTest extends TestCase {

    public static void main(String args[]) {
        junit.textui.TestRunner.run(TheTest.class);
    }

    public void testcase1() {
        KeyEvent evt = new KeyEvent(new Container(), 1, 2, 3, 4, 'a');
        AWTKeyStroke str = AWTKeyStroke.getAWTKeyStrokeForEvent(evt);
        assertNull(str);
    }

    public void testcase2() {
        assertEquals("Unknown keyCode: 0x4", KeyEvent.getKeyText(4));
    }
}

RI output:
-------------

Harmony output:
-------------
.F.E
Time: 0.501
There was 1 error:
1) testcase2(TheTest)java.lang.StringIndexOutOfBoundsException
	at java.lang.String.charAt(String.java:591)
	at java.awt.event.KeyEvent.getDefaultName(KeyEvent.java:488)
	at java.awt.event.KeyEvent.getKeyText(KeyEvent.java:476)
	at TheTest.testcase2(TheTest.java:20)
	at java.lang.reflect.VMReflection.invokeMethod(Native Method)
	at TheTest.main(TheTest.java:10)
There was 1 failure:
1) testcase1(TheTest)junit.framework.AssertionFailedError
	at TheTest.testcase1(TheTest.java:15)
	at java.lang.reflect.VMReflection.invokeMethod(Native Method)
	at TheTest.main(TheTest.java:10)

FAILURES!!!
Tests run: 2,  Failures: 1,  Errors: 1



> [classlib][awt] java.awt.event.KeyEvent.getKeyText() throws unexpected StringIndexOutOfBoundsException
for unknown key code
> ---------------------------------------------------------------------------------------------------------------------------
>
>                 Key: HARMONY-2499
>                 URL: http://issues.apache.org/jira/browse/HARMONY-2499
>             Project: Harmony
>          Issue Type: Bug
>          Components: Classlib
>            Reporter: Pavel Dolgov
>            Priority: Minor
>
> Test case:
> --------------
> import java.awt.AWTKeyStroke;
> import java.awt.Container;
> import java.awt.event.KeyEvent;
> import junit.framework.TestCase;
> public class TheTest extends TestCase {
>     public static void main(String args[]) {
>         junit.textui.TestRunner.run(TheTest.class);
>     }
>     public void testcase1() {
>         KeyEvent evt = new KeyEvent(new Container(), 1, 2, 3, 4, 'a');
>         AWTKeyStroke str = AWTKeyStroke.getAWTKeyStrokeForEvent(evt);
>         assertNull(str);
>     }
>     public void testcase2() {
>         assertEquals("Unknown keyCode: 0x4", KeyEvent.getKeyText(4));
>     }
> }
> RI output:
> -------------
> ..
> Time: 0,15
> OK (2 tests)
> Harmony output:
> -------------
> .F.E
> Time: 0.501
> There was 1 error:
> 1) testcase2(TheTest)java.lang.StringIndexOutOfBoundsException
> 	at java.lang.String.charAt(String.java:591)
> 	at java.awt.event.KeyEvent.getDefaultName(KeyEvent.java:488)
> 	at java.awt.event.KeyEvent.getKeyText(KeyEvent.java:476)
> 	at TheTest.testcase2(TheTest.java:20)
> 	at java.lang.reflect.VMReflection.invokeMethod(Native Method)
> 	at TheTest.main(TheTest.java:10)
> There was 1 failure:
> 1) testcase1(TheTest)junit.framework.AssertionFailedError
> 	at TheTest.testcase1(TheTest.java:15)
> 	at java.lang.reflect.VMReflection.invokeMethod(Native Method)
> 	at TheTest.main(TheTest.java:10)
> FAILURES!!!
> Tests run: 2,  Failures: 1,  Errors: 1

-- 
This message is automatically generated by JIRA.
-
If you think it was sent incorrectly contact one of the administrators: http://issues.apache.org/jira/secure/Administrators.jspa
-
For more information on JIRA, see: http://www.atlassian.com/software/jira

        

Mime
View raw message