harmony-commits mailing list archives

Site index · List index
Message view « Date » · « Thread »
Top « Date » · « Thread »
From nom...@intel.com
Subject [build-test alert] BUILD FAILED Linux SUSE 9 gcc debug: classlib over ibmvm
Date Mon, 18 Dec 2006 05:45:09 GMT
BUILD FAILED:
	Ant Error Message:
/export/viv/trunk/cc/projects/classlib/trunk/build.xml:280: The following error occurred while
executing this line: /export/viv/trunk/cc/projects/classlib/trunk/make/depends.xml:243: The
following error occurred while executing this line: /export/viv/trunk/cc/projects/classlib/trunk/make/depends.xml:292:
The following error occurred while executing this line: /export/viv/trunk/cc/projects/classlib/trunk/make/depends.xml:318:
java.net.ConnectException: Connection timed out

Date of build:	12/18/2006 11:41:38
Time to build:	3 minutes 11 seconds
Last changed:	12/18/2006 11:22:30
Last log entry:	Correct incorrectly encoded characters

***********************************************************
Errors/Warnings:	(18)
            

***********************************************************
Unit Tests: (19211)
        
All Tests Passed

***********************************************************
Modifications since last successful build:	(5)
            
modified ndbeyer  /harmony/enhanced/classlib/trunk/modules/math/src/main/java/java/math/Division.java
12/18/2006 11:22:30 Correct incorrectly encoded characters
modified smishura  /harmony/enhanced/classlib/trunk/make/build-java.xml 12/18/2006 11:06:28
Apply patch for HARMONY-2678 ([classlib][security]AlgorithmParameters fails to getInstance
from OAEP)The patch upgrades Bouncy Castle provider version. Classlib tests passed on Linux
and Windows on IBM VME and DRL VM
modified smishura  /harmony/enhanced/classlib/trunk/make/depends.properties 12/18/2006 11:06:28
Apply patch for HARMONY-2678 ([classlib][security]AlgorithmParameters fails to getInstance
from OAEP)The patch upgrades Bouncy Castle provider version. Classlib tests passed on Linux
and Windows on IBM VME and DRL VM
modified pyang  /harmony/enhanced/classlib/trunk/modules/security/src/test/api/java/org/apache/harmony/security/tests/java/security/ProviderTest.java
12/18/2006 10:53:49 Apply patch for HARMONY-2760 ([classlib][security]Provider.constructor
throws NullPointerException while name or info is null while RI does not.)
modified pyang  /harmony/enhanced/classlib/trunk/modules/security/src/main/java/common/java/security/Provider.java
12/18/2006 10:53:49 Apply patch for HARMONY-2760 ([classlib][security]Provider.constructor
throws NullPointerException while name or info is null while RI does not.)

Mime
View raw message