harmony-commits mailing list archives

Site index · List index
Message view « Date » · « Thread »
Top « Date » · « Thread »
From nom...@hursley.ibm.com
Subject [continuum] BUILD SUCCESSFUL: Classlib/linux.ia32 Build/Test
Date Fri, 15 Dec 2006 14:05:06 GMT
Online report : http://people.apache.org/~hindessm/continuum/classlib/linux.ia32/2006/12/15/20061215-140506.successful.log.gz
Build statistics:
  State: Ok
  Previous State: Failed
  Started at: Fri, 15 Dec 2006 13:08:10 +0000
  Finished at: Fri, 15 Dec 2006 14:05:03 +0000
  Total time: 56m 53s
  Build Trigger: Schedule
  Exit code: 0
  Building machine hostname: hy2
  Operating system : Linux(unknown)
  Java version : 1.5.0_06(Sun Microsystems Inc.)

Changes
                            classlib/depends/build/defines.mk
            classlib/depends/build/defines.mak
            classlib/modules/security/src/test/api/java/org/apache/harmony/security/tests/java/security/AlgorithmParameters2Test.java
            classlib/modules/security/src/test/api/java/org/apache/harmony/security/tests/java/security/AlgorithmParametersTest.java
            classlib/modules/luni/src/test/java/tests/api/java/io/FileTest.java
            classlib/modules/luni/src/main/java/java/io/File.java
        
****************************************************************************
Output:
****************************************************************************
Buildfile: build.xml

build:
   [delete] Deleting directory /home/hybld/continuum-working-directory/6/classlib/deploy
     [echo] Classlib revision is 487545
     [echo] Post process: true
     [echo] JAPI: true
     [echo] Building with reference jdk/javac
     [exec] Buildfile: build.xml

     [exec] -init-hdk-for-clean:
     [exec]     [mkdir] Created dir: /home/hybld/continuum-working-directory/6/classlib/deploy/build/ant
     [exec]      [copy] Copying 1 file to /home/hybld/continuum-working-directory/6/classlib/deploy/build/ant

     [exec] clean-java:

     [exec] -modules-clean-bin:

     [exec] clean:
     [exec]    [delete] Deleting 30 files from /home/hybld/continuum-working-directory/6/classlib/build/classes
     [exec]    [delete] Deleting 12 files from /home/hybld/continuum-working-directory/6/classlib/modules/accessibility/bin/test

     [exec] clean:
     [exec]    [delete] Deleting 13 files from /home/hybld/continuum-working-directory/6/classlib/build/classes

     [exec] clean:
     [exec]    [delete] Deleting 35 files from /home/hybld/continuum-working-directory/6/classlib/build/classes
     [exec]    [delete] Deleting 1 files from /home/hybld/continuum-working-directory/6/classlib/modules/applet/bin/test

     [exec] clean:
     [exec]    [delete] Deleting 79 files from /home/hybld/continuum-working-directory/6/classlib/build/classes
     [exec]    [delete] Deleting 47 files from /home/hybld/continuum-working-directory/6/classlib/modules/archive/bin/test

     [exec] clean-native-includes:
     [exec]    [delete] /home/hybld/continuum-working-directory/6/classlib/deploy/include
not found.

     [exec] clean:
     [exec]    [delete] Deleting 113 files from /home/hybld/continuum-working-directory/6/classlib/build/classes
     [exec]    [delete] Deleting 226 files from /home/hybld/continuum-working-directory/6/classlib/modules/auth/bin/test

     [exec] clean:
     [exec]    [delete] Deleting 901 files from /home/hybld/continuum-working-directory/6/classlib/build/classes
     [exec]    [delete] Deleting 574 files from /home/hybld/continuum-working-directory/6/classlib/modules/awt/bin/test

     [exec] clean:
     [exec]    [delete] Deleting 107 files from /home/hybld/continuum-working-directory/6/classlib/build/classes

     [exec] clean:
     [exec]    [delete] Deleting 125 files from /home/hybld/continuum-working-directory/6/classlib/build/classes
     [exec]    [delete] /home/hybld/continuum-working-directory/6/classlib/modules/concurrent/bin/test
not found.

     [exec] clean:
     [exec]    [delete] Deleting 49 files from /home/hybld/continuum-working-directory/6/classlib/build/classes

     [exec] clean:
     [exec]    [delete] Deleting 87 files from /home/hybld/continuum-working-directory/6/classlib/build/classes

     [exec] clean:
     [exec]    [delete] Deleting 9 files from /home/hybld/continuum-working-directory/6/classlib/build/classes

     [exec] clean:
     [exec]    [delete] Deleting 154 files from /home/hybld/continuum-working-directory/6/classlib/build/classes

     [exec] clean:
     [exec]    [delete] Deleting 15 files from /home/hybld/continuum-working-directory/6/classlib/build/classes

     [exec] clean:
     [exec]    [delete] Deleting 34 files from /home/hybld/continuum-working-directory/6/classlib/build/classes

     [exec] clean:
     [exec]    [delete] Deleting 965 files from /home/hybld/continuum-working-directory/6/classlib/build/classes

     [exec] clean-native-includes:
     [exec]    [delete] /home/hybld/continuum-working-directory/6/classlib/deploy/include
not found.
     [exec]    [delete] /home/hybld/continuum-working-directory/6/classlib/deploy/jdk/include
not found.

     [exec] clean:
     [exec]    [delete] Deleting 29 files from /home/hybld/continuum-working-directory/6/classlib/build/classes

     [exec] clean:
     [exec]    [delete] Deleting 14 files from /home/hybld/continuum-working-directory/6/classlib/build/classes

     [exec] clean:
     [exec]    [delete] Deleting 14 files from /home/hybld/continuum-working-directory/6/classlib/build/classes

     [exec] clean:
     [exec]    [delete] Deleting 146 files from /home/hybld/continuum-working-directory/6/classlib/build/classes
     [exec]    [delete] Deleted 5 directories from /home/hybld/continuum-working-directory/6/classlib/build/classes
     [exec]    [delete] /home/hybld/continuum-working-directory/6/classlib/modules/nio/bin/test
not found.

     [exec] clean:
     [exec]    [delete] Deleting 20 files from /home/hybld/continuum-working-directory/6/classlib/build/classes

     [exec] clean:

     [exec] clean-native-includes:
     [exec]    [delete] /home/hybld/continuum-working-directory/6/classlib/deploy/include
not found.

     [exec] clean:
     [exec]    [delete] Deleting 32 files from /home/hybld/continuum-working-directory/6/classlib/build/classes

     [exec] clean:
     [exec]    [delete] Deleting 205 files from /home/hybld/continuum-working-directory/6/classlib/build/classes

     [exec] clean:
     [exec]    [delete] Deleting 177 files from /home/hybld/continuum-working-directory/6/classlib/build/classes

     [exec] clean:
     [exec]    [delete] Deleting 230 files from /home/hybld/continuum-working-directory/6/classlib/build/classes

     [exec] clean:
     [exec]    [delete] Deleting 427 files from /home/hybld/continuum-working-directory/6/classlib/build/classes

     [exec] clean:
     [exec]    [delete] Deleting 2 files from /home/hybld/continuum-working-directory/6/classlib/build/classes

     [exec] clean:
     [exec]    [delete] Deleting 72 files from /home/hybld/continuum-working-directory/6/classlib/build/classes

     [exec] clean:
     [exec]    [delete] Deleting 74 files from /home/hybld/continuum-working-directory/6/classlib/build/classes

     [exec] clean:
     [exec]    [delete] Deleting 5 files from /home/hybld/continuum-working-directory/6/classlib/build/classes

     [exec] clean:
     [exec]    [delete] Deleting 1591 files from /home/hybld/continuum-working-directory/6/classlib/build/classes

     [exec] clean:
     [exec]    [delete] Deleting 40 files from /home/hybld/continuum-working-directory/6/classlib/build/classes

     [exec] clean:
     [exec]    [delete] Deleting 34 files from /home/hybld/continuum-working-directory/6/classlib/build/classes

     [exec] clean:
     [exec]    [delete] Deleting 123 files from /home/hybld/continuum-working-directory/6/classlib/build/classes

     [exec] -clean-bin-catch-all-test:

     [exec] -clean-bin-catch-all:
     [exec]    [delete] Deleted 306 directories from /home/hybld/continuum-working-directory/6/classlib/build/classes

     [exec] -clean-bin:

     [exec] -clean-layout:
     [exec]    [delete] /home/hybld/continuum-working-directory/6/classlib/deploy/jdk not
found.

     [exec] clean:

     [exec] clean-native:

     [exec] copy-makefile-includes:
     [exec]     [mkdir] Created dir: /home/hybld/continuum-working-directory/6/classlib/deploy/build/make
     [exec]      [copy] Copying 10 files to /home/hybld/continuum-working-directory/6/classlib/deploy/build/make

     [exec] -make-clean:

     [exec] clean-native:
     [exec]      [exec] rm -f ../shared/hysig_copyright.o hysiglinux.o hysigunix.o ../libhysig.so
 
     [exec]      [exec] rm -f ../shared/thread_copyright.o x86/thrhelp.o x86/thrspinlock.o
../shared/hythread.o ../shared/hythreadinspect.o linuxonexit.o priority.o rasthrsup.o ../shared/rwmutex.o
thrcreate.o thrdsup.o ../shared/thrprof.o ../libhythr.so  
     [exec]      [exec] rm -f ../shared/port_copyright.o hycpu.o ../shared/hyerror.o hyerrorhelpers.o
../shared/hyexit.o hyfile.o hyfiletext.o ../shared/hygp.o hyipcmutex.o hymem.o hymmap.o ../shared/hynls.o
hynlshelpers.o hyosdump.o ../shared/hyport.o ../shared/hyportcontrol.o hyportptb.o hysharedhelper.o
hyshmem.o hyshsem.o hysl.o hysock.o ../shared/hystr.o ../shared/hystrftime.o ../shared/hystsl.o
hysysinfo.o hytime.o ../shared/hytlshelpers.o hytty.o hyvmem.o hysignal.o linux.x86/hysignal_context.o
../libhyprt.so  /home/hybld/continuum-working-directory/6/classlib/deploy/lib/libhyprt.a
     [exec]      [exec] rm -f ../shared/libglob.o ../shared/iohelp.o ../shared/exceptions.o
../shared/strhelp.o ../shared/utf8encode.o ../shared/utf8decode.o   /home/hybld/continuum-working-directory/6/classlib/deploy/lib/libhycommon.a
     [exec]      [exec] rm -f ../shared/pool.o ../shared/pool_cap.o   /home/hybld/continuum-working-directory/6/classlib/deploy/lib/libhypool.a

     [exec] clean-native:
     [exec]      [exec] rm -f ../shared/auth_copyright.o authnix.o ../libhyauth.so  

     [exec] clean-native:
     [exec]      [exec] rm -f ../shared/zcpool.o ../shared/zipalloc.o ../shared/zipcache.o
../shared/zipsup.o   /home/hybld/continuum-working-directory/6/classlib/deploy/lib/libhyzip.a
     [exec]      [exec] rm -f ../shared/zlib_copyright.o ../../zlib_dist/adler32.o ../../zlib_dist/compress.o
../../zlib_dist/crc32.o ../../zlib_dist/deflate.o ../../zlib_dist/infback.o ../../zlib_dist/inffast.o
../../zlib_dist/inflate.o ../../zlib_dist/inftrees.o ../../zlib_dist/trees.o ../../zlib_dist/uncompr.o
../../zlib_dist/zutil.o ../libhyzlib.so  

...

     [exec]     [junit] Tests run: 16, Failures: 0, Errors: 0, Time elapsed: 0.029 sec
     [exec]     [junit] Tests run: 15, Failures: 0, Errors: 0, Time elapsed: 0.05 sec
     [exec]     [junit] Tests run: 25, Failures: 0, Errors: 0, Time elapsed: 0.456 sec
     [exec]     [junit] Tests run: 17, Failures: 0, Errors: 0, Time elapsed: 0.039 sec
     [exec]     [junit] Finish connection failed, probably due to reset by peer error.
     [exec]     [junit] Finish connection failed, probably due to reset by peer error.
     [exec]     [junit] Connection refused
     [exec]     [junit] Tests run: 81, Failures: 0, Errors: 0, Time elapsed: 0.12 sec
     [exec]     [junit] Tests run: 14, Failures: 0, Errors: 0, Time elapsed: 0.052 sec
     [exec]     [junit] Tests run: 2, Failures: 0, Errors: 0, Time elapsed: 0.015 sec
     [exec]     [junit] Tests run: 2, Failures: 0, Errors: 0, Time elapsed: 0.014 sec

...

     [exec] test-all:

     [exec] BUILD SUCCESSFUL
     [exec] Total time: 43 minutes 3 seconds
     [echo] Tests.failed is set to ${tests.failed}

check-class-load-lists:
     [exec] Checking for class load lists in classlists/app
     [exec] Placing reports in classlib/build/classload
     [exec] Comparing jre in classlib/deploy/jdk/jre

...

     [exec] Processing package java.lang.management,:=========================================================================+++++++++++++++
     [exec] Processing package java.lang.ref,:=========================================================================+++++
     [exec] Processing package java.lang.reflect,:=========================================================================+++++++++++++++++++++
     [exec] Processing class ,java:
     [exec] Failed to Japize java: java.lang.RuntimeException: NoClassDefFoundError: java
     [exec] java.lang.RuntimeException: NoClassDefFoundError: java
     [exec] 	at net.wuffies.japi.ClassFile.forName(ClassFile.java:163)
     [exec] 	at net.wuffies.japi.Japize.getClassWrapper(Japize.java:1425)
     [exec] 	at net.wuffies.japi.Japize.japizeClass(Japize.java:748)
     [exec] 	at net.wuffies.japi.Japize.processClass(Japize.java:516)

...

     [exec] 	at net.wuffies.japi.Japize.doJapize(Japize.java:443)
     [exec] 	at net.wuffies.japi.Japize.main(Japize.java:316)

     [exec] Processing class ,javax:
     [exec] Failed to Japize javax: java.lang.RuntimeException: NoClassDefFoundError: javax
     [exec] java.lang.RuntimeException: NoClassDefFoundError: javax
     [exec] 	at net.wuffies.japi.ClassFile.forName(ClassFile.java:163)
     [exec] 	at net.wuffies.japi.Japize.getClassWrapper(Japize.java:1425)
     [exec] 	at net.wuffies.japi.Japize.japizeClass(Japize.java:748)
     [exec] 	at net.wuffies.japi.Japize.processClass(Japize.java:516)

...

     [exec] 	at net.wuffies.japi.Japize.doJapize(Japize.java:443)
     [exec] 	at net.wuffies.japi.Japize.main(Japize.java:316)

     [exec] Processing class ,org:
     [exec] Failed to Japize org: java.lang.RuntimeException: NoClassDefFoundError: org
     [exec] java.lang.RuntimeException: NoClassDefFoundError: org
     [exec] 	at net.wuffies.japi.ClassFile.forName(ClassFile.java:163)
     [exec] 	at net.wuffies.japi.Japize.getClassWrapper(Japize.java:1425)
     [exec] 	at net.wuffies.japi.Japize.japizeClass(Japize.java:748)
     [exec] 	at net.wuffies.japi.Japize.processClass(Japize.java:516)

...

Mime
View raw message