harmony-commits mailing list archives

Site index · List index
Message view « Date » · « Thread »
Top « Date » · « Thread »
From nom...@intel.com
Subject [build-test alert] BUILD FAILED Windows XP SP2 msvc debug: classlib over ibmvm
Date Thu, 14 Dec 2006 09:48:13 GMT
BUILD FAILED:
	Ant Error Message:
C:\cc.harmony\trunk\cc\projects\classlib\trunk\build.xml:167: The following error occurred
while executing this line: C:\cc.harmony\trunk\cc\projects\classlib\trunk\make\build-test.xml:136:
There were test errors.

Date of build:	12/14/2006 14:24:02
Time to build:	83 minutes 29 seconds
Last changed:	12/14/2006 13:16:33
Last log entry:	Fixed SecurityManagerTest to pass on DRLVM.

***********************************************************
Errors/Warnings:(396)
            
Tests FAILED

***********************************************************
Unit Tests: (16709)
        
error: testParamString javax.swing.JToggleButtonTest
error: testSerializable javax.swing.text.AbstractDocument_SerializationTest
error: testSerializable javax.swing.text.DefaultStyledDocumentTest
Unit Test Error Details:	(3)
                
Test: testParamStringClass: javax.swing.JToggleButtonTestjava.lang.ArrayIndexOutOfBoundsException
	at java.util.Arrays.mergeSort(Arrays.java:2553)
	at java.util.Arrays.mergeSort(Arrays.java:2516)
	at java.util.Arrays.sort(Arrays.java:2872)
	at java.util.Arrays.sort(Arrays.java:2889)
	at java.beans.BeanInfoWrapper.getPropertyDescriptors(BeanInfoWrapper.java:77)
	at java.beans.BeanInfoWrapper.getPropertyDescriptors(BeanInfoWrapper.java:74)
	at javax.swing.JComponent.paramString(JComponent.java:1335)
	at java.awt.Component.toString(Component.java:166)
	at javax.swing.JToggleButtonTest.testParamString(JToggleButtonTest.java:64)
	at java.lang.reflect.AccessibleObject.invokeV(AccessibleObject.java:25)
	at javax.swing.BasicSwingTestCase.runBareSuper(BasicSwingTestCase.java:117)
	at javax.swing.SwingTestCase$1.run(SwingTestCase.java:45)
	at java.awt.event.InvocationEvent.runAndNotify(InvocationEvent.java:92)
	at java.awt.event.InvocationEvent.dispatch(InvocationEvent.java:81)
	at java.awt.EventQueueCore.dispatchEventImpl(EventQueueCore.java:133)
	at java.awt.EventQueue.dispatchEvent(EventQueue.java:144)
	at java.awt.EventDispatchThread.runModalLoop(EventDispatchThread.java:75)
	at java.awt.EventDispatchThread.run(EventDispatchThread.java:48)

Test: testSerializableClass: javax.swing.text.AbstractDocument_SerializationTestjava.lang.ArrayIndexOutOfBoundsException
	at java.util.Arrays.mergeSort(Arrays.java:2553)
	at java.util.Arrays.mergeSort(Arrays.java:2516)
	at java.util.Arrays.mergeSort(Arrays.java:2517)
	at java.util.Arrays.sort(Arrays.java:2872)
	at java.util.Arrays.sort(Arrays.java:2889)
	at java.io.ObjectStreamClass.computeSerialVersionUID(ObjectStreamClass.java:54)
	at java.io.ObjectStreamClass.addToCache(ObjectStreamClass.java:211)
	at java.io.ObjectStreamClass.lookupStreamClass(ObjectStreamClass.java:937)
	at java.io.ObjectStreamClass.lookup(ObjectStreamClass.java:90)
	at java.io.ObjectStreamClass.addToCache(ObjectStreamClass.java:23)
	at java.io.ObjectStreamClass.lookupStreamClass(ObjectStreamClass.java:937)
	at java.io.ObjectStreamClass.lookup(ObjectStreamClass.java:90)
	at java.io.ObjectOutputStream.writeClassDescForClass(ObjectOutputStream.java:110)
	at java.io.ObjectOutputStream.writeNewObject(ObjectOutputStream.java:1644)
	at java.io.ObjectOutputStream.writeObjectInternal(ObjectOutputStream.java:1956)
	at java.io.ObjectOutputStream.writeObject(ObjectOutputStream.java:1785)
	at java.io.ObjectOutputStream.writeObject(ObjectOutputStream.java:1749)
	at javax.swing.BasicSwingTestCase.serializeObject(BasicSwingTestCase.java:496)
	at javax.swing.SerializableTestCase.setUp(SerializableTestCase.java:50)
	at javax.swing.text.AbstractDocument_SerializationTest.setUp(AbstractDocument_SerializationTest.java:43)

Test: testSerializableClass: javax.swing.text.DefaultStyledDocumentTestjava.io.OptionalDataException
	at java.io.ObjectInputStream.readNonPrimitiveContent(ObjectInputStream.java:843)
	at java.io.ObjectInputStream.readObject(ObjectInputStream.java:218)
	at java.io.ObjectInputStream.readObject(ObjectInputStream.java:260)
	at java.io.ObjectInputStream.readFieldValues(ObjectInputStream.java:1157)
	at java.io.ObjectInputStream.defaultReadObject(ObjectInputStream.java:432)
	at javax.swing.text.DefaultStyledDocument.readObject(DefaultStyledDocument.java:1447)
	at java.lang.reflect.AccessibleObject.invokeV(AccessibleObject.java:25)
	at java.io.ObjectInputStream.readObjectForClass(ObjectInputStream.java:1364)
	at java.io.ObjectInputStream.readHierarchy(ObjectInputStream.java:1298)
	at java.io.ObjectInputStream.readNewObject(ObjectInputStream.java:1940)
	at java.io.ObjectInputStream.readNonPrimitiveContent(ObjectInputStream.java:820)
	at java.io.ObjectInputStream.readObject(ObjectInputStream.java:218)
	at java.io.ObjectInputStream.readObject(ObjectInputStream.java:260)
	at javax.swing.BasicSwingTestCase.serializeObject(BasicSwingTestCase.java:52)
	at javax.swing.text.DefaultStyledDocumentTest.testSerializable(DefaultStyledDocumentTest.java:177)
	at java.lang.reflect.AccessibleObject.invokeV(AccessibleObject.java:25)
	at javax.swing.BasicSwingTestCase.runBareSuper(BasicSwingTestCase.java:117)
	at javax.swing.BasicSwingTestCase.runBareImpl(BasicSwingTestCase.java:122)
	at javax.swing.BasicSwingTestCase$1.run(BasicSwingTestCase.java:136)
	at java.lang.Thread.run(Thread.java:872)


***********************************************************
Modifications since last successful build:	(4)
            
modified varlax  /harmony/enhanced/classlib/trunk/modules/luni/src/test/java/org/apache/harmony/luni/tests/java/lang/MutableSecurityManager.java
12/14/2006 13:16:33 Fixed SecurityManagerTest to pass on DRLVM.
modified varlax  /harmony/enhanced/classlib/trunk/modules/luni/src/test/java/org/apache/harmony/luni/tests/java/lang/SecurityManagerTest.java
12/14/2006 13:16:33 Fixed SecurityManagerTest to pass on DRLVM.
modified varlax  /harmony/enhanced/classlib/trunk/modules/luni/src/main/native/luni/shared/luniglob.c
12/14/2006 12:48:25 Fixed vmi properties handling as agreed on dev list.Tested with j9 and
drlvm on SUSE9
modified varlax  /harmony/enhanced/classlib/trunk/modules/luni/src/main/native/include/shared/vmi.h
12/14/2006 12:48:25 Fixed vmi properties handling as agreed on dev list.Tested with j9 and
drlvm on SUSE9

Mime
View raw message