harmony-commits mailing list archives

Site index · List index
Message view « Date » · « Thread »
Top « Date » · « Thread »
From nom...@intel.com
Subject [build-test alert] BUILD FAILED Windows XP SP2 msvc debug: classlib over drlvm
Date Tue, 12 Dec 2006 15:47:24 GMT
BUILD FAILED:
	Ant Error Message:
C:\cc.harmony\trunk\cc\projects\classlib\trunk\build.xml:167: The following error occurred
while executing this line: C:\cc.harmony\trunk\cc\projects\classlib\trunk\make\build-test.xml:132:
There were test errors.

Date of build:	12/12/2006 21:11:58
Time to build:	33 minutes 17 seconds
Last changed:	12/12/2006 20:55:30
Last log entry:	Makefile is changed to use compiler options from the common place

***********************************************************
Errors/Warnings:(164)
            
Tests FAILED

***********************************************************
Unit Tests: (19173)
        
error: test_combine$Ljava_security_ProtectionDomain$Ljava_security_ProtectionDomain tests.api.java.security.DomainCombinerTest
failure: test_checkMemberAccessLjava_lang_ClassI org.apache.harmony.luni.tests.java.lang.SecurityManagerTest
Unit Test Error Details:	(2)
                
Test: test_combine$Ljava_security_ProtectionDomain$Ljava_security_ProtectionDomainClass: tests.api.java.security.DomainCombinerTestjava.security.AccessControlException:
Permission check failed (java.security.SecurityPermission getProperty.package.access)
	at java.security.AccessControlContext.checkPermission(Unknown Source)
	at java.security.AccessController.checkPermission(Unknown Source)
	at java.lang.SecurityManager.checkPermission(SecurityManager.java:733)
	at tests.api.java.security.DomainCombinerTest$1.checkPermission(DomainCombinerTest.java:81)
	at java.lang.SecurityManager.checkSecurityAccess(SecurityManager.java:421)
	at java.security.Security.getProperty(Security.java:360)
	at org.apache.harmony.luni.util.PriviAction.run(PriviAction.java:131)
	at java.security.AccessController.doPrivilegedImpl(Unknown Source)
	at java.security.AccessController.doPrivileged(Unknown Source)
	at java.lang.SecurityManager.checkPackageProperty(SecurityManager.java:332)
	at java.lang.SecurityManager.checkPackageAccess(SecurityManager.java:303)
	at java.lang.ClassLoader$SystemClassLoader.loadClass(Unknown Source)
	at java.lang.ClassLoader.loadClass(Unknown Source)
	at java.security.AccessController.doPrivilegedImpl(Unknown Source)
	at java.security.AccessController.doPrivileged(Unknown Source)
	at tests.api.java.security.DomainCombinerTest.test_combine$Ljava_security_ProtectionDomain$Ljava_security_ProtectionDomain(DomainCombinerTest.java:89)
	at java.lang.reflect.VMReflection.invokeMethod(Native Method)

Test: test_checkMemberAccessLjava_lang_ClassIClass: org.apache.harmony.luni.tests.java.lang.SecurityManagerTestjunit.framework.AssertionFailedError:
This should not throw a security exception
	at org.apache.harmony.luni.tests.java.lang.SecurityManagerTest.test_checkMemberAccessLjava_lang_ClassI(SecurityManagerTest.java:129)
	at java.lang.reflect.VMReflection.invokeMethod(Native Method)


***********************************************************
Modifications since last successful build:	(72)
            
modified apetrenko  /harmony/enhanced/classlib/trunk/modules/awt/src/main/native/win32wrapper/windows/makefile
12/12/2006 20:55:30 Makefile is changed to use compiler options from the common place
modified apetrenko  /harmony/enhanced/classlib/trunk/modules/awt/src/main/native/gl/windows/gl.def
12/12/2006 20:22:21 Patch for HARMONY-1505 "[build?] Some of the Harmony jni libraries has
wrong function names inside"
modified apetrenko  /harmony/enhanced/classlib/trunk/modules/nio/src/main/native/nio/windows/hynio.def
12/12/2006 20:22:21 Patch for HARMONY-1505 "[build?] Some of the Harmony jni libraries has
wrong function names inside"
modified apetrenko  /harmony/enhanced/classlib/trunk/modules/awt/src/main/native/jpegdecoder/windows/jpegdecoder.def
12/12/2006 20:22:21 Patch for HARMONY-1505 "[build?] Some of the Harmony jni libraries has
wrong function names inside"
modified apetrenko  /harmony/enhanced/classlib/trunk/modules/awt/src/main/native/win32wrapper/windows/Win32Wrapper.def
12/12/2006 20:22:21 Patch for HARMONY-1505 "[build?] Some of the Harmony jni libraries has
wrong function names inside"
modified apetrenko  /harmony/enhanced/classlib/trunk/modules/archive/src/main/native/archive/windows/hyarchive.def
12/12/2006 20:22:21 Patch for HARMONY-1505 "[build?] Some of the Harmony jni libraries has
wrong function names inside"
modified apetrenko  /harmony/enhanced/classlib/trunk/modules/auth/src/main/native/auth/windows/hyauth.def
12/12/2006 20:22:21 Patch for HARMONY-1505 "[build?] Some of the Harmony jni libraries has
wrong function names inside"
modified apetrenko  /harmony/enhanced/classlib/trunk/modules/misc/src/main/native/accessors/windows/accessors.def
12/12/2006 20:22:21 Patch for HARMONY-1505 "[build?] Some of the Harmony jni libraries has
wrong function names inside"
modified apetrenko  /harmony/enhanced/classlib/trunk/modules/luni/src/main/native/luni/windows/hyluni.def
12/12/2006 20:22:21 Patch for HARMONY-1505 "[build?] Some of the Harmony jni libraries has
wrong function names inside"
modified apetrenko  /harmony/enhanced/classlib/trunk/modules/security/src/main/native/security/windows/hysecurity.def
12/12/2006 20:22:21 Patch for HARMONY-1505 "[build?] Some of the Harmony jni libraries has
wrong function names inside"
modified apetrenko  /harmony/enhanced/classlib/trunk/modules/instrument/src/main/native/instrument/windows/hyinstrument.def
12/12/2006 20:22:21 Patch for HARMONY-1505 "[build?] Some of the Harmony jni libraries has
wrong function names inside"
modified apetrenko  /harmony/enhanced/classlib/trunk/modules/awt/src/main/native/winfont/windows/fontlib.def
12/12/2006 20:22:21 Patch for HARMONY-1505 "[build?] Some of the Harmony jni libraries has
wrong function names inside"
modified apetrenko  /harmony/enhanced/classlib/trunk/modules/text/src/main/native/text/windows/hytext.def
12/12/2006 20:22:21 Patch for HARMONY-1505 "[build?] Some of the Harmony jni libraries has
wrong function names inside"
modified apetrenko  /harmony/enhanced/classlib/trunk/modules/prefs/src/main/native/prefs/windows/hyprefs.def
12/12/2006 20:22:21 Patch for HARMONY-1505 "[build?] Some of the Harmony jni libraries has
wrong function names inside"
modified apetrenko  /harmony/enhanced/classlib/trunk/modules/luni/src/main/native/luni/shared/netif.c
12/12/2006 20:17:27 Pach for HARMONY-1608 "Number of JNI methods in archive and luni modules
are not marked as JNIEXPORT"
modified apetrenko  /harmony/enhanced/classlib/trunk/modules/luni/src/main/native/include/windows/jclprots.h
12/12/2006 20:17:27 Pach for HARMONY-1608 "Number of JNI methods in archive and luni modules
are not marked as JNIEXPORT"
modified apetrenko  /harmony/enhanced/classlib/trunk/modules/archive/src/main/native/archive/shared/archiveglob.c
12/12/2006 20:17:27 Pach for HARMONY-1608 "Number of JNI methods in archive and luni modules
are not marked as JNIEXPORT"
modified apetrenko  /harmony/enhanced/classlib/trunk/modules/archive/src/main/native/archive/shared/deflater.c
12/12/2006 20:17:27 Pach for HARMONY-1608 "Number of JNI methods in archive and luni modules
are not marked as JNIEXPORT"
modified apetrenko  /harmony/enhanced/classlib/trunk/modules/luni/src/main/native/luni/shared/luniglob.c
12/12/2006 20:17:27 Pach for HARMONY-1608 "Number of JNI methods in archive and luni modules
are not marked as JNIEXPORT"
modified apetrenko  /harmony/enhanced/classlib/trunk/modules/luni/src/main/native/luni/shared/bigint.c
12/12/2006 20:17:27 Pach for HARMONY-1608 "Number of JNI methods in archive and luni modules
are not marked as JNIEXPORT"
modified apetrenko  /harmony/enhanced/classlib/trunk/modules/luni/src/main/native/luni/shared/filedesc.c
12/12/2006 20:17:27 Pach for HARMONY-1608 "Number of JNI methods in archive and luni modules
are not marked as JNIEXPORT"
modified apetrenko  /harmony/enhanced/classlib/trunk/modules/luni/src/main/native/luni/shared/process.c
12/12/2006 20:17:27 Pach for HARMONY-1608 "Number of JNI methods in archive and luni modules
are not marked as JNIEXPORT"
modified apetrenko  /harmony/enhanced/classlib/trunk/modules/luni/src/main/native/luni/shared/file.c
12/12/2006 20:17:27 Pach for HARMONY-1608 "Number of JNI methods in archive and luni modules
are not marked as JNIEXPORT"
modified apetrenko  /harmony/enhanced/classlib/trunk/modules/archive/src/main/native/archive/shared/adler32.c
12/12/2006 20:17:27 Pach for HARMONY-1608 "Number of JNI methods in archive and luni modules
are not marked as JNIEXPORT"
modified apetrenko  /harmony/enhanced/classlib/trunk/modules/luni/src/main/native/luni/shared/bigint.h
12/12/2006 20:17:27 Pach for HARMONY-1608 "Number of JNI methods in archive and luni modules
are not marked as JNIEXPORT"
modified apetrenko  /harmony/enhanced/classlib/trunk/modules/luni/src/main/native/luni/shared/proxy.c
12/12/2006 20:17:27 Pach for HARMONY-1608 "Number of JNI methods in archive and luni modules
are not marked as JNIEXPORT"
modified apetrenko  /harmony/enhanced/classlib/trunk/modules/luni/src/main/native/luni/shared/osc.c
12/12/2006 20:17:27 Pach for HARMONY-1608 "Number of JNI methods in archive and luni modules
are not marked as JNIEXPORT"
modified apetrenko  /harmony/enhanced/classlib/trunk/modules/archive/src/main/native/archive/shared/zip.c
12/12/2006 20:17:27 Pach for HARMONY-1608 "Number of JNI methods in archive and luni modules
are not marked as JNIEXPORT"
modified apetrenko  /harmony/enhanced/classlib/trunk/modules/archive/src/main/native/archive/shared/inflater.c
12/12/2006 20:17:27 Pach for HARMONY-1608 "Number of JNI methods in archive and luni modules
are not marked as JNIEXPORT"
modified apetrenko  /harmony/enhanced/classlib/trunk/modules/archive/src/main/native/archive/shared/jclcrc32.c
12/12/2006 20:17:27 Pach for HARMONY-1608 "Number of JNI methods in archive and luni modules
are not marked as JNIEXPORT"
modified apetrenko  /harmony/enhanced/classlib/trunk/modules/luni/src/main/native/luni/shared/math.c
12/12/2006 20:17:27 Pach for HARMONY-1608 "Number of JNI methods in archive and luni modules
are not marked as JNIEXPORT"
modified apetrenko  /harmony/enhanced/classlib/trunk/modules/luni/src/main/native/luni/shared/ois.c
12/12/2006 20:17:27 Pach for HARMONY-1608 "Number of JNI methods in archive and luni modules
are not marked as JNIEXPORT"
modified apetrenko  /harmony/enhanced/classlib/trunk/modules/luni/src/main/native/luni/shared/timezone.c
12/12/2006 20:17:27 Pach for HARMONY-1608 "Number of JNI methods in archive and luni modules
are not marked as JNIEXPORT"
modified apetrenko  /harmony/enhanced/classlib/trunk/modules/luni/src/main/native/luni/shared/inetadds.c
12/12/2006 20:17:27 Pach for HARMONY-1608 "Number of JNI methods in archive and luni modules
are not marked as JNIEXPORT"
modified apetrenko  /harmony/enhanced/classlib/trunk/modules/archive/src/main/native/archive/shared/inflater.h
12/12/2006 20:17:27 Pach for HARMONY-1608 "Number of JNI methods in archive and luni modules
are not marked as JNIEXPORT"
modified apetrenko  /harmony/enhanced/classlib/trunk/modules/archive/src/main/native/archive/shared/jarfile.c
12/12/2006 20:17:27 Pach for HARMONY-1608 "Number of JNI methods in archive and luni modules
are not marked as JNIEXPORT"
modified apetrenko  /harmony/enhanced/classlib/trunk/modules/luni/src/main/native/luni/shared/oos.c
12/12/2006 20:17:27 Pach for HARMONY-1608 "Number of JNI methods in archive and luni modules
are not marked as JNIEXPORT"
add cc-drlvm log20061212200621Lbuild.3 12/12/2006 20:06:21drlvm
added tellison  /harmony/enhanced/classlib/trunk/modules/misc/src/test/java/common 12/12/2006
19:15:03 Adding test case from HARMONY-2616 ([classlib][misc] StringAccessor.getChars(long,
long, String, int, int) doesn't set trailing zero)
added tellison  /harmony/enhanced/classlib/trunk/modules/misc/src/test/java/common/org/apache/harmony/misc
12/12/2006 19:15:03 Adding test case from HARMONY-2616 ([classlib][misc] StringAccessor.getChars(long,
long, String, int, int) doesn't set trailing zero)
added tellison  /harmony/enhanced/classlib/trunk/modules/misc/src/test/java/common/org/apache/harmony/misc/tests/accessors/StringAccessorTest.java
12/12/2006 19:15:03 Adding test case from HARMONY-2616 ([classlib][misc] StringAccessor.getChars(long,
long, String, int, int) doesn't set trailing zero)
added tellison  /harmony/enhanced/classlib/trunk/modules/misc/src/test/java/common/org/apache/harmony/misc/tests
12/12/2006 19:15:03 Adding test case from HARMONY-2616 ([classlib][misc] StringAccessor.getChars(long,
long, String, int, int) doesn't set trailing zero)
added tellison  /harmony/enhanced/classlib/trunk/modules/misc/src/test/java/common/org/apache/harmony
12/12/2006 19:15:03 Adding test case from HARMONY-2616 ([classlib][misc] StringAccessor.getChars(long,
long, String, int, int) doesn't set trailing zero)
added tellison  /harmony/enhanced/classlib/trunk/modules/misc/src/test/java/common/org 12/12/2006
19:15:03 Adding test case from HARMONY-2616 ([classlib][misc] StringAccessor.getChars(long,
long, String, int, int) doesn't set trailing zero)
added tellison  /harmony/enhanced/classlib/trunk/modules/misc/src/test/java/common/org/apache/harmony/misc/tests/accessors
12/12/2006 19:15:03 Adding test case from HARMONY-2616 ([classlib][misc] StringAccessor.getChars(long,
long, String, int, int) doesn't set trailing zero)
added tellison  /harmony/enhanced/classlib/trunk/modules/misc/src/test/java/common/org/apache
12/12/2006 19:15:03 Adding test case from HARMONY-2616 ([classlib][misc] StringAccessor.getChars(long,
long, String, int, int) doesn't set trailing zero)
modified tellison  /harmony/enhanced/classlib/trunk/modules/awt/src/main/native/oglwrapper/windows
12/12/2006 19:13:48 Add build artefacts to svn ignore list.
modified tellison  /harmony/enhanced/classlib/trunk/modules/awt/src/main/native/oglwrapper/shared
12/12/2006 19:13:48 Add build artefacts to svn ignore list.
modified tellison  /harmony/enhanced/classlib/trunk/modules/misc/build.xml 12/12/2006 19:11:46
Apply patch HARMONY-2616 ([classlib][misc] StringAccessor.getChars(long, long, String, int,
int) doesn't set trailing zero)
modified tellison  /harmony/enhanced/classlib/trunk/modules/misc/make/hyproperties.xml 12/12/2006
19:11:46 Apply patch HARMONY-2616 ([classlib][misc] StringAccessor.getChars(long, long, String,
int, int) doesn't set trailing zero)
modified tellison  /harmony/enhanced/classlib/trunk/modules/misc/src/main/java/org/apache/harmony/misc/accessors/StringAccessor.java
12/12/2006 19:11:46 Apply patch HARMONY-2616 ([classlib][misc] StringAccessor.getChars(long,
long, String, int, int) doesn't set trailing zero)
modified tellison  /harmony/enhanced/classlib/trunk/modules/nio_char/src/main/java/java/nio/charset/CharsetEncoder.java
12/12/2006 18:01:56 Fix comment typo raised in HARMONY-2559 ([Classlib][nio_char] Wrong words
in nio_char module)
modified odeakin  /harmony/enhanced/classlib/trunk/modules/luni/src/main/native/luni/shared/luniglob.c
12/12/2006 17:45:07 fixing formatting (looked fine in my editor ;)
modified tellison  /harmony/enhanced/classlib/trunk/modules/luni/src/main/java/java/io/BufferedInputStream.java
12/12/2006 17:40:33 Code formatting and tidy-up.Increase buffer size to 8k.
modified tellison  /harmony/enhanced/classlib/trunk/modules/luni/src/main/java/java/io/BufferedOutputStream.java
12/12/2006 17:40:33 Code formatting and tidy-up.Increase buffer size to 8k.
modified smishura  /harmony/enhanced/classlib/trunk/modules/luni/src/main/java/java/lang/SecurityManager.java
12/12/2006 17:32:15 Roll back commit r486052 (Fixed HARMONY-2301 [luni] flawed SecurityManager.checkPackageAccess()
impl)CC was down because of it. Also classlib tests fails for me on DRL VM and IBM VME
modified smishura  /harmony/enhanced/classlib/trunk/modules/luni/src/test/java/org/apache/harmony/luni/tests/java/lang/MutableSecurityManager.java
12/12/2006 17:32:15 Roll back commit r486052 (Fixed HARMONY-2301 [luni] flawed SecurityManager.checkPackageAccess()
impl)CC was down because of it. Also classlib tests fails for me on DRL VM and IBM VME
modified smishura  /harmony/enhanced/classlib/trunk/modules/luni/src/test/java/org/apache/harmony/luni/tests/java/lang/SecurityManagerTest.java
12/12/2006 17:32:15 Roll back commit r486052 (Fixed HARMONY-2301 [luni] flawed SecurityManager.checkPackageAccess()
impl)CC was down because of it. Also classlib tests fails for me on DRL VM and IBM VME
modified smishura  /harmony/enhanced/classlib/trunk/modules/luni/src/main/java/org/apache/harmony/luni/util/PriviAction.java
12/12/2006 17:32:15 Roll back commit r486052 (Fixed HARMONY-2301 [luni] flawed SecurityManager.checkPackageAccess()
impl)CC was down because of it. Also classlib tests fails for me on DRL VM and IBM VME
modified odeakin  /harmony/enhanced/classlib/trunk/modules/luni/src/main/native/luni/shared/luniglob.c
12/12/2006 17:31:55 Previously we just replaced whatever was already in the org.apache.harmony.boot.class.path
property with our own bootclasspath. We should not assume that this property is empty before
we use it - it depends on the VM's bcp initialisation order and how it utilises this property
internally.
modified tellison  /harmony/enhanced/classlib/trunk/modules/luni/src/main/java/java/io/PipedOutputStream.java
12/12/2006 17:15:22 Minor code tidy-up, fix compiler warnings, externalize strings.
modified tellison  /harmony/enhanced/classlib/trunk/modules/luni/src/main/java/java/io/RandomAccessFile.java
12/12/2006 17:15:22 Minor code tidy-up, fix compiler warnings, externalize strings.
modified tellison  /harmony/enhanced/classlib/trunk/modules/luni/src/main/java/java/io/InvalidClassException.java
12/12/2006 17:15:22 Minor code tidy-up, fix compiler warnings, externalize strings.
modified tellison  /harmony/enhanced/classlib/trunk/modules/luni/src/main/java/java/io/InputStreamReader.java
12/12/2006 17:11:24 Externalize strings.
modified liangyx  /harmony/enhanced/classlib/trunk/modules/luni/src/test/java/org/apache/harmony/luni/tests/java/lang/StringBuffer2Test.java
12/12/2006 17:05:17 Throw StringIndexOutOfBoundsException instead of ArrayIndexOutOfBoundsException
modified liangyx  /harmony/enhanced/classlib/trunk/modules/luni/src/main/java/java/lang/AbstractStringBuilder.java
12/12/2006 17:05:17 Throw StringIndexOutOfBoundsException instead of ArrayIndexOutOfBoundsException
modified tellison  /harmony/enhanced/classlib/trunk/modules/luni/src/main/java/java/io/InputStreamReader.java
12/12/2006 16:59:03 Apply patch for HARMONY-2556 ([classlib] [luni] Fixes for some minor issues
in the java.lang and java.io packages found by Melody)
modified tellison  /harmony/enhanced/classlib/trunk/modules/luni/src/main/java/java/io/OutputStreamWriter.java
12/12/2006 16:59:03 Apply patch for HARMONY-2556 ([classlib] [luni] Fixes for some minor issues
in the java.lang and java.io packages found by Melody)
modified apetrenko  /harmony/enhanced/classlib/trunk/modules/misc/src/main/native/accessors/shared/org_apache_harmony_misc_accessors_StringAccessorImpl.c
12/12/2006 16:03:24 Makefile is changed to use compiler options from the common placeCompiler
warnings are fixed
modified apetrenko  /harmony/enhanced/classlib/trunk/modules/misc/src/main/native/accessors/windows/makefile
12/12/2006 16:03:24 Makefile is changed to use compiler options from the common placeCompiler
warnings are fixed
modified apetrenko  /harmony/enhanced/classlib/trunk/modules/misc/src/main/native/accessors/shared/org_apache_harmony_misc_accessors_MemoryAccessorNativeImpl.c
12/12/2006 16:03:24 Makefile is changed to use compiler options from the common placeCompiler
warnings are fixed
modified apetrenko  /harmony/enhanced/classlib/trunk/modules/misc/src/main/native/accessors/shared/org_apache_harmony_misc_accessors_Malloc.c
12/12/2006 16:03:24 Makefile is changed to use compiler options from the common placeCompiler
warnings are fixed

Mime
View raw message