harmony-commits mailing list archives

Site index · List index
Message view « Date » · « Thread »
Top « Date » · « Thread »
From nom...@intel.com
Subject [build-test alert] BUILD FAILED Linux SUSE 9 gcc debug: classlib over ibmvm
Date Tue, 12 Dec 2006 09:32:03 GMT
BUILD FAILED:
	Ant Error Message:
/export/viv/trunk/cc/projects/classlib/trunk/build.xml:167: The following error occurred while
executing this line: /export/viv/trunk/cc/projects/classlib/trunk/make/build-test.xml:132:
There were test errors.

Date of build:	12/12/2006 14:44:03
Time to build:	47 minutes 22 seconds
Last changed:	12/12/2006 13:43:28
Last log entry:	Fixed HARMONY-2301 [luni] flawed SecurityManager.checkPackageAccess() impl
Regression tests added.
Tested on DRLVM

***********************************************************
Errors/Warnings:	(1597)
            
Tests FAILED

***********************************************************
Unit Tests: (18778)
        
error: test_combine$Ljava_security_ProtectionDomain$Ljava_security_ProtectionDomain tests.api.java.security.DomainCombinerTest
Unit Test Error Details:	(1)
                
Test: test_combine$Ljava_security_ProtectionDomain$Ljava_security_ProtectionDomainClass: tests.api.java.security.DomainCombinerTestjava.security.AccessControlException:
Access denied (java.security.SecurityPermission getProperty.package.access)
	at java.security.AccessController.checkPermission(AccessController.java:94)
	at java.lang.SecurityManager.checkPermission(SecurityManager.java:734)
	at tests.api.java.security.DomainCombinerTest$1.checkPermission(DomainCombinerTest.java:82)
	at java.lang.SecurityManager.checkSecurityAccess(SecurityManager.java:421)
	at java.security.Security.getProperty(Security.java:360)
	at org.apache.harmony.luni.util.PriviAction.run(PriviAction.java:131)
	at java.security.AccessController.doPrivileged(AccessController.java:179)
	at java.lang.SecurityManager.checkPackageProperty(SecurityManager.java:331)
	at java.lang.SecurityManager.checkPackageAccess(SecurityManager.java:33)
	at com.ibm.oti.vm.URLSystemClassLoader.loadClass(URLSystemClassLoader.java:54)
	at java.lang.ClassLoader.loadClass(ClassLoader.java:594)
	at tests.api.java.security.DomainCombinerTest.test_combine$Ljava_security_ProtectionDomain$Ljava_security_ProtectionDomain(DomainCombinerTest.java:89)
	at java.lang.reflect.AccessibleObject.invokeV(AccessibleObject.java:25)


***********************************************************
Modifications since last successful build:	(4)
            
modified varlax  /harmony/enhanced/classlib/trunk/modules/luni/src/main/java/java/lang/SecurityManager.java
12/12/2006 13:43:28 Fixed HARMONY-2301 [luni] flawed SecurityManager.checkPackageAccess()
implRegression tests added.Tested on DRLVM
modified varlax  /harmony/enhanced/classlib/trunk/modules/luni/src/test/java/org/apache/harmony/luni/tests/java/lang/MutableSecurityManager.java
12/12/2006 13:43:28 Fixed HARMONY-2301 [luni] flawed SecurityManager.checkPackageAccess()
implRegression tests added.Tested on DRLVM
modified varlax  /harmony/enhanced/classlib/trunk/modules/luni/src/test/java/org/apache/harmony/luni/tests/java/lang/SecurityManagerTest.java
12/12/2006 13:43:28 Fixed HARMONY-2301 [luni] flawed SecurityManager.checkPackageAccess()
implRegression tests added.Tested on DRLVM
modified varlax  /harmony/enhanced/classlib/trunk/modules/luni/src/main/java/org/apache/harmony/luni/util/PriviAction.java
12/12/2006 13:43:28 Fixed HARMONY-2301 [luni] flawed SecurityManager.checkPackageAccess()
implRegression tests added.Tested on DRLVM

Mime
View raw message