harmony-commits mailing list archives

Site index · List index
Message view « Date » · « Thread »
Top « Date » · « Thread »
From nom...@intel.com
Subject [build-test alert] BUILD FAILED Windows XP SP2 msvc debug: classlib over drlvm
Date Mon, 11 Dec 2006 13:52:38 GMT
BUILD FAILED:
	Ant Error Message:
C:\cc.harmony\trunk\cc\projects\classlib\trunk\build.xml:167: The following error occurred
while executing this line: C:\cc.harmony\trunk\cc\projects\classlib\trunk\make\build-test.xml:133:
There were test failures.

Date of build:	12/11/2006 19:35:34
Time to build:	16 minutes 11 seconds
Last changed:	12/11/2006 19:27:10
Last log entry:	Makefiles are changed to use compiler options from the common place

***********************************************************
Errors/Warnings:(971)
            
Tests FAILED
Tests FAILED
Tests FAILED
Tests FAILED
Tests FAILED
Tests FAILED
Tests FAILED
Test org.apache.harmony.jndi.tests.javax.naming.spi.NamingManagerTest FAILED
Test org.apache.harmony.jndi.tests.javax.naming.spi.NamingManagerBuilderTest FAILED
Test org.apache.harmony.jndi.tests.javax.naming.spi.DirectoryManagerTest FAILED
Tests FAILED
Tests FAILED
Tests FAILED
Tests FAILED
Tests FAILED
Tests FAILED
Tests FAILED
Tests FAILED
Tests FAILED
Tests FAILED
Tests FAILED
Tests FAILED
Tests FAILED
Tests FAILED
Tests FAILED
Tests FAILED
Tests FAILED
Tests FAILED

***********************************************************
Unit Tests: (7200)
        
failure: test_Ctor_defaultRealm org.apache.harmony.auth.tests.javax.security.auth.kerberos.KerberosPrincipalTest
failure: test_defaultProvider_securityProperties org.apache.harmony.auth.tests.javax.security.auth.login.ConfigurationTest
Unit Test Error Details:	(2)
                
Test: test_Ctor_defaultRealmClass: org.apache.harmony.auth.tests.javax.security.auth.kerberos.KerberosPrincipalTestjunit.framework.AssertionFailedError:
Uncaught exception in main:
java.lang.ClassFormatError: junit/framework/Test : if class is interface, no flags except
ACC_ABSTRACT or ACC_PUBLIC can be set
	at java.lang.VMClassRegistry.defineClass(Native Method)
	at java.lang.ClassLoader.defineClass(Unknown Source)
	at java.security.SecureClassLoader.defineClass(SecureClassLoader.java:70)
	at java.net.URLClassLoader.findClassImpl(URLClassLoader.java:1137)
	at java.net.URLClassLoader$4.run(URLClassLoader.java:619)
	at java.net.URLClassLoader$4.run(URLClassLoader.java)
	at java.security.AccessController.doPrivilegedImpl(Unknown Source)
	at java.security.AccessController.doPrivileged(Unknown Source)
	at java.net.URLClassLoader.findClass(URLClassLoader.java:617)
	at java.lang.ClassLoader.loadClass(Unknown Source)
	at java.lang.ClassLoader$SystemClassLoader.loadClass(Unknown Source)
	at java.lang.ClassLoader.loadClass(Unknown Source)
	at java.lang.VMClassRegistry.defineClass(Native Method)
	at java.lang.ClassLoader.defineClass(Unknown Source)
	at java.security.SecureClassLoader.defineClass(SecureClassLoader.java:70)
	at java.net.URLClassLoader.findClassImpl(URLClassLoader.java:1137)
	at java.net.URLClassLoader$4.run(URLClassLoader.java:619)
	at java.net.URLClassLoader$4.run(URLClassLoader.java)
	at java.security.AccessController.doPrivilegedImpl(Unknown Source)
	at java.security.AccessController.doPrivileged(Unknown Source)
	at java.net.URLClassLoader.findClass(URLClassLoader.java:617)
	at java.lang.ClassLoader.loadClass(Unknown Source)
	at java.lang.ClassLoader$SystemClassLoader.loadClass(Unknown Source)
	at java.lang.ClassLoader.loadClass(Unknown Source)
	at java.lang.VMClassRegistry.defineClass(Native Method)
	at java.lang.ClassLoader.defineClass(Unknown Source)
	at java.security.SecureClassLoader.defineClass(SecureClassLoader.java:70)
	at java.net.URLClassLoader.findClassImpl(URLClassLoader.java:1137)
	at java.net.URLClassLoader$4.run(URLClassLoader.java:619)
	at java.net.URLClassLoader$4.run(URLClassLoader.java)
	at java.security.AccessController.doPrivilegedImpl(Unknown Source)
	at java.security.AccessController.doPrivileged(Unknown Source)
	at java.net.URLClassLoader.findClass(URLClassLoader.java:617)
	at java.lang.ClassLoader.loadClass(Unknown Source)
	at java.lang.ClassLoader$SystemClassLoader.loadClass(Unknown Source)
	at java.lang.ClassLoader.loadClass(Unknown Source)
ty.AccessController.doPrivileged(Unknown Source)
	at java.net.URLClassLoader.findClass(URLClassLoader.java:617)
	at java.lang.ClassLoader.loadClass(Unknown Source)
	at java.lang.ClassLoader$SystemClassLoader.loadClass(Unknown Source)
	at java.lang.ClassLoader.loadClass(Unknown Source)
	at java.lang.VMClassRegistry.defineClass(Native Method)
	at java.lang.ClassLoader.defineClass(Unknown Source)
	at java.security.SecureClassLoader.defineClass(SecureClassLoader.java:70)
	at java.net.URLClassLoader.findClassImpl(URLClassLoader.java:1137)
	at java.net.URLClassLoader$4.run(URLClassLoader.java:619)
	at java.net.URLClassLoader$4.run(URLClassLoader.java)
	at java.security.AccessController.doPrivilegedImpl(Unknown Source)
	at java.security.AccessController.doPrivileged(Unknown Source)
	at java.net.URLClassLoader.findClass(URLClassLoader.java:617)
	a
	at tests.support.Support_Exec.checkStderr(Support_Exec.java:57)
	at tests.support.Support_Exec.execJava(Support_Exec.java:47)
	at org.apache.harmony.auth.tests.javax.security.auth.kerberos.KerberosPrincipalTest.test_Ctor_defaultRealm(KerberosPrincipalTest.java:131)
	at java.lang.reflect.VMReflection.invokeMethod(Native Method)

Test: test_defaultProvider_securityPropertiesClass: org.apache.harmony.auth.tests.javax.security.auth.login.ConfigurationTestjunit.framework.AssertionFailedError:
Uncaught exception in main:
java.lang.ClassFormatError: junit/framework/Test : if class is interface, no flags except
ACC_ABSTRACT or ACC_PUBLIC can be set
	at java.lang.VMClassRegistry.defineClass(Native Method)
	at java.lang.ClassLoader.defineClass(Unknown Source)
	at java.security.SecureClassLoader.defineClass(SecureClassLoader.java:70)
	at java.net.URLClassLoader.findClassImpl(URLClassLoader.java:1137)
	at java.net.URLClassLoader$4.run(URLClassLoader.java:619)
	at java.net.URLClassLoader$4.run(URLClassLoader.java)
	at java.security.AccessController.doPrivilegedImpl(Unknown Source)
	at java.security.AccessController.doPrivileged(Unknown Source)
	at java.net.URLClassLoader.findClass(URLClassLoader.java:617)
	at java.lang.ClassLoader.loadClass(Unknown Source)
	at java.lang.ClassLoader$SystemClassLoader.loadClass(Unknown Source)
	at java.lang.ClassLoader.loadClass(Unknown Source)
	at java.lang.VMClassRegistry.defineClass(Native Method)
	at java.lang.ClassLoader.defineClass(Unknown Source)
	at java.security.SecureClassLoader.defineClass(SecureClassLoader.java:70)
	at java.net.URLClassLoader.findClassImpl(URLClassLoader.java:1137)
	at java.net.URLClassLoader$4.run(URLClassLoader.java:619)
	at java.net.URLClassLoader$4.run(URLClassLoader.java)
	at java.security.AccessControllerjava.security.SecureClassLoader.defineClass(SecureClassLoader.java:70)
	at java.net.URLClassLoader.findClassImpl(URLClassLoader.java:1137)
	at java.net.URLClassLoader$4.run(URLClassLoader.java:619)
	at java.net.URLClassLoader$4.run(URLClassLoader.java)
	at java.security.AccessController.doPrivilegedImpl(Unknown Source)
	at java.security.AccessController.doPrivileged(Unknown Source)
	at java.net.URLClassLoader.findClass(URLClassLoader.java:617)
	at java.lang.ClassLoader.loadClass(Unknown Source)
	at java.lang.ClassLoader$SystemClassLoader.loadClass(Unknown Source)
	at java.lang.ClassLoader.loadClass(Unknown Source)
	at java.lang.VMClassRegistry.defineClass(Native Method)
	at java.lang.ClassLoader.defineClass(Unknown Source)
	at java.security.SecureClassLoader.defineClass(.doPrivilegedImpl(Unknown Source)
	at java.security.AccessController.doPrivileged(Unknown Source)
	at java.net.URLClassLoader.findClass(URLClassLoader.java:617)
	at java.lang.ClassLoader.loadClass(Unknown Source)
	at java.lang.ClassLoader$SystemClassLoader.loadClass(Unknown Source)
	at java.lang.ClassLoader.loadClass(Unknown Source)
	at java.lang.VMClassRegistry.defineClass(Native Method)
	at java.lang.ClassLoader.defineClass(Unknown Source)
	at java.security.SecureClassLoader.defineClass(SecureClassLoader.java:70)
	at java.net.URLClassLoader.findClassImpl(URLClassLoader.java:1137)
	at java.net.URLClassLoader$4.run(URLClassLoader.java:619)
	at java.net.URLClassLoader$4.run(URLClassLoader.java)
	at java.security.AccessController.doPrivilegedImpl(Unknown Source)
	at java.security.AccessController.doPrivileged(Unknown Source)
	at java.net.URLClassLoader.findClass(URLClassLoader.java:617)
	at java.lang.ClassLoader.loadClass(Unknown Source)
	at java.lang.ClassLoader$SystemClassLoader.loadClass(Unknown Source)
	at java.lang.ClassLoader.loadClass(Unknown Source)
ty.AccessController.doPrivileged(Unknown Source)
	at java.net.URLClassLoader.findClass(URLClassLoader.java:617)
	at java.lang.ClassLoader.loadClass(Unknown Source)
	at java.lang.ClassLoader$SystemClassLoader.loadClass(Unknown Source)
	at java.lang.ClassLoader.loadClass(Unknown Source)
	at java.lang.VMClassRegistry.defineClass(Native Method)
	at java.lang.ClassLoader.defineClass(Unknown Source)
	at java.security.SecureClassLoader.defineClass(SecureClassLoader.java:70)
	at java.net.URLClassLoader.findClassImpl(URLClassLoader.java:1137)
	at java.net.URLClassLoader$4.run(URLClassLoader.java:619)
	at java.net.URLClassLoader$4.run(URLClassLoader.java)
	at java.security.AccessController.doPrivilegedImpl(Unknown Source)
	at java.security.AccessController.doPrivileged(Unknown Source)
	at java.net.URLClassLoader.findClass(URLClassLoader.java:617)
	at java.lang.ClassLoader.loadClass(Unknown Source)
	at java.lang.ClassLoader$SystemClassLoader.loadClass(Unknown Source)
	at 
	at tests.support.Support_Exec.checkStderr(Support_Exec.java:57)
	at tests.support.Support_Exec.execJava(Support_Exec.java:47)
	at org.apache.harmony.auth.tests.javax.security.auth.login.ConfigurationTest.test_defaultProvider_securityProperties(ConfigurationTest.java:269)
	at java.lang.reflect.VMReflection.invokeMethod(Native Method)


***********************************************************
Modifications since last successful build:	(19)
            
modified apetrenko  /harmony/enhanced/classlib/trunk/modules/awt/src/main/native/jpegdecoder/windows/makefile
12/11/2006 19:27:10 Makefiles are changed to use compiler options from the common place
modified apetrenko  /harmony/enhanced/classlib/trunk/modules/awt/src/main/native/gl/windows/makefile
12/11/2006 19:27:10 Makefiles are changed to use compiler options from the common place
modified apetrenko  /harmony/enhanced/classlib/trunk/depends/build/defines.mak 12/11/2006
19:25:39 Implementation of debug/release switch for Windows native build
add cc-drlvm log20061211192539Lbuild.10 12/11/2006 19:25:39drlvm
modified gshimansky  /harmony/enhanced/drlvm/trunk/vm/vmcore/src/jvmti/jvmti_method.cpp 12/11/2006
18:27:35 Applied HARMONY-2505 [drlvm] Class file parser improvementsAcceptance tests passed
on ubuntu6 x86, windows 2003 server and suse9 x86_64
modified gshimansky  /harmony/enhanced/drlvm/trunk/vm/vmcore/src/util/ia32/base/ini_iA32.cpp
12/11/2006 18:27:35 Applied HARMONY-2505 [drlvm] Class file parser improvementsAcceptance
tests passed on ubuntu6 x86, windows 2003 server and suse9 x86_64
modified gshimansky  /harmony/enhanced/drlvm/trunk/vm/vmcore/src/util/ia32/base/optimize_ia32.cpp
12/11/2006 18:27:35 Applied HARMONY-2505 [drlvm] Class file parser improvementsAcceptance
tests passed on ubuntu6 x86, windows 2003 server and suse9 x86_64
modified gshimansky  /harmony/enhanced/drlvm/trunk/vm/vmcore/src/exception/exceptions_jit.cpp
12/11/2006 18:27:35 Applied HARMONY-2505 [drlvm] Class file parser improvementsAcceptance
tests passed on ubuntu6 x86, windows 2003 server and suse9 x86_64
modified gshimansky  /harmony/enhanced/drlvm/trunk/vm/vmcore/include/Class.h 12/11/2006 18:27:35
Applied HARMONY-2505 [drlvm] Class file parser improvementsAcceptance tests passed on ubuntu6
x86, windows 2003 server and suse9 x86_64
modified gshimansky  /harmony/enhanced/drlvm/trunk/vm/interpreter/src/interpreter.cpp 12/11/2006
18:27:35 Applied HARMONY-2505 [drlvm] Class file parser improvementsAcceptance tests passed
on ubuntu6 x86, windows 2003 server and suse9 x86_64
modified gshimansky  /harmony/enhanced/drlvm/trunk/vm/vmcore/src/class_support/Class_File_Loader.cpp
12/11/2006 18:27:35 Applied HARMONY-2505 [drlvm] Class file parser improvementsAcceptance
tests passed on ubuntu6 x86, windows 2003 server and suse9 x86_64
modified gshimansky  /harmony/enhanced/drlvm/trunk/vm/vmcore/src/jit/jit_runtime_support.cpp
12/11/2006 18:27:35 Applied HARMONY-2505 [drlvm] Class file parser improvementsAcceptance
tests passed on ubuntu6 x86, windows 2003 server and suse9 x86_64
modified gshimansky  /harmony/enhanced/drlvm/trunk/vm/vmcore/src/util/ia32/base/compile_IA32.cpp
12/11/2006 18:27:35 Applied HARMONY-2505 [drlvm] Class file parser improvementsAcceptance
tests passed on ubuntu6 x86, windows 2003 server and suse9 x86_64
modified gshimansky  /harmony/enhanced/drlvm/trunk/vm/interpreter/src/interp_native_ia32.cpp
12/11/2006 18:27:35 Applied HARMONY-2505 [drlvm] Class file parser improvementsAcceptance
tests passed on ubuntu6 x86, windows 2003 server and suse9 x86_64
modified gshimansky  /harmony/enhanced/drlvm/trunk/vm/interpreter/src/interp_native_ipf.cpp
12/11/2006 18:27:35 Applied HARMONY-2505 [drlvm] Class file parser improvementsAcceptance
tests passed on ubuntu6 x86, windows 2003 server and suse9 x86_64
modified gshimansky  /harmony/enhanced/drlvm/trunk/vm/vmcore/include/class_member.h 12/11/2006
18:27:35 Applied HARMONY-2505 [drlvm] Class file parser improvementsAcceptance tests passed
on ubuntu6 x86, windows 2003 server and suse9 x86_64
modified gshimansky  /harmony/enhanced/drlvm/trunk/vm/interpreter/src/interp_native_em64t.cpp
12/11/2006 18:27:35 Applied HARMONY-2505 [drlvm] Class file parser improvementsAcceptance
tests passed on ubuntu6 x86, windows 2003 server and suse9 x86_64
modified gshimansky  /harmony/enhanced/drlvm/trunk/vm/vmcore/src/class_support/Prepare.cpp
12/11/2006 18:27:35 Applied HARMONY-2505 [drlvm] Class file parser improvementsAcceptance
tests passed on ubuntu6 x86, windows 2003 server and suse9 x86_64
modified gshimansky  /harmony/enhanced/drlvm/trunk/vm/vmcore/src/class_support/method.cpp
12/11/2006 18:27:35 Applied HARMONY-2505 [drlvm] Class file parser improvementsAcceptance
tests passed on ubuntu6 x86, windows 2003 server and suse9 x86_64

Mime
View raw message