harmony-commits mailing list archives

Site index · List index
Message view « Date » · « Thread »
Top « Date » · « Thread »
From nom...@intel.com
Subject [build-test alert] BUILD FAILED linux SUSE 9 gcc debug: classlib over drlvm
Date Wed, 06 Dec 2006 12:16:04 GMT
BUILD FAILED:
	Ant Error Message:
/export/viv/trunk/cc/projects/classlib/trunk/build.xml:167: The following error occurred while
executing this line: /export/viv/trunk/cc/projects/classlib/trunk/make/build-test.xml:132:
There were test errors.

Date of build:	12/06/2006 16:34:17
Time to build:	97 minutes 59 seconds
Last changed:	12/06/2006 16:27:23
Last log entry:	Fix JUnit-style for several test cases

***********************************************************
Errors/Warnings:	(3086)
            
Test javax.swing.Timer_MultithreadedTest FAILED

***********************************************************
Unit Tests: (19190)
        
error: testUnregisterComponent javax.swing.ToolTipManagerRTest
failure: testFireActionPerformed javax.swing.Timer_MultithreadedTest
failure: testSetRepeats javax.swing.Timer_MultithreadedTest
failure: testSetInitialDelay javax.swing.Timer_MultithreadedTest
failure: testSetDelay javax.swing.Timer_MultithreadedTest
failure: testIsRunning javax.swing.Timer_MultithreadedTest
failure: testStop javax.swing.Timer_MultithreadedTest
failure: testStart javax.swing.Timer_MultithreadedTest
failure: testRestart javax.swing.Timer_MultithreadedTest
failure: testSetLogTimers javax.swing.Timer_MultithreadedTest
Unit Test Error Details:	(10)
                
Test: testUnregisterComponentClass: javax.swing.ToolTipManagerRTestjava.lang.ExceptionInInitializerError
	at javax.swing.plaf.basic.BasicLookAndFeel.getBasicSystemColors(BasicLookAndFeel.java:933)
	at javax.swing.plaf.basic.BasicLookAndFeel.initSystemColorDefaults(BasicLookAndFeel.java)
	at javax.swing.plaf.metal.MetalLookAndFeel.initSystemColorDefaults(MetalLookAndFeel.java)
	at javax.swing.plaf.basic.BasicLookAndFeel.getDefaults(BasicLookAndFeel.java:856)
	at javax.swing.plaf.metal.MetalLookAndFeel.getDefaults(MetalLookAndFeel.java:781)
	at javax.swing.UIManager.setLookAndFeel(UIManager.java:253)
	at javax.swing.UIManager.setLookAndFeel(UIManager.java:238)
	at javax.swing.UIManager.setDefaultLookAndFeel(UIManager.java:357)
	at javax.swing.UIManager.initialize(UIManager.java:348)
	at javax.swing.UIManager.<clinit>(UIManager.java:114)
	at javax.swing.BasicSwingTestCase.setUp(BasicSwingTestCase.java:74)
	at javax.swing.BasicSwingTestCase.runBareSuper(BasicSwingTestCase.java)
	at javax.swing.BasicSwingTestCase.runBareImpl(BasicSwingTestCase.java)
	at javax.swing.BasicSwingTestCase$1.run(BasicSwingTestCase.java)
	at java.lang.Thread.run(Unknown Source)
Caused by: java.lang.NullPointerException
	at java.awt.Toolkit.getDefaultToolkit(Toolkit.java:470)
	at java.awt.SystemColor.<init>(SystemColor.java:157)
	at java.awt.SystemColor.<clinit>(SystemColor.java:91)
	at javax.swing.plaf.basic.BasicLookAndFeel.getBasicSystemColors(BasicLookAndFeel.java:933)
	... 15 more

Test: testFireActionPerformedClass: javax.swing.Timer_MultithreadedTestjunit.framework.AssertionFailedError:
[1] ActionListener's ActionPerformed invoked 
	at javax.swing.Timer_MultithreadedTest.testFireActionPerformed(Timer_MultithreadedTest.java:152)
	at java.lang.reflect.VMReflection.invokeMethod(Native Method)

Test: testSetRepeatsClass: javax.swing.Timer_MultithreadedTestjunit.framework.AssertionFailedError:
ActionListener's ActionPerformed invoked 
	at javax.swing.Timer_MultithreadedTest.testSetRepeats(Timer_MultithreadedTest.java:172)
	at java.lang.reflect.VMReflection.invokeMethod(Native Method)

Test: testSetInitialDelayClass: javax.swing.Timer_MultithreadedTestjunit.framework.AssertionFailedError:
ActionListener's ActionPerformed invoked 
	at javax.swing.Timer_MultithreadedTest.testSetInitialDelay(Timer_MultithreadedTest.java:231)
	at java.lang.reflect.VMReflection.invokeMethod(Native Method)

Test: testSetDelayClass: javax.swing.Timer_MultithreadedTestjunit.framework.AssertionFailedError:
ActionListener's ActionPerformed invoked 
	at javax.swing.Timer_MultithreadedTest.testSetDelay(Timer_MultithreadedTest.java:263)
	at java.lang.reflect.VMReflection.invokeMethod(Native Method)

Test: testIsRunningClass: javax.swing.Timer_MultithreadedTestjunit.framework.AssertionFailedError:
timer is running 
	at javax.swing.Timer_MultithreadedTest.testIsRunning(Timer_MultithreadedTest.java:285)
	at java.lang.reflect.VMReflection.invokeMethod(Native Method)

Test: testStopClass: javax.swing.Timer_MultithreadedTestjunit.framework.AssertionFailedError:
ActionListener's ActionPerformed invoked 
	at javax.swing.Timer_MultithreadedTest.testStop(Timer_MultithreadedTest.java:295)
	at java.lang.reflect.VMReflection.invokeMethod(Native Method)

Test: testStartClass: javax.swing.Timer_MultithreadedTestjunit.framework.AssertionFailedError:
ActionListener's ActionPerformed invoked 
	at javax.swing.Timer_MultithreadedTest.testStart(Timer_MultithreadedTest.java:309)
	at java.lang.reflect.VMReflection.invokeMethod(Native Method)

Test: testRestartClass: javax.swing.Timer_MultithreadedTestjunit.framework.AssertionFailedError:
ActionListener's ActionPerformed invoked 
	at javax.swing.Timer_MultithreadedTest.testRestart(Timer_MultithreadedTest.java:362)
	at java.lang.reflect.VMReflection.invokeMethod(Native Method)

Test: testSetLogTimersClass: javax.swing.Timer_MultithreadedTestjunit.framework.AssertionFailedError:
[1] action performed 
	at javax.swing.Timer_MultithreadedTest.testSetLogTimers(Timer_MultithreadedTest.java:397)
	at java.lang.reflect.VMReflection.invokeMethod(Native Method)


***********************************************************
Modifications since last successful build:	(7)
            
modified smishura  /harmony/enhanced/classlib/trunk/modules/security/src/test/impl/java.injected/java/security/cert/X509CertSelectorTest.java
12/06/2006 16:27:23 Fix JUnit-style for several test cases
modified apetrenko  /harmony/enhanced/drlvm/trunk/build/make/components/vm/gc_gen.xml 12/06/2006
16:05:54 Patch for HARMONY-2486 "[drlvm][build] gc_gen module must depend on vm.kernel_classes
module"
add cc-drlvm log20061206154400Lbuild.19 12/06/2006 15:44:00drlvm
modified apetrenko  /harmony/enhanced/classlib/trunk/modules/awt/src/main/native/jpegdecoder/shared/JpegDecoder.c
12/06/2006 14:51:44 svn commit r482652 is reverted
modified apetrenko  /harmony/enhanced/classlib/trunk/modules/awt/src/main/native/jpegdecoder/shared/JPEGDecoder.h
12/06/2006 14:51:44 svn commit r482652 is reverted
modified apetrenko  /harmony/enhanced/classlib/trunk/modules/awt/src/main/native/lcmm/shared/cmmio.c
12/06/2006 14:51:44 svn commit r482652 is reverted
modified apetrenko  /harmony/enhanced/classlib/trunk/modules/awt/src/main/native/lcmm/shared/cmmapi.h
12/06/2006 14:51:44 svn commit r482652 is reverted

Mime
View raw message