harmony-commits mailing list archives

Site index · List index
Message view « Date » · « Thread »
Top « Date » · « Thread »
From nom...@hursley.ibm.com
Subject [continuum] BUILD FAILURE: Classlib/linux.ia32 Build/Test
Date Tue, 05 Dec 2006 09:59:26 GMT
Online report : http://people.apache.org/~hindessm/continuum/classlib/linux.ia32/2006/12/05/20061205-095926.failure.log.gz
Build statistics:
  State: Failed
  Previous State: Failed
  Started at: Tue, 5 Dec 2006 09:00:56 +0000
  Finished at: Tue, 5 Dec 2006 09:59:24 +0000
  Total time: 58m 27s
  Build Trigger: Schedule
  Exit code: 1
  Building machine hostname: hy2
  Operating system : Linux(unknown)
  Java version : 1.5.0_06(Sun Microsystems Inc.)

Changes
                            classlib/depends/build/defines.mk
            classlib/depends/build/platform/linux.x86_64.mk
            classlib/depends/build/platform/linux.ia64.mk
            classlib/depends/build/platform/linux.x86.mk
            classlib/make/build-native.xml
            classlib/make/properties.xml
        
****************************************************************************
Output:
****************************************************************************
Buildfile: build.xml

build:
   [delete] Deleting directory /home/hybld/continuum-working-directory/6/classlib/deploy
     [echo] Classlib revision is 482552
     [echo] Post process: true
     [echo] JAPI: true
     [echo] Building with reference jdk/javac
     [exec] Buildfile: build.xml

     [exec] -init-hdk-for-clean:
     [exec]     [mkdir] Created dir: /home/hybld/continuum-working-directory/6/classlib/deploy/build/ant
     [exec]      [copy] Copying 1 file to /home/hybld/continuum-working-directory/6/classlib/deploy/build/ant

     [exec] clean-java:

     [exec] -modules-clean-bin:

     [exec] clean:
     [exec]    [delete] Deleting 30 files from /home/hybld/continuum-working-directory/6/classlib/build/classes
     [exec]    [delete] Deleting 12 files from /home/hybld/continuum-working-directory/6/classlib/modules/accessibility/bin/test

     [exec] clean:
     [exec]    [delete] Deleting 13 files from /home/hybld/continuum-working-directory/6/classlib/build/classes

     [exec] clean:
     [exec]    [delete] Deleting 35 files from /home/hybld/continuum-working-directory/6/classlib/build/classes
     [exec]    [delete] Deleting 1 files from /home/hybld/continuum-working-directory/6/classlib/modules/applet/bin/test

     [exec] clean:
     [exec]    [delete] Deleting 79 files from /home/hybld/continuum-working-directory/6/classlib/build/classes
     [exec]    [delete] Deleting 47 files from /home/hybld/continuum-working-directory/6/classlib/modules/archive/bin/test

     [exec] clean-native-includes:
     [exec]    [delete] /home/hybld/continuum-working-directory/6/classlib/deploy/include
not found.

     [exec] clean:
     [exec]    [delete] Deleting 112 files from /home/hybld/continuum-working-directory/6/classlib/build/classes
     [exec]    [delete] Deleting 224 files from /home/hybld/continuum-working-directory/6/classlib/modules/auth/bin/test

     [exec] clean:
     [exec]    [delete] Deleting 901 files from /home/hybld/continuum-working-directory/6/classlib/build/classes
     [exec]    [delete] Deleting 582 files from /home/hybld/continuum-working-directory/6/classlib/modules/awt/bin/test

     [exec] clean:
     [exec]    [delete] Deleting 107 files from /home/hybld/continuum-working-directory/6/classlib/build/classes
     [exec]    [delete] Deleting 238 files from /home/hybld/continuum-working-directory/6/classlib/modules/beans/bin/test

     [exec] clean:
     [exec]    [delete] Deleting 125 files from /home/hybld/continuum-working-directory/6/classlib/build/classes
     [exec]    [delete] /home/hybld/continuum-working-directory/6/classlib/modules/concurrent/bin/test
not found.

     [exec] clean:
     [exec]    [delete] Deleting 49 files from /home/hybld/continuum-working-directory/6/classlib/build/classes
     [exec]    [delete] Deleting 91 files from /home/hybld/continuum-working-directory/6/classlib/modules/crypto/bin/test

     [exec] clean:
     [exec]    [delete] Deleting 87 files from /home/hybld/continuum-working-directory/6/classlib/build/classes

     [exec] clean:
     [exec]    [delete] Deleting 9 files from /home/hybld/continuum-working-directory/6/classlib/build/classes
     [exec]    [delete] Deleting 20 files from /home/hybld/continuum-working-directory/6/classlib/modules/instrument/bin/test

     [exec] clean:
     [exec]    [delete] Deleting 154 files from /home/hybld/continuum-working-directory/6/classlib/build/classes
     [exec]    [delete] Deleting 163 files from /home/hybld/continuum-working-directory/6/classlib/modules/jndi/bin/test

     [exec] clean:
     [exec]    [delete] Deleting 15 files from /home/hybld/continuum-working-directory/6/classlib/build/classes
     [exec]    [delete] Deleting 2 files from /home/hybld/continuum-working-directory/6/classlib/modules/lang-management/bin/test

     [exec] clean:
     [exec]    [delete] Deleting 34 files from /home/hybld/continuum-working-directory/6/classlib/build/classes
     [exec]    [delete] Deleting 99 files from /home/hybld/continuum-working-directory/6/classlib/modules/logging/bin/test

     [exec] clean:
     [exec]    [delete] Deleting 965 files from /home/hybld/continuum-working-directory/6/classlib/build/classes
     [exec]    [delete] Deleting 893 files from /home/hybld/continuum-working-directory/6/classlib/modules/luni/bin/test

     [exec] clean-native-includes:
     [exec]    [delete] /home/hybld/continuum-working-directory/6/classlib/deploy/include
not found.
     [exec]    [delete] /home/hybld/continuum-working-directory/6/classlib/deploy/jdk/include
not found.

     [exec] clean:
     [exec]    [delete] Deleting 29 files from /home/hybld/continuum-working-directory/6/classlib/build/classes

     [exec] clean:
     [exec]    [delete] Deleting 14 files from /home/hybld/continuum-working-directory/6/classlib/build/classes
     [exec]    [delete] Deleting 25 files from /home/hybld/continuum-working-directory/6/classlib/modules/math/bin/test

     [exec] clean:
     [exec]    [delete] Deleting 14 files from /home/hybld/continuum-working-directory/6/classlib/build/classes

     [exec] clean:
     [exec]    [delete] Deleting 146 files from /home/hybld/continuum-working-directory/6/classlib/build/classes
     [exec]    [delete] Deleted 5 directories from /home/hybld/continuum-working-directory/6/classlib/build/classes
     [exec]    [delete] Deleting 156 files from /home/hybld/continuum-working-directory/6/classlib/modules/nio/bin/test
     [exec]    [delete] Deleted 19 directories from /home/hybld/continuum-working-directory/6/classlib/modules/nio/bin/test

     [exec] clean:
     [exec]    [delete] Deleting 20 files from /home/hybld/continuum-working-directory/6/classlib/build/classes
     [exec]    [delete] Deleting 77 files from /home/hybld/continuum-working-directory/6/classlib/modules/nio_char/bin/test

     [exec] clean:

     [exec] clean-native-includes:
     [exec]    [delete] /home/hybld/continuum-working-directory/6/classlib/deploy/include
not found.

     [exec] clean:
     [exec]    [delete] Deleting 32 files from /home/hybld/continuum-working-directory/6/classlib/build/classes
     [exec]    [delete] Deleting 34 files from /home/hybld/continuum-working-directory/6/classlib/modules/prefs/bin/test

     [exec] clean:
     [exec]    [delete] Deleting 205 files from /home/hybld/continuum-working-directory/6/classlib/build/classes
     [exec]    [delete] Deleting 60 files from /home/hybld/continuum-working-directory/6/classlib/modules/print/bin/test

     [exec] clean:
     [exec]    [delete] Deleting 156 files from /home/hybld/continuum-working-directory/6/classlib/build/classes
     [exec]    [delete] Deleting 13 files from /home/hybld/continuum-working-directory/6/classlib/modules/regex/bin/test

     [exec] clean:
     [exec]    [delete] Deleting 230 files from /home/hybld/continuum-working-directory/6/classlib/build/classes
     [exec]    [delete] Deleting 49 files from /home/hybld/continuum-working-directory/6/classlib/modules/rmi/bin/test

     [exec] clean:
     [exec]    [delete] Deleting 427 files from /home/hybld/continuum-working-directory/6/classlib/build/classes
     [exec]    [delete] Deleting 605 files from /home/hybld/continuum-working-directory/6/classlib/modules/security/bin/test

     [exec] clean:
     [exec]    [delete] Deleting 2 files from /home/hybld/continuum-working-directory/6/classlib/build/classes

     [exec] clean:
     [exec]    [delete] Deleting 72 files from /home/hybld/continuum-working-directory/6/classlib/build/classes
     [exec]    [delete] Deleting 53 files from /home/hybld/continuum-working-directory/6/classlib/modules/sound/bin/test

     [exec] clean:
     [exec]    [delete] Deleting 73 files from /home/hybld/continuum-working-directory/6/classlib/build/classes
     [exec]    [delete] Deleting 52 files from /home/hybld/continuum-working-directory/6/classlib/modules/sql/bin/test

     [exec] clean:
     [exec]    [delete] Deleting 5 files from /home/hybld/continuum-working-directory/6/classlib/build/classes

     [exec] clean:
     [exec]    [delete] Deleting 1591 files from /home/hybld/continuum-working-directory/6/classlib/build/classes
     [exec]    [delete] Deleting 1502 files from /home/hybld/continuum-working-directory/6/classlib/modules/swing/bin/test

     [exec] clean:
     [exec]    [delete] Deleting 40 files from /home/hybld/continuum-working-directory/6/classlib/build/classes
     [exec]    [delete] Deleting 32 files from /home/hybld/continuum-working-directory/6/classlib/modules/text/bin/test

     [exec] clean:
     [exec]    [delete] Deleting 33 files from /home/hybld/continuum-working-directory/6/classlib/build/classes
     [exec]    [delete] Deleting 4 files from /home/hybld/continuum-working-directory/6/classlib/modules/tools/bin/test

     [exec] clean:
     [exec]    [delete] Deleting 123 files from /home/hybld/continuum-working-directory/6/classlib/build/classes
     [exec]    [delete] Deleting 54 files from /home/hybld/continuum-working-directory/6/classlib/modules/x-net/bin/test

     [exec] -clean-bin-catch-all-test:

     [exec] -clean-bin-catch-all:
     [exec]    [delete] Deleted 306 directories from /home/hybld/continuum-working-directory/6/classlib/build/classes

     [exec] -clean-bin:

     [exec] -clean-layout:
     [exec]    [delete] /home/hybld/continuum-working-directory/6/classlib/deploy/jdk not
found.

...

     [exec]     [junit] Tests run: 2, Failures: 0, Errors: 0, Time elapsed: 0.234 sec
     [exec]     [junit] Tests run: 5, Failures: 0, Errors: 0, Time elapsed: 0.072 sec
     [exec]     [junit] Tests run: 4, Failures: 0, Errors: 0, Time elapsed: 0.012 sec
     [exec]     [junit] Tests run: 3, Failures: 2, Errors: 0, Time elapsed: 65.583 sec
     [exec]     [junit] TEST java.awt.KeyboardFocusManagerRTest FAILED
     [exec]     [junit] Tests run: 7, Failures: 0, Errors: 0, Time elapsed: 0.01 sec
     [exec]     [junit] Tests run: 1, Failures: 0, Errors: 0, Time elapsed: 0.007 sec
     [exec]     [junit] Tests run: 4, Failures: 0, Errors: 0, Time elapsed: 0.017 sec
     [exec]     [junit] Tests run: 4, Failures: 0, Errors: 0, Time elapsed: 0.009 sec
     [exec]     [junit] Tests run: 1, Failures: 0, Errors: 0, Time elapsed: 0.023 sec

...

     [exec]     [junit] Tests run: 3, Failures: 0, Errors: 0, Time elapsed: 0.003 sec
     [exec]     [junit] Tests run: 1, Failures: 0, Errors: 0, Time elapsed: 0.105 sec
     [exec]     [junit] Tests run: 2, Failures: 0, Errors: 0, Time elapsed: 0.005 sec
     [exec]     [junit] Tests run: 1, Failures: 0, Errors: 0, Time elapsed: 0.003 sec
     [exec]     [junit] Tests FAILED

     [exec] touch-failures-file:

     [exec] touch-errors-file:


...

     [exec]     [junit] Tests run: 16, Failures: 0, Errors: 0, Time elapsed: 0.031 sec
     [exec]     [junit] Tests run: 15, Failures: 0, Errors: 0, Time elapsed: 0.047 sec
     [exec]     [junit] Tests run: 25, Failures: 0, Errors: 0, Time elapsed: 0.44 sec
     [exec]     [junit] Tests run: 17, Failures: 0, Errors: 0, Time elapsed: 0.042 sec
     [exec]     [junit] Finish connection failed, probably due to reset by peer error.
     [exec]     [junit] Finish connection failed, probably due to reset by peer error.
     [exec]     [junit] Connection refused
     [exec]     [junit] Tests run: 81, Failures: 0, Errors: 0, Time elapsed: 0.105 sec
     [exec]     [junit] Tests run: 14, Failures: 0, Errors: 0, Time elapsed: 0.033 sec
     [exec]     [junit] Tests run: 2, Failures: 0, Errors: 0, Time elapsed: 0.011 sec
     [exec]     [junit] Tests run: 2, Failures: 0, Errors: 0, Time elapsed: 0.011 sec

...

     [exec] gen-report:

     [exec] check-test-result:

     [exec] BUILD FAILED
     [exec] /home/hybld/continuum-working-directory/6/classlib/build.xml:167: The following
error occurred while executing this line:
     [exec] /home/hybld/continuum-working-directory/6/classlib/make/build-test.xml:133: There
were test failures.

     [exec] Total time: 44 minutes 46 seconds
     [exec] Result: 1
     [echo] Tests.failed is set to true

check-class-load-lists:
     [exec] Checking for class load lists in classlists/app
     [exec] Placing reports in classlib/build/classload
     [exec] Comparing jre in classlib/deploy/jdk/jre

...

     [exec] Processing package java.lang.management,:=========================================================================+++++++++++++++
     [exec] Processing package java.lang.ref,:=========================================================================+++++
     [exec] Processing package java.lang.reflect,:=========================================================================+++++++++++++++++++++
     [exec] Processing class ,java:
     [exec] Failed to Japize java: java.lang.RuntimeException: NoClassDefFoundError: java
     [exec] java.lang.RuntimeException: NoClassDefFoundError: java
     [exec] 	at net.wuffies.japi.ClassFile.forName(ClassFile.java:163)
     [exec] 	at net.wuffies.japi.Japize.getClassWrapper(Japize.java:1425)
     [exec] 	at net.wuffies.japi.Japize.japizeClass(Japize.java:748)
     [exec] 	at net.wuffies.japi.Japize.processClass(Japize.java:516)

...

     [exec] 	at net.wuffies.japi.Japize.doJapize(Japize.java:443)
     [exec] 	at net.wuffies.japi.Japize.main(Japize.java:316)

     [exec] Processing class ,javax:
     [exec] Failed to Japize javax: java.lang.RuntimeException: NoClassDefFoundError: javax
     [exec] java.lang.RuntimeException: NoClassDefFoundError: javax
     [exec] 	at net.wuffies.japi.ClassFile.forName(ClassFile.java:163)
     [exec] 	at net.wuffies.japi.Japize.getClassWrapper(Japize.java:1425)
     [exec] 	at net.wuffies.japi.Japize.japizeClass(Japize.java:748)
     [exec] 	at net.wuffies.japi.Japize.processClass(Japize.java:516)

...

     [exec] 	at net.wuffies.japi.Japize.doJapize(Japize.java:443)
     [exec] 	at net.wuffies.japi.Japize.main(Japize.java:316)

     [exec] Processing class ,org:
     [exec] Failed to Japize org: java.lang.RuntimeException: NoClassDefFoundError: org
     [exec] java.lang.RuntimeException: NoClassDefFoundError: org
     [exec] 	at net.wuffies.japi.ClassFile.forName(ClassFile.java:163)
     [exec] 	at net.wuffies.japi.Japize.getClassWrapper(Japize.java:1425)
     [exec] 	at net.wuffies.japi.Japize.japizeClass(Japize.java:748)
     [exec] 	at net.wuffies.japi.Japize.processClass(Japize.java:516)

...

update-index:

test-result:

BUILD FAILED
/home/hybld/continuum-working-directory/6/build.xml:192: There were test failures.

Total time: 58 minutes 26 seconds

****************************************************************************

...

Mime
View raw message