harmony-commits mailing list archives

Site index · List index
Message view « Date » · « Thread »
Top « Date » · « Thread »
From nom...@hursley.ibm.com
Subject [continuum] BUILD FAILURE: Classlib/linux.ia32 Build/Test
Date Mon, 04 Dec 2006 22:03:17 GMT
Online report : http://people.apache.org/~hindessm/continuum/classlib/linux.ia32/2006/12/04/20061204-220317.failure.log.gz
Build statistics:
  State: Failed
  Previous State: Ok
  Started at: Mon, 4 Dec 2006 22:01:16 +0000
  Finished at: Mon, 4 Dec 2006 22:03:16 +0000
  Total time: 1m 59s
  Build Trigger: Schedule
  Exit code: 1
  Building machine hostname: hy2
  Operating system : Linux(unknown)
  Java version : 1.5.0_06(Sun Microsystems Inc.)

Changes
                            classlib/modules/swing/build.xml
            classlib/modules/awt/src/main/java/unix/org/apache/harmony/awt/gl/linux/GLXGraphicsConfiguration.java
            classlib/modules/awt/src/main/java/unix/org/apache/harmony/awt/gl/linux/XGraphicsDevice.java
            classlib/modules/awt/src/main/java/unix/org/apache/harmony/awt/nativebridge/linux/GLX.java
            classlib/modules/awt/src/main/java/common/org/apache/harmony/awt/gl/opengl/OGLContextManager.java
            classlib/modules/awt/src/main/java/common/org/apache/harmony/awt/gl/opengl/OGLVolatileImage.java
            classlib/modules/awt/src/main/java/common/org/apache/harmony/awt/gl/opengl/OGLGraphics2D.java
            classlib/modules/awt/src/main/java/windows/org/apache/harmony/awt/gl/windows/WGLGraphicsConfiguration.java
            classlib/modules/awt/src/main/java/windows/org/apache/harmony/awt/gl/windows/WinGraphics2DFactory.java
            classlib/modules/awt/src/main/java/windows/org/apache/harmony/awt/gl/windows/WinGraphicsDevice.java
            classlib/modules/awt/src/main/java/windows/org/apache/harmony/awt/nativebridge/windows/WGL.java
            classlib/modules/awt/src/main/java/windows/org/apache/harmony/awt/nativebridge/windows/WGLDefs.java
            classlib/modules/awt/src/main/java/windows/org/apache/harmony/awt/wtk/windows/WindowProcHandler.java
            classlib/modules/awt/src/main/native/gl/unix/libgl.exp
            classlib/modules/awt/src/main/native/oglwrapper/unix/liboglwrapper.exp
            classlib/modules/awt/src/main/native/oglwrapper/unix/makefile
            classlib/modules/awt/src/main/native/oglwrapper/shared/org_apache_harmony_awt_gl_opengl_GL.cpp
            classlib/modules/awt/src/main/native/oglwrapper/shared/nativelib_common.h
            classlib/modules/awt/src/main/native/oglwrapper/shared/org_apache_harmony_awt_gl_opengl_GL.h
            classlib/modules/awt/src/main/native/oglwrapper/windows/oglwrapper.def
            classlib/modules/awt/src/main/native/oglwrapper/windows/oglwrapper.rc
            classlib/modules/awt/src/main/native/oglwrapper/windows/oglwrapper.RES
            classlib/modules/awt/src/main/native/oglwrapper/windows/makefile
            classlib/modules/awt/src/main/native/win32wrapper/windows/org_apache_harmony_awt_nativebridge_windows_WGL.cpp
            classlib/modules/awt/src/main/native/win32wrapper/windows/org_apache_harmony_awt_nativebridge_windows_WGL.h
            classlib/modules/awt/src/main/native/win32wrapper/windows/nativelib_common.cpp
            classlib/modules/awt/src/main/native/win32wrapper/windows/nativelib_common.h
            classlib/modules/awt/src/main/native/win32wrapper/windows/makefile
            classlib/modules/awt/build.xml
        
****************************************************************************
Output:
****************************************************************************
Buildfile: build.xml

build:
   [delete] Deleting directory /home/hybld/continuum-working-directory/6/classlib/deploy
     [echo] Classlib revision is 482382
     [echo] Post process: true
     [echo] JAPI: true
     [echo] Building with reference jdk/javac
     [exec] Buildfile: build.xml

     [exec] -init-hdk-for-clean:
     [exec]     [mkdir] Created dir: /home/hybld/continuum-working-directory/6/classlib/deploy/build/ant
     [exec]      [copy] Copying 1 file to /home/hybld/continuum-working-directory/6/classlib/deploy/build/ant

     [exec] clean-java:

     [exec] -modules-clean-bin:

     [exec] clean:
     [exec]    [delete] Deleting 30 files from /home/hybld/continuum-working-directory/6/classlib/build/classes
     [exec]    [delete] Deleting 12 files from /home/hybld/continuum-working-directory/6/classlib/modules/accessibility/bin/test

     [exec] clean:
     [exec]    [delete] Deleting 13 files from /home/hybld/continuum-working-directory/6/classlib/build/classes

     [exec] clean:
     [exec]    [delete] Deleting 35 files from /home/hybld/continuum-working-directory/6/classlib/build/classes
     [exec]    [delete] Deleting 1 files from /home/hybld/continuum-working-directory/6/classlib/modules/applet/bin/test

     [exec] clean:
     [exec]    [delete] Deleting 79 files from /home/hybld/continuum-working-directory/6/classlib/build/classes
     [exec]    [delete] Deleting 47 files from /home/hybld/continuum-working-directory/6/classlib/modules/archive/bin/test

     [exec] clean-native-includes:
     [exec]    [delete] /home/hybld/continuum-working-directory/6/classlib/deploy/include
not found.

     [exec] clean:
     [exec]    [delete] Deleting 112 files from /home/hybld/continuum-working-directory/6/classlib/build/classes
     [exec]    [delete] Deleting 224 files from /home/hybld/continuum-working-directory/6/classlib/modules/auth/bin/test

     [exec] clean:
     [exec]    [delete] Deleting 898 files from /home/hybld/continuum-working-directory/6/classlib/build/classes
     [exec]    [delete] Deleting 582 files from /home/hybld/continuum-working-directory/6/classlib/modules/awt/bin/test

     [exec] clean:
     [exec]    [delete] Deleting 107 files from /home/hybld/continuum-working-directory/6/classlib/build/classes
     [exec]    [delete] Deleting 238 files from /home/hybld/continuum-working-directory/6/classlib/modules/beans/bin/test

     [exec] clean:
     [exec]    [delete] Deleting 125 files from /home/hybld/continuum-working-directory/6/classlib/build/classes
     [exec]    [delete] /home/hybld/continuum-working-directory/6/classlib/modules/concurrent/bin/test
not found.

     [exec] clean:
     [exec]    [delete] Deleting 49 files from /home/hybld/continuum-working-directory/6/classlib/build/classes
     [exec]    [delete] Deleting 91 files from /home/hybld/continuum-working-directory/6/classlib/modules/crypto/bin/test

     [exec] clean:
     [exec]    [delete] Deleting 87 files from /home/hybld/continuum-working-directory/6/classlib/build/classes

     [exec] clean:
     [exec]    [delete] Deleting 9 files from /home/hybld/continuum-working-directory/6/classlib/build/classes
     [exec]    [delete] Deleting 20 files from /home/hybld/continuum-working-directory/6/classlib/modules/instrument/bin/test

     [exec] clean:
     [exec]    [delete] Deleting 154 files from /home/hybld/continuum-working-directory/6/classlib/build/classes
     [exec]    [delete] Deleting 163 files from /home/hybld/continuum-working-directory/6/classlib/modules/jndi/bin/test

     [exec] clean:
     [exec]    [delete] Deleting 15 files from /home/hybld/continuum-working-directory/6/classlib/build/classes
     [exec]    [delete] Deleting 2 files from /home/hybld/continuum-working-directory/6/classlib/modules/lang-management/bin/test

     [exec] clean:
     [exec]    [delete] Deleting 34 files from /home/hybld/continuum-working-directory/6/classlib/build/classes
     [exec]    [delete] Deleting 99 files from /home/hybld/continuum-working-directory/6/classlib/modules/logging/bin/test

     [exec] clean:
     [exec]    [delete] Deleting 965 files from /home/hybld/continuum-working-directory/6/classlib/build/classes
     [exec]    [delete] Deleting 893 files from /home/hybld/continuum-working-directory/6/classlib/modules/luni/bin/test

     [exec] clean-native-includes:
     [exec]    [delete] /home/hybld/continuum-working-directory/6/classlib/deploy/include
not found.
     [exec]    [delete] /home/hybld/continuum-working-directory/6/classlib/deploy/jdk/include
not found.

     [exec] clean:
     [exec]    [delete] Deleting 29 files from /home/hybld/continuum-working-directory/6/classlib/build/classes

     [exec] clean:
     [exec]    [delete] Deleting 14 files from /home/hybld/continuum-working-directory/6/classlib/build/classes
     [exec]    [delete] Deleting 25 files from /home/hybld/continuum-working-directory/6/classlib/modules/math/bin/test

     [exec] clean:
     [exec]    [delete] Deleting 14 files from /home/hybld/continuum-working-directory/6/classlib/build/classes

     [exec] clean:
     [exec]    [delete] Deleting 146 files from /home/hybld/continuum-working-directory/6/classlib/build/classes
     [exec]    [delete] Deleted 5 directories from /home/hybld/continuum-working-directory/6/classlib/build/classes
     [exec]    [delete] Deleting 156 files from /home/hybld/continuum-working-directory/6/classlib/modules/nio/bin/test
     [exec]    [delete] Deleted 19 directories from /home/hybld/continuum-working-directory/6/classlib/modules/nio/bin/test

     [exec] clean:
     [exec]    [delete] Deleting 20 files from /home/hybld/continuum-working-directory/6/classlib/build/classes
     [exec]    [delete] Deleting 77 files from /home/hybld/continuum-working-directory/6/classlib/modules/nio_char/bin/test

     [exec] clean:

     [exec] clean-native-includes:
     [exec]    [delete] /home/hybld/continuum-working-directory/6/classlib/deploy/include
not found.

     [exec] clean:
     [exec]    [delete] Deleting 32 files from /home/hybld/continuum-working-directory/6/classlib/build/classes
     [exec]    [delete] Deleting 34 files from /home/hybld/continuum-working-directory/6/classlib/modules/prefs/bin/test

     [exec] clean:
     [exec]    [delete] Deleting 205 files from /home/hybld/continuum-working-directory/6/classlib/build/classes
     [exec]    [delete] Deleting 60 files from /home/hybld/continuum-working-directory/6/classlib/modules/print/bin/test

     [exec] clean:
     [exec]    [delete] Deleting 156 files from /home/hybld/continuum-working-directory/6/classlib/build/classes
     [exec]    [delete] Deleting 13 files from /home/hybld/continuum-working-directory/6/classlib/modules/regex/bin/test

     [exec] clean:
     [exec]    [delete] Deleting 230 files from /home/hybld/continuum-working-directory/6/classlib/build/classes

...

     [exec]      [exec] rm -f ../shared//cmmerror.o ../shared//cmmio.o ../shared//cmmxforms.o
../shared//NativeCMM.o ../shared//NativeImageFormat.o liblcms.a ../liblcmm.so  
     [exec]      [exec] rm -f ../shared//JpegDecoder.o libjpeg.a ../libjpegdecoder.so  
     [exec]      [exec] rm -f ../shared//blitter.o ../shared//gifdecoder.o ../shared//LUTTables.o
../shared//pngdecoder.o ../shared//SurfaceDataStructure.o libpng.a ../libgl.so  

     [exec] BUILD FAILED
     [exec] /home/hybld/continuum-working-directory/6/classlib/build.xml:157: The following
error occurred while executing this line:
     [exec] /home/hybld/continuum-working-directory/6/classlib/make/build-native.xml:100:
The following error occurred while executing this line:
     [exec] /home/hybld/continuum-working-directory/6/classlib/modules/awt/build.xml:221:
The following error occurred while executing this line:
     [exec] /home/hybld/continuum-working-directory/6/classlib/make/properties.xml:299: The
directory you specified does not exist

     [exec] Total time: 1 minute 52 seconds

BUILD FAILED
/home/hybld/continuum-working-directory/6/build.xml:114: exec returned: 1

Total time: 1 minute 58 seconds

****************************************************************************

...

Mime
View raw message