harmony-commits mailing list archives

Site index · List index
Message view « Date » · « Thread »
Top « Date » · « Thread »
From nom...@intel.com
Subject [build-test alert] BUILD FAILED linux SUSE 9 gcc debug: classlib
Date Sat, 02 Dec 2006 20:21:25 GMT
BUILD FAILED:
	Ant Error Message:
/export/viv/trunk/cc/projects/classlib/trunk/build.xml:167: The following error occurred while
executing this line: /export/viv/trunk/cc/projects/classlib/trunk/make/build-test.xml:132:
There were test errors.

Date of build:	12/03/2006 01:32:10
Time to build:	48 minutes 42 seconds
Last changed:	12/03/2006 01:31:10
Last log entry:	Patch for HARMONY-2354 "[classlib][html][parser] ContentModelCompatilityTest
fails"

***********************************************************
Errors/Warnings:	(1504)
            
Tests FAILED

***********************************************************
Unit Tests: (18970)
        
error: testCFII_ServerClosedAfterFinish_NonBlock org.apache.harmony.nio.tests.java.nio.channels.SocketChannelTest
failure: testSpinnerDateModel javax.swing.SpinnerDateModelTest
Unit Test Error Details:	(2)
                
Test: testCFII_ServerClosedAfterFinish_NonBlockClass: org.apache.harmony.nio.tests.java.nio.channels.SocketChannelTestjava.net.BindException:
The address is not available
	at org.apache.harmony.luni.platform.OSNetworkSystem.socketBindImpl(Native Method)
	at org.apache.harmony.luni.platform.OSNetworkSystem.bind(OSNetworkSystem.java:126)
	at org.apache.harmony.luni.net.PlainSocketImpl.bind(PlainSocketImpl.java:161)
	at java.net.ServerSocket.<init>(ServerSocket.java:116)
	at java.net.ServerSocket.<init>(ServerSocket.java:72)
	at org.apache.harmony.nio.tests.java.nio.channels.SocketChannelTest.setUp(SocketChannelTest.java:77)

Test: testSpinnerDateModelClass: javax.swing.SpinnerDateModelTestjunit.framework.AssertionFailedError:
expected:<0> but was:<7>
	at javax.swing.SpinnerDateModelTest.testSpinnerDateModel(SpinnerDateModelTest.java:63)
	at java.lang.reflect.AccessibleObject.invokeV(AccessibleObject.java:25)
	at javax.swing.BasicSwingTestCase.runBareSuper(BasicSwingTestCase.java:117)
	at javax.swing.BasicSwingTestCase.runBareImpl(BasicSwingTestCase.java:122)
	at javax.swing.BasicSwingTestCase$1.run(BasicSwingTestCase.java:136)
	at java.lang.Thread.run(Thread.java:872)


***********************************************************
Modifications since last successful build:	(9)
            
modified apetrenko  /harmony/enhanced/classlib/trunk/modules/swing/make/exclude.linux.x86_64.drl
12/03/2006 01:31:10 Patch for HARMONY-2354 "[classlib][html][parser] ContentModelCompatilityTest
fails"
modified apetrenko  /harmony/enhanced/classlib/trunk/modules/swing/make/exclude.windows.x86_64.ibm
12/03/2006 01:31:10 Patch for HARMONY-2354 "[classlib][html][parser] ContentModelCompatilityTest
fails"
modified apetrenko  /harmony/enhanced/classlib/trunk/modules/swing/make/exclude.windows.x86.drl
12/03/2006 01:31:10 Patch for HARMONY-2354 "[classlib][html][parser] ContentModelCompatilityTest
fails"
modified apetrenko  /harmony/enhanced/classlib/trunk/modules/swing/src/main/java/common/javax/swing/text/html/parser/ContentModel.java
12/03/2006 01:31:10 Patch for HARMONY-2354 "[classlib][html][parser] ContentModelCompatilityTest
fails"
modified apetrenko  /harmony/enhanced/classlib/trunk/modules/swing/make/exclude.linux.x86_64.ibm
12/03/2006 01:31:10 Patch for HARMONY-2354 "[classlib][html][parser] ContentModelCompatilityTest
fails"
modified apetrenko  /harmony/enhanced/classlib/trunk/modules/swing/make/exclude.linux.x86.drl
12/03/2006 01:31:10 Patch for HARMONY-2354 "[classlib][html][parser] ContentModelCompatilityTest
fails"
modified apetrenko  /harmony/enhanced/classlib/trunk/modules/swing/make/exclude.windows.x86.ibm
12/03/2006 01:31:10 Patch for HARMONY-2354 "[classlib][html][parser] ContentModelCompatilityTest
fails"
modified apetrenko  /harmony/enhanced/classlib/trunk/modules/swing/make/exclude.windows.x86_64.drl
12/03/2006 01:31:10 Patch for HARMONY-2354 "[classlib][html][parser] ContentModelCompatilityTest
fails"
modified apetrenko  /harmony/enhanced/classlib/trunk/modules/swing/make/exclude.linux.x86.ibm
12/03/2006 01:31:10 Patch for HARMONY-2354 "[classlib][html][parser] ContentModelCompatilityTest
fails"

Mime
View raw message