harmony-commits mailing list archives

Site index · List index
Message view « Date » · « Thread »
Top « Date » · « Thread »
From nom...@intel.com
Subject [build-test alert] BUILD FAILED linux SUSE 9 64 bit gcc debug: drlvm
Date Fri, 01 Dec 2006 13:12:48 GMT
BUILD FAILED:
	Ant Error Message:
error string found

Date of build:	12/01/2006 04:45:17
Time to build:	27 minute(s) 22 second(s)
Last changed:	12/01/2006 04:35:41
Last log entry:	drlvm

***********************************************************
Errors/Warnings:	(1)
            

***********************************************************
Unit Tests: (1540)
        
failure: test_3 java.lang.ClassAnnotationsTest
failure: test_3_1 java.lang.ClassAnnotationsTest
failure: test_4 java.lang.ClassAnnotationsTest
failure: test_6 java.lang.ClassAnnotationsTest
failure: test_6_1 java.lang.ClassAnnotationsTest
failure: test_7 java.lang.ClassAnnotationsTest
failure: test_8 java.lang.ClassAnnotationsTest
failure: test_9 java.lang.ClassAnnotationsTest
failure: test_10 java.lang.ClassAnnotationsTest
failure: test_11 java.lang.ClassAnnotationsTest
failure: test_getFloat_Obj java.lang.reflect.FieldTest
failure: test_setFloat_Obj java.lang.reflect.FieldTest
failure: testGetAnnotation_ByDefault org.apache.harmony.lang.annotation.AllTypesTest
Unit Test Error Details:	(13)
                
Test: test_3Class: java.lang.ClassAnnotationsTestjunit.framework.AssertionFailedError: test_3,
case 1 FAILED: @java.lang.ClassAnnotationsTest$MA1$MA1_1$MA1_1_1$MA1_1_1_1$MA1_1_1_1_1$MA1_1_1_1_1_1$MA1_1_1_1_1_1_1$iiii(authorSurname=Zapreyev,
authorFullName=[Zapreyev, Serguei, Stepanovich], socialClass=class java.lang.ClassAnnotationsTest$MA1$MA1_1$MA1_1_1$MA1_1_1_1$MA1_1_1_1_1$MA1_1_1_1_1_1$MA1_1_1_1_1_1_1$iiii$Prltr,
socialClasses=[class java.lang.ClassAnnotationsTest$MA1$MA1_1$MA1_1_1$MA1_1_1_1$MA1_1_1_1_1$MA1_1_1_1_1_1$MA1_1_1_1_1_1_1$iiii$Prltr,
class java.lang.ClassAnnotationsTest$MA1$MA1_1$MA1_1_1$MA1_1_1_1$MA1_1_1_1_1$MA1_1_1_1_1_1$MA1_1_1_1_1_1_1$iiii$Brg,
class java.lang.ClassAnnotationsTest$MA1$MA1_1$MA1_1_1$MA1_1_1_1$MA1_1_1_1_1$MA1_1_1_1_1_1$MA1_1_1_1_1_1_1$iiii$Krstnn,
class java.lang.ClassAnnotationsTest$MA1$MA1_1$MA1_1_1$MA1_1_1_1$MA1_1_1_1_1$MA1_1_1_1_1_1$MA1_1_1_1_1_1_1$iiii$Arstcrt,
class java.lang.ClassAnnotationsTest$MA1$MA1_1$MA1_1_1$MA1_1_1_1$MA1_1_1_1_1!
 $MA1_1_1_1_1_1$MA1_1_1_1_1_1_1$iiii$Clrc], primitive=777, blackMarker=@java.lang.ClassAnnotationsTest$MA1$MA1_1$MA1_1_1$MA1_1_1_1$MA1_1_1_1_1$MA1_1_1_1_1_1$MA1_1_1_1_1_1_1(author=Zapreyev
2), whiteMarkers=[@java.lang.ClassAnnotationsTest$MA1$MA1_1$MA1_1_1$MA1_1_1_1$MA1_1_1_1_1$MA1_1_1_1_1_1$MA1_1_1_1_1_1_1$iiii$internalAnnotation(attr1=true,
attr2=0, attr3=Z, attr4=1.7976931348623157E308, attr5=0.0, attr6=777, attr7=-1, attr8=32655,
itself=@java.lang.ClassAnnotationsTest$MA1$MA1_1$MA1_1_1$MA1_1_1_1$MA1_1_1_1_1(author=Zapreyev
4)), @java.lang.ClassAnnotationsTest$MA1$MA1_1$MA1_1_1$MA1_1_1_1$MA1_1_1_1_1$MA1_1_1_1_1_1$MA1_1_1_1_1_1_1$iiii$internalAnnotation(attr1=false,
attr2=0, attr3=Z, attr4=1.7976931348623157E308, attr5=0.0, attr6=777, attr7=-1, attr8=32655,
itself=@java.lang.ClassAnnotationsTest$MA1$MA1_1$MA1_1_1$MA1_1_1_1$MA1_1_1_1_1(author=Zapreyev
4)), @java.lang.ClassAnnotationsTest$MA1$MA1_1$MA1_1_1$MA1_1_1_1$MA1_1_1_1_1$MA1_1_1_1_1_1$MA1_1_1_1_1_1_1$iiii$internalAnno!
 tation(attr1=false, attr2=0, attr3=Z, attr4=1.7976931348623157E308, at
tr5=0.0, attr6=777, attr7=-1, attr8=32655, itself=@java.lang.ClassAnnotationsTest$MA1$MA1_1$MA1_1_1$MA1_1_1_1$MA1_1_1_1_1(author=Zapreyev
4))], constant=M_S, constants=[W_T5, V_T5, G_A_T5])
	at junit.framework.Assert.fail(Assert.java:47)
	at java.lang.ClassAnnotationsTest.test_3(ClassAnnotationsTest.java:405)
	at java.lang.reflect.VMReflection.invokeMethod(Native Method)
	at java.lang.reflect.Method.invoke(Unknown Source)
	at junit.framework.TestCase.runTest(TestCase.java:164)
	at junit.framework.TestCase.runBare(TestCase.java:128)
	at junit.framework.TestResult$1.protect(TestResult.java:106)
	at junit.framework.TestResult.runProtected(TestResult.java)
	at junit.framework.TestResult.run(TestResult.java:104)
	at junit.framework.TestCase.run(TestCase.java)
	at junit.framework.TestSuite.runTest(TestSuite.java)
	at junit.framework.TestSuite.run(TestSuite.java:224)
	at org.apache.tools.ant.taskdefs.optional.junit.JUnitTestRunner.run(JUnitTestRunner.java:297)
	at org.apache.tools.ant.taskdefs.optional.junit.JUnitTestRunner.launch(JUnitTestRunner.java:670)
	at org.apache.tools.ant.taskdefs.optional.junit.JUnitTestRunner.main(JUnitTestRunner.java:545)

Test: test_3_1Class: java.lang.ClassAnnotationsTestjunit.framework.AssertionFailedError: test_3_1,
case 1 FAILED: @java.lang.ClassAnnotationsTest$MA1$MA1_1$MA1_1_1$MA1_1_1_1$MA1_1_1_1_1$MA1_1_1_1_1_1$MA1_1_1_1_1_1_1$iiii(authorSurname=Zapreyev,
authorFullName=[Zapreyev, Serguei, Stepanovich], socialClass=class java.lang.ClassAnnotationsTest$MA1$MA1_1$MA1_1_1$MA1_1_1_1$MA1_1_1_1_1$MA1_1_1_1_1_1$MA1_1_1_1_1_1_1$iiii$Prltr,
socialClasses=[class java.lang.ClassAnnotationsTest$MA1$MA1_1$MA1_1_1$MA1_1_1_1$MA1_1_1_1_1$MA1_1_1_1_1_1$MA1_1_1_1_1_1_1$iiii$Prltr,
class java.lang.ClassAnnotationsTest$MA1$MA1_1$MA1_1_1$MA1_1_1_1$MA1_1_1_1_1$MA1_1_1_1_1_1$MA1_1_1_1_1_1_1$iiii$Brg,
class java.lang.ClassAnnotationsTest$MA1$MA1_1$MA1_1_1$MA1_1_1_1$MA1_1_1_1_1$MA1_1_1_1_1_1$MA1_1_1_1_1_1_1$iiii$Krstnn,
class java.lang.ClassAnnotationsTest$MA1$MA1_1$MA1_1_1$MA1_1_1_1$MA1_1_1_1_1$MA1_1_1_1_1_1$MA1_1_1_1_1_1_1$iiii$Arstcrt,
class java.lang.ClassAnnotationsTest$MA1$MA1_1$MA1_1_1$MA1_1_1_1$MA1_1_1!
 _1_1$MA1_1_1_1_1_1$MA1_1_1_1_1_1_1$iiii$Clrc], primitive=777, blackMarker=@java.lang.ClassAnnotationsTest$MA1$MA1_1$MA1_1_1$MA1_1_1_1$MA1_1_1_1_1$MA1_1_1_1_1_1$MA1_1_1_1_1_1_1(author=Zapreyev
2), whiteMarkers=[@java.lang.ClassAnnotationsTest$MA1$MA1_1$MA1_1_1$MA1_1_1_1$MA1_1_1_1_1$MA1_1_1_1_1_1$MA1_1_1_1_1_1_1$iiii$internalAnnotation(attr1=true,
attr2=0, attr3=Z, attr4=1.7976931348623157E308, attr5=0.0, attr6=777, attr7=-1, attr8=32655,
itself=@java.lang.ClassAnnotationsTest$MA1$MA1_1$MA1_1_1$MA1_1_1_1$MA1_1_1_1_1(author=Zapreyev
4)), @java.lang.ClassAnnotationsTest$MA1$MA1_1$MA1_1_1$MA1_1_1_1$MA1_1_1_1_1$MA1_1_1_1_1_1$MA1_1_1_1_1_1_1$iiii$internalAnnotation(attr1=false,
attr2=0, attr3=Z, attr4=1.7976931348623157E308, attr5=0.0, attr6=777, attr7=-1, attr8=32655,
itself=@java.lang.ClassAnnotationsTest$MA1$MA1_1$MA1_1_1$MA1_1_1_1$MA1_1_1_1_1(author=Zapreyev
4)), @java.lang.ClassAnnotationsTest$MA1$MA1_1$MA1_1_1$MA1_1_1_1$MA1_1_1_1_1$MA1_1_1_1_1_1$MA1_1_1_1_1_1_1$iiii$internal!
 Annotation(attr1=false, attr2=0, attr3=Z, attr4=1.7976931348623157E308
, attr5=0.0, attr6=777, attr7=-1, attr8=32655, itself=@java.lang.ClassAnnotationsTest$MA1$MA1_1$MA1_1_1$MA1_1_1_1$MA1_1_1_1_1(author=Zapreyev
4))], constant=M_S, constants=[W_T5, V_T5, G_A_T5])
	at junit.framework.Assert.fail(Assert.java:47)
	at java.lang.ClassAnnotationsTest.test_3_1(ClassAnnotationsTest.java:600)
	at java.lang.reflect.VMReflection.invokeMethod(Native Method)
	at java.lang.reflect.Method.invoke(Unknown Source)
	at junit.framework.TestCase.runTest(TestCase.java:164)
	at junit.framework.TestCase.runBare(TestCase.java:128)
	at junit.framework.TestResult$1.protect(TestResult.java:106)
	at junit.framework.TestResult.runProtected(TestResult.java)
	at junit.framework.TestResult.run(TestResult.java:104)
	at junit.framework.TestCase.run(TestCase.java)
	at junit.framework.TestSuite.runTest(TestSuite.java)
	at junit.framework.TestSuite.run(TestSuite.java:224)
	at org.apache.tools.ant.taskdefs.optional.junit.JUnitTestRunner.run(JUnitTestRunner.java:297)
	at org.apache.tools.ant.taskdefs.optional.junit.JUnitTestRunner.launch(JUnitTestRunner.java:670)
	at org.apache.tools.ant.taskdefs.optional.junit.JUnitTestRunner.main(JUnitTestRunner.java:545)

Test: test_4Class: java.lang.ClassAnnotationsTestjunit.framework.AssertionFailedError: test_4,
case 043 FAILED: true|0|Z|1.7976931348623157E308|0.0|777|-1|32655|Zapreyev 4
	at junit.framework.Assert.fail(Assert.java:47)
	at java.lang.ClassAnnotationsTest.test_4(ClassAnnotationsTest.java:936)
	at java.lang.reflect.VMReflection.invokeMethod(Native Method)
	at java.lang.reflect.Method.invoke(Unknown Source)
	at junit.framework.TestCase.runTest(TestCase.java:164)
	at junit.framework.TestCase.runBare(TestCase.java:128)
	at junit.framework.TestResult$1.protect(TestResult.java:106)
	at junit.framework.TestResult.runProtected(TestResult.java)
	at junit.framework.TestResult.run(TestResult.java:104)
	at junit.framework.TestCase.run(TestCase.java)
	at junit.framework.TestSuite.runTest(TestSuite.java)
	at junit.framework.TestSuite.run(TestSuite.java:224)
	at org.apache.tools.ant.taskdefs.optional.junit.JUnitTestRunner.run(JUnitTestRunner.java:297)
	at org.apache.tools.ant.taskdefs.optional.junit.JUnitTestRunner.launch(JUnitTestRunner.java:670)
	at org.apache.tools.ant.taskdefs.optional.junit.JUnitTestRunner.main(JUnitTestRunner.java:545)

Test: test_6Class: java.lang.ClassAnnotationsTestjunit.framework.AssertionFailedError: test_6,
case 1 FAILED: @java.lang.ClassAnnotationsTest$MA1$MA1_1$MA1_1_1$MA1_1_1_1$MA1_1_1_1_1$MA1_1_1_1_1_1$MA1_1_1_1_1_1_1$iiii(authorSurname=Zapreyev,
authorFullName=[Zapreyev, Serguei, Stepanovich], socialClass=class java.lang.ClassAnnotationsTest$MA1$MA1_1$MA1_1_1$MA1_1_1_1$MA1_1_1_1_1$MA1_1_1_1_1_1$MA1_1_1_1_1_1_1$iiii$Prltr,
socialClasses=[class java.lang.ClassAnnotationsTest$MA1$MA1_1$MA1_1_1$MA1_1_1_1$MA1_1_1_1_1$MA1_1_1_1_1_1$MA1_1_1_1_1_1_1$iiii$Prltr,
class java.lang.ClassAnnotationsTest$MA1$MA1_1$MA1_1_1$MA1_1_1_1$MA1_1_1_1_1$MA1_1_1_1_1_1$MA1_1_1_1_1_1_1$iiii$Brg,
class java.lang.ClassAnnotationsTest$MA1$MA1_1$MA1_1_1$MA1_1_1_1$MA1_1_1_1_1$MA1_1_1_1_1_1$MA1_1_1_1_1_1_1$iiii$Krstnn,
class java.lang.ClassAnnotationsTest$MA1$MA1_1$MA1_1_1$MA1_1_1_1$MA1_1_1_1_1$MA1_1_1_1_1_1$MA1_1_1_1_1_1_1$iiii$Arstcrt,
class java.lang.ClassAnnotationsTest$MA1$MA1_1$MA1_1_1$MA1_1_1_1$MA1_1_1_1_1!
 $MA1_1_1_1_1_1$MA1_1_1_1_1_1_1$iiii$Clrc], primitive=777, blackMarker=@java.lang.ClassAnnotationsTest$MA1$MA1_1$MA1_1_1$MA1_1_1_1$MA1_1_1_1_1$MA1_1_1_1_1_1$MA1_1_1_1_1_1_1(author=Zapreyev
2), whiteMarkers=[@java.lang.ClassAnnotationsTest$MA1$MA1_1$MA1_1_1$MA1_1_1_1$MA1_1_1_1_1$MA1_1_1_1_1_1$MA1_1_1_1_1_1_1$iiii$internalAnnotation(attr1=true,
attr2=0, attr3=Z, attr4=1.7976931348623157E308, attr5=0.0, attr6=777, attr7=-1, attr8=32655,
itself=@java.lang.ClassAnnotationsTest$MA1$MA1_1$MA1_1_1$MA1_1_1_1$MA1_1_1_1_1(author=Zapreyev
4)), @java.lang.ClassAnnotationsTest$MA1$MA1_1$MA1_1_1$MA1_1_1_1$MA1_1_1_1_1$MA1_1_1_1_1_1$MA1_1_1_1_1_1_1$iiii$internalAnnotation(attr1=false,
attr2=0, attr3=Z, attr4=1.7976931348623157E308, attr5=0.0, attr6=777, attr7=-1, attr8=32655,
itself=@java.lang.ClassAnnotationsTest$MA1$MA1_1$MA1_1_1$MA1_1_1_1$MA1_1_1_1_1(author=Zapreyev
4)), @java.lang.ClassAnnotationsTest$MA1$MA1_1$MA1_1_1$MA1_1_1_1$MA1_1_1_1_1$MA1_1_1_1_1_1$MA1_1_1_1_1_1_1$iiii$internalAnno!
 tation(attr1=false, attr2=0, attr3=Z, attr4=1.7976931348623157E308, at
tr5=0.0, attr6=777, attr7=-1, attr8=32655, itself=@java.lang.ClassAnnotationsTest$MA1$MA1_1$MA1_1_1$MA1_1_1_1$MA1_1_1_1_1(author=Zapreyev
4))], constant=M_S, constants=[W_T5, V_T5, G_A_T5])
	at junit.framework.Assert.fail(Assert.java:47)
	at java.lang.ClassAnnotationsTest.test_6(ClassAnnotationsTest.java:1091)
	at java.lang.reflect.VMReflection.invokeMethod(Native Method)
	at java.lang.reflect.Method.invoke(Unknown Source)
	at junit.framework.TestCase.runTest(TestCase.java:164)
	at junit.framework.TestCase.runBare(TestCase.java:128)
	at junit.framework.TestResult$1.protect(TestResult.java:106)
	at junit.framework.TestResult.runProtected(TestResult.java)
	at junit.framework.TestResult.run(TestResult.java:104)
	at junit.framework.TestCase.run(TestCase.java)
	at junit.framework.TestSuite.runTest(TestSuite.java)
	at junit.framework.TestSuite.run(TestSuite.java:224)
	at org.apache.tools.ant.taskdefs.optional.junit.JUnitTestRunner.run(JUnitTestRunner.java:297)
	at org.apache.tools.ant.taskdefs.optional.junit.JUnitTestRunner.launch(JUnitTestRunner.java:670)
	at org.apache.tools.ant.taskdefs.optional.junit.JUnitTestRunner.main(JUnitTestRunner.java:545)

Test: test_6_1Class: java.lang.ClassAnnotationsTestjunit.framework.AssertionFailedError: test_6_1,
case 1 FAILED: @java.lang.ClassAnnotationsTest$MA1$MA1_1$MA1_1_1$MA1_1_1_1$MA1_1_1_1_1$MA1_1_1_1_1_1$MA1_1_1_1_1_1_1$iiii(authorSurname=Zapreyev,
authorFullName=[Zapreyev, Serguei, Stepanovich], socialClass=class java.lang.ClassAnnotationsTest$MA1$MA1_1$MA1_1_1$MA1_1_1_1$MA1_1_1_1_1$MA1_1_1_1_1_1$MA1_1_1_1_1_1_1$iiii$Prltr,
socialClasses=[class java.lang.ClassAnnotationsTest$MA1$MA1_1$MA1_1_1$MA1_1_1_1$MA1_1_1_1_1$MA1_1_1_1_1_1$MA1_1_1_1_1_1_1$iiii$Prltr,
class java.lang.ClassAnnotationsTest$MA1$MA1_1$MA1_1_1$MA1_1_1_1$MA1_1_1_1_1$MA1_1_1_1_1_1$MA1_1_1_1_1_1_1$iiii$Brg,
class java.lang.ClassAnnotationsTest$MA1$MA1_1$MA1_1_1$MA1_1_1_1$MA1_1_1_1_1$MA1_1_1_1_1_1$MA1_1_1_1_1_1_1$iiii$Krstnn,
class java.lang.ClassAnnotationsTest$MA1$MA1_1$MA1_1_1$MA1_1_1_1$MA1_1_1_1_1$MA1_1_1_1_1_1$MA1_1_1_1_1_1_1$iiii$Arstcrt,
class java.lang.ClassAnnotationsTest$MA1$MA1_1$MA1_1_1$MA1_1_1_1$MA1_1_1!
 _1_1$MA1_1_1_1_1_1$MA1_1_1_1_1_1_1$iiii$Clrc], primitive=777, blackMarker=@java.lang.ClassAnnotationsTest$MA1$MA1_1$MA1_1_1$MA1_1_1_1$MA1_1_1_1_1$MA1_1_1_1_1_1$MA1_1_1_1_1_1_1(author=Zapreyev
2), whiteMarkers=[@java.lang.ClassAnnotationsTest$MA1$MA1_1$MA1_1_1$MA1_1_1_1$MA1_1_1_1_1$MA1_1_1_1_1_1$MA1_1_1_1_1_1_1$iiii$internalAnnotation(attr1=true,
attr2=0, attr3=Z, attr4=1.7976931348623157E308, attr5=0.0, attr6=777, attr7=-1, attr8=32655,
itself=@java.lang.ClassAnnotationsTest$MA1$MA1_1$MA1_1_1$MA1_1_1_1$MA1_1_1_1_1(author=Zapreyev
4)), @java.lang.ClassAnnotationsTest$MA1$MA1_1$MA1_1_1$MA1_1_1_1$MA1_1_1_1_1$MA1_1_1_1_1_1$MA1_1_1_1_1_1_1$iiii$internalAnnotation(attr1=false,
attr2=0, attr3=Z, attr4=1.7976931348623157E308, attr5=0.0, attr6=777, attr7=-1, attr8=32655,
itself=@java.lang.ClassAnnotationsTest$MA1$MA1_1$MA1_1_1$MA1_1_1_1$MA1_1_1_1_1(author=Zapreyev
4)), @java.lang.ClassAnnotationsTest$MA1$MA1_1$MA1_1_1$MA1_1_1_1$MA1_1_1_1_1$MA1_1_1_1_1_1$MA1_1_1_1_1_1_1$iiii$internal!
 Annotation(attr1=false, attr2=0, attr3=Z, attr4=1.7976931348623157E308
, attr5=0.0, attr6=777, attr7=-1, attr8=32655, itself=@java.lang.ClassAnnotationsTest$MA1$MA1_1$MA1_1_1$MA1_1_1_1$MA1_1_1_1_1(author=Zapreyev
4))], constant=M_S, constants=[W_T5, V_T5, G_A_T5])
	at junit.framework.Assert.fail(Assert.java:47)
	at java.lang.ClassAnnotationsTest.test_6_1(ClassAnnotationsTest.java:1294)
	at java.lang.reflect.VMReflection.invokeMethod(Native Method)
	at java.lang.reflect.Method.invoke(Unknown Source)
	at junit.framework.TestCase.runTest(TestCase.java:164)
	at junit.framework.TestCase.runBare(TestCase.java:128)
	at junit.framework.TestResult$1.protect(TestResult.java:106)
	at junit.framework.TestResult.runProtected(TestResult.java)
	at junit.framework.TestResult.run(TestResult.java:104)
	at junit.framework.TestCase.run(TestCase.java)
	at junit.framework.TestSuite.runTest(TestSuite.java)
	at junit.framework.TestSuite.run(TestSuite.java:224)
	at org.apache.tools.ant.taskdefs.optional.junit.JUnitTestRunner.run(JUnitTestRunner.java:297)
	at org.apache.tools.ant.taskdefs.optional.junit.JUnitTestRunner.launch(JUnitTestRunner.java:670)
	at org.apache.tools.ant.taskdefs.optional.junit.JUnitTestRunner.main(JUnitTestRunner.java:545)

Test: test_7Class: java.lang.ClassAnnotationsTestjunit.framework.AssertionFailedError: test_7,
case 043 FAILED: true|0|Z|1.7976931348623157E308|0.0|777|-1|32655|Zapreyev 4
	at junit.framework.Assert.fail(Assert.java:47)
	at java.lang.ClassAnnotationsTest.test_7(ClassAnnotationsTest.java:1628)
	at java.lang.reflect.VMReflection.invokeMethod(Native Method)
	at java.lang.reflect.Method.invoke(Unknown Source)
	at junit.framework.TestCase.runTest(TestCase.java:164)
	at junit.framework.TestCase.runBare(TestCase.java:128)
	at junit.framework.TestResult$1.protect(TestResult.java:106)
	at junit.framework.TestResult.runProtected(TestResult.java)
	at junit.framework.TestResult.run(TestResult.java:104)
	at junit.framework.TestCase.run(TestCase.java)
	at junit.framework.TestSuite.runTest(TestSuite.java)
	at junit.framework.TestSuite.run(TestSuite.java:224)
	at org.apache.tools.ant.taskdefs.optional.junit.JUnitTestRunner.run(JUnitTestRunner.java:297)
	at org.apache.tools.ant.taskdefs.optional.junit.JUnitTestRunner.launch(JUnitTestRunner.java:670)
	at org.apache.tools.ant.taskdefs.optional.junit.JUnitTestRunner.main(JUnitTestRunner.java:545)

Test: test_8Class: java.lang.ClassAnnotationsTestjunit.framework.AssertionFailedError: test_8,
case 043 FAILED: true|0|Z|1.7976931348623157E308|0.0|777|-1|32655|Zapreyev 4
	at junit.framework.Assert.fail(Assert.java:47)
	at java.lang.ClassAnnotationsTest.test_8(ClassAnnotationsTest.java:1814)
	at java.lang.reflect.VMReflection.invokeMethod(Native Method)
	at java.lang.reflect.Method.invoke(Unknown Source)
	at junit.framework.TestCase.runTest(TestCase.java:164)
	at junit.framework.TestCase.runBare(TestCase.java:128)
	at junit.framework.TestResult$1.protect(TestResult.java:106)
	at junit.framework.TestResult.runProtected(TestResult.java)
	at junit.framework.TestResult.run(TestResult.java:104)
	at junit.framework.TestCase.run(TestCase.java)
	at junit.framework.TestSuite.runTest(TestSuite.java)
	at junit.framework.TestSuite.run(TestSuite.java:224)
	at org.apache.tools.ant.taskdefs.optional.junit.JUnitTestRunner.run(JUnitTestRunner.java:297)
	at org.apache.tools.ant.taskdefs.optional.junit.JUnitTestRunner.launch(JUnitTestRunner.java:670)
	at org.apache.tools.ant.taskdefs.optional.junit.JUnitTestRunner.main(JUnitTestRunner.java:545)

Test: test_9Class: java.lang.ClassAnnotationsTestjunit.framework.AssertionFailedError: test_9,
case 043 FAILED: true|0|Z|1.7976931348623157E308|0.0|777|-1|32655|Zapreyev 4
	at junit.framework.Assert.fail(Assert.java:47)
	at java.lang.ClassAnnotationsTest.test_9(ClassAnnotationsTest.java:1997)
	at java.lang.reflect.VMReflection.invokeMethod(Native Method)
	at java.lang.reflect.Method.invoke(Unknown Source)
	at junit.framework.TestCase.runTest(TestCase.java:164)
	at junit.framework.TestCase.runBare(TestCase.java:128)
	at junit.framework.TestResult$1.protect(TestResult.java:106)
	at junit.framework.TestResult.runProtected(TestResult.java)
	at junit.framework.TestResult.run(TestResult.java:104)
	at junit.framework.TestCase.run(TestCase.java)
	at junit.framework.TestSuite.runTest(TestSuite.java)
	at junit.framework.TestSuite.run(TestSuite.java:224)
	at org.apache.tools.ant.taskdefs.optional.junit.JUnitTestRunner.run(JUnitTestRunner.java:297)
	at org.apache.tools.ant.taskdefs.optional.junit.JUnitTestRunner.launch(JUnitTestRunner.java:670)
	at org.apache.tools.ant.taskdefs.optional.junit.JUnitTestRunner.main(JUnitTestRunner.java:545)

Test: test_10Class: java.lang.ClassAnnotationsTestjunit.framework.AssertionFailedError: test_10,
case 1 FAILED: @java.lang.ClassAnnotationsTest$MA1$MA1_1$MA1_1_1$MA1_1_1_1$MA1_1_1_1_1$MA1_1_1_1_1_1$MA1_1_1_1_1_1_1$iiii(authorSurname=Zapreyev,
authorFullName=[Zapreyev, Serguei, Stepanovich], socialClass=class java.lang.ClassAnnotationsTest$MA1$MA1_1$MA1_1_1$MA1_1_1_1$MA1_1_1_1_1$MA1_1_1_1_1_1$MA1_1_1_1_1_1_1$iiii$Prltr,
socialClasses=[class java.lang.ClassAnnotationsTest$MA1$MA1_1$MA1_1_1$MA1_1_1_1$MA1_1_1_1_1$MA1_1_1_1_1_1$MA1_1_1_1_1_1_1$iiii$Prltr,
class java.lang.ClassAnnotationsTest$MA1$MA1_1$MA1_1_1$MA1_1_1_1$MA1_1_1_1_1$MA1_1_1_1_1_1$MA1_1_1_1_1_1_1$iiii$Brg,
class java.lang.ClassAnnotationsTest$MA1$MA1_1$MA1_1_1$MA1_1_1_1$MA1_1_1_1_1$MA1_1_1_1_1_1$MA1_1_1_1_1_1_1$iiii$Krstnn,
class java.lang.ClassAnnotationsTest$MA1$MA1_1$MA1_1_1$MA1_1_1_1$MA1_1_1_1_1$MA1_1_1_1_1_1$MA1_1_1_1_1_1_1$iiii$Arstcrt,
class java.lang.ClassAnnotationsTest$MA1$MA1_1$MA1_1_1$MA1_1_1_1$MA1_1_1_1!
 _1$MA1_1_1_1_1_1$MA1_1_1_1_1_1_1$iiii$Clrc], primitive=777, blackMarker=@java.lang.ClassAnnotationsTest$MA1$MA1_1$MA1_1_1$MA1_1_1_1$MA1_1_1_1_1$MA1_1_1_1_1_1$MA1_1_1_1_1_1_1(author=UNKNOWN),
whiteMarkers=[@java.lang.ClassAnnotationsTest$MA1$MA1_1$MA1_1_1$MA1_1_1_1$MA1_1_1_1_1$MA1_1_1_1_1_1$MA1_1_1_1_1_1_1$iiii$internalAnnotation(attr1=true,
attr2=0, attr3=Z, attr4=1.7976931348623157E308, attr5=0.0, attr6=777, attr7=-1, attr8=32655,
itself=@java.lang.ClassAnnotationsTest$MA1$MA1_1$MA1_1_1$MA1_1_1_1$MA1_1_1_1_1(author=Zapreyev
4)), @java.lang.ClassAnnotationsTest$MA1$MA1_1$MA1_1_1$MA1_1_1_1$MA1_1_1_1_1$MA1_1_1_1_1_1$MA1_1_1_1_1_1_1$iiii$internalAnnotation(attr1=false,
attr2=0, attr3=Z, attr4=1.7976931348623157E308, attr5=0.0, attr6=777, attr7=-1, attr8=32655,
itself=@java.lang.ClassAnnotationsTest$MA1$MA1_1$MA1_1_1$MA1_1_1_1$MA1_1_1_1_1(author=Zapreyev
4)), @java.lang.ClassAnnotationsTest$MA1$MA1_1$MA1_1_1$MA1_1_1_1$MA1_1_1_1_1$MA1_1_1_1_1_1$MA1_1_1_1_1_1_1$iiii$internalAnnot!
 ation(attr1=false, attr2=0, attr3=Z, attr4=1.7976931348623157E308, att
r5=0.0, attr6=777, attr7=-1, attr8=32655, itself=@java.lang.ClassAnnotationsTest$MA1$MA1_1$MA1_1_1$MA1_1_1_1$MA1_1_1_1_1(author=Zapreyev
4))], constant=M_S, constants=[W_T5, V_T5, G_A_T5])
	at junit.framework.Assert.fail(Assert.java:47)
	at java.lang.ClassAnnotationsTest.test_10(ClassAnnotationsTest.java:2107)
	at java.lang.reflect.VMReflection.invokeMethod(Native Method)
	at java.lang.reflect.Method.invoke(Unknown Source)
	at junit.framework.TestCase.runTest(TestCase.java:164)
	at junit.framework.TestCase.runBare(TestCase.java:128)
	at junit.framework.TestResult$1.protect(TestResult.java:106)
	at junit.framework.TestResult.runProtected(TestResult.java)
	at junit.framework.TestResult.run(TestResult.java:104)
	at junit.framework.TestCase.run(TestCase.java)
	at junit.framework.TestSuite.runTest(TestSuite.java)
	at junit.framework.TestSuite.run(TestSuite.java:224)
	at org.apache.tools.ant.taskdefs.optional.junit.JUnitTestRunner.run(JUnitTestRunner.java:297)
	at org.apache.tools.ant.taskdefs.optional.junit.JUnitTestRunner.launch(JUnitTestRunner.java:670)
	at org.apache.tools.ant.taskdefs.optional.junit.JUnitTestRunner.main(JUnitTestRunner.java:545)

Test: test_11Class: java.lang.ClassAnnotationsTestjunit.framework.AssertionFailedError: test_11,
case 1 FAILED: @java.lang.ClassAnnotationsTest$MA1$MA1_1$MA1_1_1$MA1_1_1_1$MA1_1_1_1_1$MA1_1_1_1_1_1$MA1_1_1_1_1_1_1$iiii(authorSurname=Zapreyev,
authorFullName=[Zapreyev, Serguei, Stepanovich], socialClass=class java.lang.ClassAnnotationsTest$MA1$MA1_1$MA1_1_1$MA1_1_1_1$MA1_1_1_1_1$MA1_1_1_1_1_1$MA1_1_1_1_1_1_1$iiii$Prltr,
socialClasses=[class java.lang.ClassAnnotationsTest$MA1$MA1_1$MA1_1_1$MA1_1_1_1$MA1_1_1_1_1$MA1_1_1_1_1_1$MA1_1_1_1_1_1_1$iiii$Prltr,
class java.lang.ClassAnnotationsTest$MA1$MA1_1$MA1_1_1$MA1_1_1_1$MA1_1_1_1_1$MA1_1_1_1_1_1$MA1_1_1_1_1_1_1$iiii$Brg,
class java.lang.ClassAnnotationsTest$MA1$MA1_1$MA1_1_1$MA1_1_1_1$MA1_1_1_1_1$MA1_1_1_1_1_1$MA1_1_1_1_1_1_1$iiii$Krstnn,
class java.lang.ClassAnnotationsTest$MA1$MA1_1$MA1_1_1$MA1_1_1_1$MA1_1_1_1_1$MA1_1_1_1_1_1$MA1_1_1_1_1_1_1$iiii$Arstcrt,
class java.lang.ClassAnnotationsTest$MA1$MA1_1$MA1_1_1$MA1_1_1_1$MA1_1_1_1!
 _1$MA1_1_1_1_1_1$MA1_1_1_1_1_1_1$iiii$Clrc], primitive=777, blackMarker=@java.lang.ClassAnnotationsTest$MA1$MA1_1$MA1_1_1$MA1_1_1_1$MA1_1_1_1_1$MA1_1_1_1_1_1$MA1_1_1_1_1_1_1(author=UNKNOWN),
whiteMarkers=[@java.lang.ClassAnnotationsTest$MA1$MA1_1$MA1_1_1$MA1_1_1_1$MA1_1_1_1_1$MA1_1_1_1_1_1$MA1_1_1_1_1_1_1$iiii$internalAnnotation(attr1=true,
attr2=0, attr3=Z, attr4=1.7976931348623157E308, attr5=0.0, attr6=777, attr7=-1, attr8=32655,
itself=@java.lang.ClassAnnotationsTest$MA1$MA1_1$MA1_1_1$MA1_1_1_1$MA1_1_1_1_1(author=Zapreyev
4)), @java.lang.ClassAnnotationsTest$MA1$MA1_1$MA1_1_1$MA1_1_1_1$MA1_1_1_1_1$MA1_1_1_1_1_1$MA1_1_1_1_1_1_1$iiii$internalAnnotation(attr1=false,
attr2=0, attr3=Z, attr4=1.7976931348623157E308, attr5=0.0, attr6=777, attr7=-1, attr8=32655,
itself=@java.lang.ClassAnnotationsTest$MA1$MA1_1$MA1_1_1$MA1_1_1_1$MA1_1_1_1_1(author=Zapreyev
4)), @java.lang.ClassAnnotationsTest$MA1$MA1_1$MA1_1_1$MA1_1_1_1$MA1_1_1_1_1$MA1_1_1_1_1_1$MA1_1_1_1_1_1_1$iiii$internalAnnot!
 ation(attr1=false, attr2=0, attr3=Z, attr4=1.7976931348623157E308, att
r5=0.0, attr6=777, attr7=-1, attr8=32655, itself=@java.lang.ClassAnnotationsTest$MA1$MA1_1$MA1_1_1$MA1_1_1_1$MA1_1_1_1_1(author=Zapreyev
4))], constant=M_S, constants=[W_T5, V_T5, G_A_T5])
	at junit.framework.Assert.fail(Assert.java:47)
	at java.lang.ClassAnnotationsTest.test_11(ClassAnnotationsTest.java:2380)
	at java.lang.reflect.VMReflection.invokeMethod(Native Method)
	at java.lang.reflect.Method.invoke(Unknown Source)
	at junit.framework.TestCase.runTest(TestCase.java:164)
	at junit.framework.TestCase.runBare(TestCase.java:128)
	at junit.framework.TestResult$1.protect(TestResult.java:106)
	at junit.framework.TestResult.runProtected(TestResult.java)
	at junit.framework.TestResult.run(TestResult.java:104)
	at junit.framework.TestCase.run(TestCase.java)
	at junit.framework.TestSuite.runTest(TestSuite.java)
	at junit.framework.TestSuite.run(TestSuite.java:224)
	at org.apache.tools.ant.taskdefs.optional.junit.JUnitTestRunner.run(JUnitTestRunner.java:297)
	at org.apache.tools.ant.taskdefs.optional.junit.JUnitTestRunner.launch(JUnitTestRunner.java:670)
	at org.apache.tools.ant.taskdefs.optional.junit.JUnitTestRunner.main(JUnitTestRunner.java:545)

Test: test_getFloat_ObjClass: java.lang.reflect.FieldTestjunit.framework.AssertionFailedError:
Error1 expected:<7.77> but was:<-3.689349E19>
	at junit.framework.Assert.fail(Assert.java:47)
	at junit.framework.Assert.failNotEquals(Assert.java:280)
	at junit.framework.Assert.assertEquals(Assert.java:63)
	at java.lang.reflect.FieldTest.test_getFloat_Obj(FieldTest.java:217)
	at java.lang.reflect.VMReflection.invokeMethod(Native Method)
	at java.lang.reflect.Method.invoke(Unknown Source)
	at junit.framework.TestCase.runTest(TestCase.java:164)
	at junit.framework.TestCase.runBare(TestCase.java:128)
	at junit.framework.TestResult$1.protect(TestResult.java:106)
	at junit.framework.TestResult.runProtected(TestResult.java)
	at junit.framework.TestResult.run(TestResult.java:104)
	at junit.framework.TestCase.run(TestCase.java)
	at junit.framework.TestSuite.runTest(TestSuite.java)
	at junit.framework.TestSuite.run(TestSuite.java:224)
	at org.apache.tools.ant.taskdefs.optional.junit.JUnitTestRunner.run(JUnitTestRunner.java:297)
	at org.apache.tools.ant.taskdefs.optional.junit.JUnitTestRunner.launch(JUnitTestRunner.java:670)
	at org.apache.tools.ant.taskdefs.optional.junit.JUnitTestRunner.main(JUnitTestRunner.java:545)

Test: test_setFloat_ObjClass: java.lang.reflect.FieldTestjunit.framework.AssertionFailedError:
Error1 expected:<0.0057> but was:<1.0842022E-19>
	at junit.framework.Assert.fail(Assert.java:47)
	at junit.framework.Assert.failNotEquals(Assert.java:280)
	at junit.framework.Assert.assertEquals(Assert.java:63)
	at java.lang.reflect.FieldTest.test_setFloat_Obj(FieldTest.java:503)
	at java.lang.reflect.VMReflection.invokeMethod(Native Method)
	at java.lang.reflect.Method.invoke(Unknown Source)
	at junit.framework.TestCase.runTest(TestCase.java:164)
	at junit.framework.TestCase.runBare(TestCase.java:128)
	at junit.framework.TestResult$1.protect(TestResult.java:106)
	at junit.framework.TestResult.runProtected(TestResult.java)
	at junit.framework.TestResult.run(TestResult.java:104)
	at junit.framework.TestCase.run(TestCase.java)
	at junit.framework.TestSuite.runTest(TestSuite.java)
	at junit.framework.TestSuite.run(TestSuite.java:224)
	at org.apache.tools.ant.taskdefs.optional.junit.JUnitTestRunner.run(JUnitTestRunner.java:297)
	at org.apache.tools.ant.taskdefs.optional.junit.JUnitTestRunner.launch(JUnitTestRunner.java:670)
	at org.apache.tools.ant.taskdefs.optional.junit.JUnitTestRunner.main(JUnitTestRunner.java:545)

Test: testGetAnnotation_ByDefaultClass: org.apache.harmony.lang.annotation.AllTypesTestjunit.framework.AssertionFailedError:
floatValue expected:<-2.0> but was:<0.0>
	at junit.framework.Assert.fail(Assert.java:47)
	at junit.framework.Assert.failNotEquals(Assert.java:280)
	at junit.framework.Assert.assertEquals(Assert.java:63)
	at org.apache.harmony.lang.annotation.AllTypesTest.testGetAnnotation_ByDefault(AllTypesTest.java:77)
	at java.lang.reflect.VMReflection.invokeMethod(Native Method)
	at java.lang.reflect.Method.invoke(Unknown Source)
	at junit.framework.TestCase.runTest(TestCase.java:164)
	at junit.framework.TestCase.runBare(TestCase.java:128)
	at junit.framework.TestResult$1.protect(TestResult.java:106)
	at junit.framework.TestResult.runProtected(TestResult.java)
	at junit.framework.TestResult.run(TestResult.java:104)
	at junit.framework.TestCase.run(TestCase.java)
	at junit.framework.TestSuite.runTest(TestSuite.java)
	at junit.framework.TestSuite.run(TestSuite.java:224)
	at org.apache.tools.ant.taskdefs.optional.junit.JUnitTestRunner.run(JUnitTestRunner.java:297)
	at org.apache.tools.ant.taskdefs.optional.junit.JUnitTestRunner.launch(JUnitTestRunner.java:670)
	at org.apache.tools.ant.taskdefs.optional.junit.JUnitTestRunner.main(JUnitTestRunner.java:545)


***********************************************************
Modifications since last successful build:	(3)
            
add cc-drlvm log20061201043541Lbuild.1 12/01/2006 04:35:41drlvm
add cc-drlvm log20061201033403Lbuild.2 12/01/2006 03:34:03drlvm
modified varlax  /harmony/enhanced/drlvm/trunk/vm/vmcore/src/init/vm_properties.cpp 12/01/2006
00:54:21 Fixed HUT regression since r480913.Bad "java.ext.dirs" value was provided.Tested
on SUSE9

Mime
View raw message