harmony-commits mailing list archives: November 2006

Site index · List index
Message list« Previous · 1 · 2 · 3 · 4 · 5 · 6 · 7 · 8 · 9 · 10 · 11 · 12 · 13 · 14 · 15 · 16 · 17 · 18 · 19 · 20 · 21 · 22 · 23 · 24 · 25 · 26 · 27 · 28 · 29 · 30 · 31 · 32 · 33 · 34 · 35 · Next »Thread · Author · Date
telli...@apache.org svn commit: r479762 - /harmony/enhanced/classlib/trunk/make/build-java.xml Mon, 27 Nov, 21:01
ge...@apache.org svn commit: r479764 - in /harmony/enhanced/drlvm/trunk: build/make/ build/make/targets/ src/test/regression/ src/test/regression/H0000/ src/test/regression/H1694/ src/test/regression/H1800/ src/test/regression/H2151/ src/test/regression/H788/ Mon, 27 Nov, 21:05
nom...@intel.com [build-test alert] BUILD FAILED WinXP SP2 1CPU msvc debug: classlib Mon, 27 Nov, 21:07
Geir Magnusson Jr (JIRA) [jira] Resolved: (HARMONY-2283) [drlvm][regression] Regression Testing Infrastructure proposal Mon, 27 Nov, 21:09
Geir Magnusson Jr (JIRA) [jira] Closed: (HARMONY-2283) [drlvm][regression] Regression Testing Infrastructure proposal Mon, 27 Nov, 21:09
Geir Magnusson Jr (JIRA) [jira] Assigned: (HARMONY-1730) README.txt doesn't mention drlvm.properties.example Mon, 27 Nov, 21:58
gshiman...@apache.org svn commit: r479789 - /harmony/enhanced/drlvm/trunk/vm/vmcore/src/util/native_stack.cpp Mon, 27 Nov, 22:33
Gregory Shimansky (JIRA) [jira] Resolved: (HARMONY-2324) [drlvm] Native stack contains wrong frame Mon, 27 Nov, 22:34
nom...@hursley.ibm.com [continuum] BUILD FAILURE: Classlib/linux.ia32 Build/Test Mon, 27 Nov, 23:00
Alexei Fedotov (JIRA) [jira] Created: (HARMONY-2337) [classlib][swing] javax.swing.JCheckBoxMenuItemTest failed intermittently as a part of swing module test run Mon, 27 Nov, 23:22
gshiman...@apache.org svn commit: r479802 - /harmony/enhanced/drlvm/trunk/vm/vmcore/src/util/win/ia32/nt_exception_filter.cpp Mon, 27 Nov, 23:23
Gregory Shimansky (JIRA) [jira] Resolved: (HARMONY-2320) [drlvm] Throw exception outside of HWE handler to avoid deadlocks on Windows XP Mon, 27 Nov, 23:25
nom...@intel.com [build-test alert] BUILD FAILED WinXP SP2 1CPU msvc debug: classlib Mon, 27 Nov, 23:34
Alexei Fedotov (JIRA) [jira] Commented: (HARMONY-2337) [classlib][swing] javax.swing.JCheckBoxMenuItemTest failed intermittently as a part of swing module test run Mon, 27 Nov, 23:35
Alexei Fedotov (JIRA) [jira] Commented: (HARMONY-2337) [classlib][swing] javax.swing.JCheckBoxMenuItemTest failed intermittently as a part of swing module test run Mon, 27 Nov, 23:37
Alexei Fedotov (JIRA) [jira] Created: (HARMONY-2338) [classlib][luni] tests.api.java.net.ServerSocketTest failed intermittently as a part of a whole module test run Mon, 27 Nov, 23:39
Alexei Fedotov (JIRA) [jira] Updated: (HARMONY-2338) [classlib][luni] tests.api.java.net.ServerSocketTest failed intermittently as a part of a whole module test run Mon, 27 Nov, 23:39
Alexei Fedotov (JIRA) [jira] Commented: (HARMONY-2315) [classlib][luni] org.apache.harmony.luni.tests.java.net.InetAddressTest intermittent failure Mon, 27 Nov, 23:49
Alexei Fedotov (JIRA) [jira] Commented: (HARMONY-2338) [classlib][luni] tests.api.java.net.ServerSocketTest failed intermittently as a part of a whole module test run Mon, 27 Nov, 23:53
Alexei Fedotov (JIRA) [jira] Updated: (HARMONY-2338) [classlib][luni] tests.api.java.net.ServerSocketTest failed intermittently Mon, 27 Nov, 23:55
Alexei Fedotov (JIRA) [jira] Created: (HARMONY-2339) [classlib][nio] org.apache.harmony.nio.tests.java.nio.channels.SocketChannelTest failed intermittently as a part of a whole module test run Tue, 28 Nov, 00:03
gshiman...@apache.org svn commit: r479816 - /harmony/enhanced/drlvm/trunk/vm/port/src/misc/win/sysinfo.c Tue, 28 Nov, 00:09
Gregory Shimansky (JIRA) [jira] Closed: (HARMONY-2331) [drlvm][port] unitialized name_buf in port_OS_name_version() Tue, 28 Nov, 00:11
Gregory Shimansky (JIRA) [jira] Commented: (HARMONY-2281) [drlvm][verifier] Remove assignment compatible check for aastore instruction Tue, 28 Nov, 00:15
Alexei Fedotov (JIRA) [jira] Commented: (HARMONY-2070) [drlvm][thread] Unhandled exception in java.exe while java.util.jar module tests execution Tue, 28 Nov, 00:27
Gregory Shimansky (JIRA) [jira] Assigned: (HARMONY-2070) [drlvm][thread] Unhandled exception in java.exe while java.util.jar module tests execution Tue, 28 Nov, 00:54
Gregory Shimansky (JIRA) [jira] Commented: (HARMONY-2070) [drlvm][thread] Unhandled exception in java.exe while java.util.jar module tests execution Tue, 28 Nov, 00:54
weldon washburn (JIRA) [jira] Commented: (HARMONY-1984) GC allocation: overhead of block store is too high Tue, 28 Nov, 01:17
nom...@intel.com [build-test alert] BUILD FAILED WinXP SP2 1CPU msvc debug: classlib Tue, 28 Nov, 01:59
weldon washburn (JIRA) [jira] Assigned: (HARMONY-2269) [drlvm][threading] cleanup of thread_native_fat_monitor.c Tue, 28 Nov, 02:00
Tony Wu (JIRA) [jira] Commented: (HARMONY-2157) [classlib][luni]not able to make a directory whose length is greater than 248 Tue, 28 Nov, 02:49
Vladimir Ivanov (JIRA) [jira] Commented: (HARMONY-2270) [classlib][unit] tests.api.java.io.FileTest@test_mkdir failes on win XP Tue, 28 Nov, 03:47
Leo Li (JIRA) [jira] Commented: (HARMONY-2249) [classlib][luni]ObjectInputStream.readObject throws NullPointerException while readClassDescriptor has been overriden Tue, 28 Nov, 03:57
Stepan Mishura (JIRA) [jira] Assigned: (HARMONY-2329) [classlib][sound] javax.sound.sampled unit tests Tue, 28 Nov, 04:19
ge...@apache.org svn commit: r479889 - /harmony/enhanced/jdktools/trunk/modules/ Tue, 28 Nov, 04:24
ge...@apache.org svn commit: r479891 - /harmony/enhanced/jdktools/trunk/modules/tools/ Tue, 28 Nov, 04:26
nom...@intel.com [build-test alert] BUILD FAILED WinXP SP2 1CPU msvc debug: classlib Tue, 28 Nov, 04:29
ge...@apache.org svn commit: r479893 - in /harmony/enhanced/jdktools/trunk/modules/launcher: ./ src/ src/main/ src/main/native/ Tue, 28 Nov, 04:31
ge...@apache.org svn commit: r479894 - /harmony/enhanced/jdktools/trunk/modules/launcher/src/main/native/launcher/ Tue, 28 Nov, 04:32
ge...@apache.org svn commit: r479901 - in /harmony/enhanced/jdktools/trunk/modules/launcher: build.xml make/ Tue, 28 Nov, 04:52
ge...@apache.org svn commit: r479903 - /harmony/enhanced/jdktools/trunk/modules/tools/build.xml Tue, 28 Nov, 04:57
ge...@apache.org svn commit: r479904 - /harmony/enhanced/jdktools/trunk/modules/launcher/build.xml Tue, 28 Nov, 05:02
ge...@apache.org svn commit: r479905 - /harmony/enhanced/jdktools/trunk/modules/launcher/build.xml Tue, 28 Nov, 05:03
ndbe...@apache.org svn commit: r479912 - /harmony/enhanced/classlib/trunk/support/src/test/java/javax/ Tue, 28 Nov, 05:30
ndbe...@apache.org svn commit: r479913 - in /harmony/enhanced/classlib/trunk/modules/swing/src/test/api/java/common/javax/swing/undo: AbstractUndoableEditTest.java CannotRedoExceptionTest.java CannotUndoExceptionTest.java Tue, 28 Nov, 05:31
Leo Li (JIRA) [jira] Created: (HARMONY-2340) [classlib][luni]ObjectInputStream.readClassDesc throws NullPointerException when it is called outside of readObject() Tue, 28 Nov, 05:38
ndbe...@apache.org svn commit: r479918 - in /harmony/enhanced/classlib/trunk/modules/auth/src/test/java: common/javax/security/auth/x500/ common/org/apache/harmony/auth/login/ common/org/apache/harmony/auth/tests/javax/security/auth/ common/org/apache/harmony/auth/tests/... Tue, 28 Nov, 05:51
Richard Liang (JIRA) [jira] Assigned: (HARMONY-2273) [classlib][luni]serialization test failed on the Map returned by ProcessBuilder.environment() Tue, 28 Nov, 05:51
Richard Liang (JIRA) [jira] Resolved: (HARMONY-2273) [classlib][luni]serialization test failed on the Map returned by ProcessBuilder.environment() Tue, 28 Nov, 05:53
Richard Liang (JIRA) [jira] Closed: (HARMONY-2273) [classlib][luni]serialization test failed on the Map returned by ProcessBuilder.environment() Tue, 28 Nov, 05:55
Pavel Rebriy (JIRA) [jira] Commented: (HARMONY-2281) [drlvm][verifier] Remove assignment compatible check for aastore instruction Tue, 28 Nov, 05:57
ge...@apache.org svn commit: r479920 - in /harmony/enhanced/jdktools/trunk: build.xml make/ make/build-java.xml make/build-native.xml make/build-test.xml make/depends.properties make/depends.xml make/properties.xml modules/launcher/build.xml Tue, 28 Nov, 05:58
Tony Wu (JIRA) [jira] Commented: (HARMONY-2138) [classlib][luni]different behavior when delete file Tue, 28 Nov, 06:12
ndbe...@apache.org svn commit: r479925 - in /harmony/enhanced/classlib/trunk/modules/swing: make/ src/test/api/java/common/javax/swing/text/ Tue, 28 Nov, 06:13
Tony Wu (JIRA) [jira] Commented: (HARMONY-2257) [classlib][luni]should throw ClassCastException when get value with an non String parameter in env Map. Tue, 28 Nov, 06:18
nom...@hursley.ibm.com [continuum] BUILD FAILURE: Classlib/linux.ia32 Build/Test Tue, 28 Nov, 06:18
wjwashb...@apache.org svn commit: r479926 - in /harmony/enhanced/drlvm/trunk: build/make/ build/make/components/vm/ vm/em/src/ vm/gc_cc/javasrc/ vm/gc_cc/javasrc/org/ vm/gc_cc/javasrc/org/apache/ vm/gc_cc/javasrc/org/apache/harmony/ vm/gc_cc/javasrc/org/apache/harmony/drlvm... Tue, 28 Nov, 06:20
nom...@intel.com [build-test alert] BUILD FAILED WinXP SP2 1CPU msvc debug: classlib Tue, 28 Nov, 06:21
weldon washburn (JIRA) [jira] Closed: (HARMONY-2008) [drlvm] Helper inlining framework Tue, 28 Nov, 06:26
Alexey Varlamov (JIRA) [jira] Assigned: (HARMONY-2261) [drlvm][jit][opt] java.awt.ScrollbarTest fails on Jitrino.OPT while passes on Jitrino.JET Tue, 28 Nov, 06:42
Alexey Varlamov (JIRA) [jira] Commented: (HARMONY-2261) [drlvm][jit][opt] java.awt.ScrollbarTest fails on Jitrino.OPT while passes on Jitrino.JET Tue, 28 Nov, 07:10
nom...@intel.com [build-test alert] BUILD FAILED SUSE 9 1CPU gcc debug: classlib_drlvm Tue, 28 Nov, 07:12
nom...@hursley.ibm.com [continuum] BUILD FAILURE: Classlib/linux.ia32 Build/Test Tue, 28 Nov, 07:13
Pavel Ozhdikhin (JIRA) [jira] Updated: (HARMONY-2012) [drlvm][em] value-profling implemenation Tue, 28 Nov, 07:24
nom...@intel.com [build-test alert] BUILD FAILED WinXP SP2 1CPU msvc debug: classlib Tue, 28 Nov, 07:27
nom...@intel.com [build-test alert] BUILD FAILED WinXP SP2 1CPU msvc debug: classlib Tue, 28 Nov, 07:54
lian...@apache.org svn commit: r479938 - in /harmony/enhanced/classlib/trunk: make/ modules/archive/ modules/jndi/ modules/logging/ modules/luni/ modules/nio/ modules/nio_char/ modules/prefs/ modules/sql/ modules/text/ modules/tools/ Tue, 28 Nov, 08:06
nom...@intel.com [build-test alert] BUILD FAILED SUSE 9 1CPU gcc debug: classlib_drlvm Tue, 28 Nov, 08:13
nom...@intel.com [build-test alert] BUILD FAILED WinXP SP2 1CPU msvc debug: classlib Tue, 28 Nov, 08:20
nom...@intel.com [build-test alert] BUILD FAILED SUSE 9 1CPU gcc debug: classlib_drlvm Tue, 28 Nov, 08:36
Leo Li (JIRA) [jira] Updated: (HARMONY-2340) [classlib][luni]ObjectInputStream.readClassDesc throws NullPointerException when it is called outside of readObject() Tue, 28 Nov, 08:39
nom...@intel.com [build-test alert] BUILD FAILED WinXP SP2 1CPU msvc debug: classlib Tue, 28 Nov, 08:47
nom...@intel.com [build-test alert] BUILD FAILED SUSE 9 1CPU gcc debug: classlib_drlvm Tue, 28 Nov, 09:00
nom...@intel.com [build-test alert] BUILD FAILED WinXP SP2 1CPU msvc debug: classlib Tue, 28 Nov, 09:13
nom...@hursley.ibm.com [continuum] BUILD FAILURE: Classlib/linux.ia32 Build/Test Tue, 28 Nov, 09:19
nom...@intel.com [build-test alert] BUILD FAILED SUSE 9 1CPU gcc debug: classlib_drlvm Tue, 28 Nov, 09:23
Alexey A. Ivanov (JIRA) [jira] Updated: (HARMONY-2148) [classlib][awt][test] unit test fails: j.a.KeyboardFocusManagerRTest Tue, 28 Nov, 09:37
Denis Kishenko (JIRA) [jira] Created: (HARMONY-2341) [classlib][swing] JSplitPane behaves incorrectly when no enough space for its component Tue, 28 Nov, 09:39
Alexey Varlamov (JIRA) [jira] Updated: (HARMONY-1912) [drlvm][opt] SIGSEGV during stack dump on Linux Tue, 28 Nov, 09:39
nom...@intel.com [build-test alert] BUILD FAILED WinXP SP2 1CPU msvc debug: classlib Tue, 28 Nov, 09:40
Denis Kishenko (JIRA) [jira] Updated: (HARMONY-2341) [classlib][swing] JSplitPane behaves incorrectly when no enough space for its component Tue, 28 Nov, 09:41
nom...@intel.com [build-test alert] BUILD FAILED SUSE 9 1CPU gcc debug: classlib_drlvm Tue, 28 Nov, 09:46
Denis Kishenko (JIRA) [jira] Updated: (HARMONY-2030) [classlib][swing] JComponent doesn't send 'removed' event Tue, 28 Nov, 09:53
nadi...@apache.org svn commit: r479971 - in /harmony/standard/site: docs/subcomponents/drlvm/getting_started.html xdocs/subcomponents/drlvm/GettingStarted.html xdocs/subcomponents/drlvm/getting_started.xml Tue, 28 Nov, 10:06
nom...@intel.com [build-test alert] BUILD FAILED WinXP SP2 1CPU msvc debug: classlib Tue, 28 Nov, 10:07
Xiao-Feng Li (JIRA) [jira] Updated: (HARMONY-2291) [DRLVM][GC] patch for parallel copying of GCv5 Tue, 28 Nov, 10:08
Eugene S. Ostrovsky (JIRA) [jira] Updated: (HARMONY-2306) [drlvm][jvmti] VM crashes if j.l.Thread is instrumented by JVMTI profiler Tue, 28 Nov, 10:08
nom...@intel.com [build-test alert] BUILD FAILED SUSE 9 1CPU gcc debug: classlib_drlvm Tue, 28 Nov, 10:09
Nadya Morozova (JIRA) [jira] Resolved: (HARMONY-2150) [doc] getting_started.html is outdated Tue, 28 Nov, 10:10
var...@apache.org svn commit: r479972 - in /harmony/enhanced/drlvm/trunk/vm/vmcore/src: stack/stack_dump.cpp util/linux/signals_ia32.cpp Tue, 28 Nov, 10:11
var...@apache.org svn commit: r479973 - /harmony/enhanced/drlvm/trunk/vm/vmcore/src/init/vm_shutdown.cpp Tue, 28 Nov, 10:14
Alexey Varlamov (JIRA) [jira] Closed: (HARMONY-1653) [drlvm] endless loop with "SIGABRT in VM code. Tue, 28 Nov, 10:20
nadi...@apache.org svn commit: r479980 - in /harmony/standard/site: docs/guidelines.html xdocs/guidelines.xml Tue, 28 Nov, 10:24
Nadya Morozova (JIRA) [jira] Resolved: (HARMONY-2174) [doc] Display of Voting section in guidelines.html looks broken in IE Tue, 28 Nov, 10:27
Alexey Varlamov (JIRA) [jira] Commented: (HARMONY-2154) port_CPUs_number returns incorrect information on EM64T in wow mode Tue, 28 Nov, 10:43
Denis Kishenko (JIRA) [jira] Created: (HARMONY-2342) [classlib][swing] Dragging splitter in JSplitPane causes lots of flicker Tue, 28 Nov, 10:45
hinde...@apache.org svn commit: r479986 - in /harmony/enhanced/classlib/trunk: depends/oss/icu4c-3.4-harmony.zip make/build-native.xml modules/text/build.xml modules/text/src/main/native/text/linux/makefile Tue, 28 Nov, 10:45
Tony Wu (JIRA) [jira] Updated: (HARMONY-2270) [classlib][unit] tests.api.java.io.FileTest@test_mkdir failes on win XP Tue, 28 Nov, 10:49
Ilya Okomin (JIRA) [jira] Commented: (HARMONY-1751) Classlib test org.apache.harmony.prefs.tests.java.util.prefs.PreferencesTest.testSystemNodeForPackage() fails Tue, 28 Nov, 10:57
George Timoshenko (JIRA) [jira] Updated: (HARMONY-2259) [drlvm][jit][opt] tests.api.java.lang.reflect.ProxyTest fails on Jitrino.OPT while passes on Jitrino.JET Tue, 28 Nov, 10:59
Message list« Previous · 1 · 2 · 3 · 4 · 5 · 6 · 7 · 8 · 9 · 10 · 11 · 12 · 13 · 14 · 15 · 16 · 17 · 18 · 19 · 20 · 21 · 22 · 23 · 24 · 25 · 26 · 27 · 28 · 29 · 30 · 31 · 32 · 33 · 34 · 35 · Next »Thread · Author · Date
Box list
Oct 20115
Sep 20111
Aug 20112
Jul 201117
Jun 20113
May 20111
Apr 20112
Mar 20114
Feb 20112
Jan 201111
Dec 201022
Nov 201091
Oct 2010178
Sep 2010615
Aug 2010357
Jul 2010447
Jun 2010441
May 2010220
Apr 2010277
Mar 2010439
Feb 2010228
Jan 2010171
Dec 2009150
Nov 2009228
Oct 2009483
Sep 2009299
Aug 2009341
Jul 2009536
Jun 2009485
May 2009361
Apr 2009695
Mar 2009189
Feb 2009188
Jan 2009247
Dec 2008346
Nov 2008231
Oct 2008166
Sep 2008312
Aug 2008252
Jul 2008403
Jun 2008383
May 2008723
Apr 20081465
Mar 20081205
Feb 20081117
Jan 2008934
Dec 20071396
Nov 20071890
Oct 20071733
Sep 20071336
Aug 20071515
Jul 20071864
Jun 20073026
May 20072530
Apr 20072185
Mar 20072652
Feb 20072031
Jan 20072963
Dec 20063629
Nov 20063413
Oct 20063036
Sep 20062851
Aug 20062717
Jul 20062255
Jun 20061714
May 20061325
Apr 20061356
Mar 2006917
Feb 2006190
Jan 2006233
Dec 2005122
Nov 2005258
Oct 2005153
Sep 200522
Aug 20053
Jul 20056
Jun 200512