harmony-commits mailing list archives

Site index · List index
Message view « Date » · « Thread »
Top « Date » · « Thread »
From nom...@intel.com
Subject [build-test alert] BUILD FAILED SUSE 9 1CPU gcc debug: classlib_drlvm
Date Thu, 30 Nov 2006 07:22:13 GMT
BUILD FAILED:
	Ant Error Message:
/export/viv/trunk/cc/projects/classlib/trunk/build.xml:167: The following error occurred while
executing this line: /export/viv/trunk/cc/projects/classlib/trunk/make/build-test.xml:133:
There were test failures.

Date of build:	11/30/2006 11:26:48
Time to build:	114 minutes 34 seconds
Last changed:	11/30/2006 11:25:03
Last log entry:	removed support classes from the exclude lists

***********************************************************
Errors/Warnings:	(8606)
            
Test javax.swing.text.CompositeViewTest FAILED
Test javax.swing.text.ParagraphViewTest FAILED

***********************************************************
Unit Tests: (18918)
        
failure: testGetInsideAllocationOverridden javax.swing.text.CompositeViewTest
failure: testSetLineSpacingNegative javax.swing.text.ParagraphViewTest
failure: testSafeIntSum org.apache.harmony.x.swing.UtilitiesTest
Unit Test Error Details: 
		(3)
                
Test: testGetInsideAllocationOverriddenClass: javax.swing.text.CompositeViewTestjunit.framework.AssertionFailedError
	at javax.swing.text.CompositeViewTest.testGetInsideAllocationOverridden(CompositeViewTest.java:335)
	at java.lang.reflect.VMReflection.invokeMethod(Native Method)
	at javax.swing.BasicSwingTestCase.runBareSuper(BasicSwingTestCase.java)
	at javax.swing.BasicSwingTestCase.runBareImpl(BasicSwingTestCase.java)
	at javax.swing.BasicSwingTestCase$1.run(BasicSwingTestCase.java)
	at java.lang.Thread.run(Unknown Source)

Test: testSetLineSpacingNegativeClass: javax.swing.text.ParagraphViewTestjunit.framework.AssertionFailedError:
expected:<0> but was:<15>
	at javax.swing.text.ParagraphViewTest.testSetLineSpacingNegative(ParagraphViewTest.java:558)
	at java.lang.reflect.VMReflection.invokeMethod(Native Method)
	at javax.swing.BasicSwingTestCase.runBareSuper(BasicSwingTestCase.java)
	at javax.swing.BasicSwingTestCase.runBareImpl(BasicSwingTestCase.java)
	at javax.swing.BasicSwingTestCase$1.run(BasicSwingTestCase.java)
	at java.lang.Thread.run(Unknown Source)

Test: testSafeIntSumClass: org.apache.harmony.x.swing.UtilitiesTestjunit.framework.AssertionFailedError:
expected:<0> but was:<2147483647>
	at org.apache.harmony.x.swing.UtilitiesTest.testSafeIntSum(UtilitiesTest.java:64)
	at java.lang.reflect.VMReflection.invokeMethod(Native Method)
	at javax.swing.BasicSwingTestCase.runBareSuper(BasicSwingTestCase.java)
	at javax.swing.SwingTestCase$1.run(SwingTestCase.java)
	at java.awt.event.InvocationEvent.runAndNotify(InvocationEvent.java:90)
	at java.awt.event.InvocationEvent.dispatch(InvocationEvent.java:78)
	at java.awt.EventQueueCore.dispatchEventImpl(EventQueueCore.java:133)
	at java.awt.EventQueue.dispatchEvent(EventQueue.java:144)
	at java.awt.EventDispatchThread.runModalLoop(EventDispatchThread.java:74)
	at java.awt.EventDispatchThread.run(EventDispatchThread.java:45)


***********************************************************
Modifications since last successful build:	(65)
            
modified mloenko  /harmony/enhanced/classlib/trunk/modules/swing/make/exclude.linux.x86_64.drl
11/30/2006 11:25:03 removed support classes from the exclude lists
modified mloenko  /harmony/enhanced/classlib/trunk/modules/swing/make/exclude.windows.x86_64.ibm
11/30/2006 11:25:03 removed support classes from the exclude lists
modified mloenko  /harmony/enhanced/classlib/trunk/modules/swing/make/exclude.windows.x86.drl
11/30/2006 11:25:03 removed support classes from the exclude lists
modified mloenko  /harmony/enhanced/classlib/trunk/modules/swing/make/exclude.linux.x86_64.ibm
11/30/2006 11:25:03 removed support classes from the exclude lists
modified mloenko  /harmony/enhanced/classlib/trunk/modules/swing/make/exclude.linux.x86.drl
11/30/2006 11:25:03 removed support classes from the exclude lists
modified mloenko  /harmony/enhanced/classlib/trunk/modules/swing/make/exclude.windows.x86.ibm
11/30/2006 11:25:03 removed support classes from the exclude lists
modified mloenko  /harmony/enhanced/classlib/trunk/modules/swing/make/exclude.windows.x86_64.drl
11/30/2006 11:25:03 removed support classes from the exclude lists
modified mloenko  /harmony/enhanced/classlib/trunk/modules/swing/make/exclude.linux.x86.ibm
11/30/2006 11:25:03 removed support classes from the exclude lists
modified ndbeyer  /harmony/enhanced/classlib/trunk/modules/swing/make/exclude.linux.x86_64.drl
11/30/2006 11:13:39 Apply patch from HARMONY-2304: [classlib][swing] j.s.text.CompositeView.getNextVisualPositionFrom
should use another algorithm
added ndbeyer  /harmony/enhanced/classlib/trunk/modules/swing/src/test/api/java/common/javax/swing/text/CompositeView_VisualPositionTest.java
11/30/2006 11:13:39 Apply patch from HARMONY-2304: [classlib][swing] j.s.text.CompositeView.getNextVisualPositionFrom
should use another algorithm
modified ndbeyer  /harmony/enhanced/classlib/trunk/modules/swing/make/exclude.windows.x86_64.ibm
11/30/2006 11:13:39 Apply patch from HARMONY-2304: [classlib][swing] j.s.text.CompositeView.getNextVisualPositionFrom
should use another algorithm
modified ndbeyer  /harmony/enhanced/classlib/trunk/modules/swing/make/exclude.windows.x86.drl
11/30/2006 11:13:39 Apply patch from HARMONY-2304: [classlib][swing] j.s.text.CompositeView.getNextVisualPositionFrom
should use another algorithm
added ndbeyer  /harmony/enhanced/classlib/trunk/modules/swing/src/test/api/java/common/javax/swing/text/View_VisualPosition_PartTest.java
11/30/2006 11:13:39 Apply patch from HARMONY-2304: [classlib][swing] j.s.text.CompositeView.getNextVisualPositionFrom
should use another algorithm
added ndbeyer  /harmony/enhanced/classlib/trunk/modules/swing/src/test/api/java/common/javax/swing/text/VisualPositionHelper.java
11/30/2006 11:13:39 Apply patch from HARMONY-2304: [classlib][swing] j.s.text.CompositeView.getNextVisualPositionFrom
should use another algorithm
modified ndbeyer  /harmony/enhanced/classlib/trunk/modules/swing/make/exclude.linux.x86_64.ibm
11/30/2006 11:13:39 Apply patch from HARMONY-2304: [classlib][swing] j.s.text.CompositeView.getNextVisualPositionFrom
should use another algorithm
modified ndbeyer  /harmony/enhanced/classlib/trunk/modules/swing/make/exclude.linux.x86.drl
11/30/2006 11:13:39 Apply patch from HARMONY-2304: [classlib][swing] j.s.text.CompositeView.getNextVisualPositionFrom
should use another algorithm
modified ndbeyer  /harmony/enhanced/classlib/trunk/modules/swing/make/exclude.windows.x86.ibm
11/30/2006 11:13:39 Apply patch from HARMONY-2304: [classlib][swing] j.s.text.CompositeView.getNextVisualPositionFrom
should use another algorithm
modified ndbeyer  /harmony/enhanced/classlib/trunk/modules/swing/make/exclude.windows.x86_64.drl
11/30/2006 11:13:39 Apply patch from HARMONY-2304: [classlib][swing] j.s.text.CompositeView.getNextVisualPositionFrom
should use another algorithm
modified ndbeyer  /harmony/enhanced/classlib/trunk/modules/swing/make/exclude.linux.x86.ibm
11/30/2006 11:13:39 Apply patch from HARMONY-2304: [classlib][swing] j.s.text.CompositeView.getNextVisualPositionFrom
should use another algorithm
added ndbeyer  /harmony/enhanced/classlib/trunk/modules/swing/src/test/api/java/common/javax/swing/text/View_VisualPositionTest.java
11/30/2006 11:13:39 Apply patch from HARMONY-2304: [classlib][swing] j.s.text.CompositeView.getNextVisualPositionFrom
should use another algorithm
modified ndbeyer  /harmony/enhanced/classlib/trunk/modules/swing/make/exclude.linux.x86_64.drl
11/30/2006 10:44:29 Apply modified patch for HARMONY-2253: [classlib][swing] unit test fails:
j.s.text.ParagraphViewTest
modified ndbeyer  /harmony/enhanced/classlib/trunk/modules/swing/make/exclude.windows.x86_64.ibm
11/30/2006 10:44:29 Apply modified patch for HARMONY-2253: [classlib][swing] unit test fails:
j.s.text.ParagraphViewTest
modified ndbeyer  /harmony/enhanced/classlib/trunk/modules/swing/src/main/java/common/org/apache/harmony/x/swing/Utilities.java
11/30/2006 10:44:29 Apply modified patch for HARMONY-2253: [classlib][swing] unit test fails:
j.s.text.ParagraphViewTest
modified ndbeyer  /harmony/enhanced/classlib/trunk/modules/swing/make/exclude.windows.x86.drl
11/30/2006 10:44:29 Apply modified patch for HARMONY-2253: [classlib][swing] unit test fails:
j.s.text.ParagraphViewTest
modified ndbeyer  /harmony/enhanced/classlib/trunk/modules/swing/src/test/api/java/common/org/apache/harmony/x/swing/UtilitiesTest.java
11/30/2006 10:44:29 Apply modified patch for HARMONY-2253: [classlib][swing] unit test fails:
j.s.text.ParagraphViewTest
modified ndbeyer  /harmony/enhanced/classlib/trunk/modules/swing/make/exclude.linux.x86_64.ibm
11/30/2006 10:44:29 Apply modified patch for HARMONY-2253: [classlib][swing] unit test fails:
j.s.text.ParagraphViewTest
modified ndbeyer  /harmony/enhanced/classlib/trunk/modules/swing/make/exclude.linux.x86.drl
11/30/2006 10:44:29 Apply modified patch for HARMONY-2253: [classlib][swing] unit test fails:
j.s.text.ParagraphViewTest
modified ndbeyer  /harmony/enhanced/classlib/trunk/modules/swing/make/exclude.windows.x86.ibm
11/30/2006 10:44:29 Apply modified patch for HARMONY-2253: [classlib][swing] unit test fails:
j.s.text.ParagraphViewTest
modified ndbeyer  /harmony/enhanced/classlib/trunk/modules/swing/make/exclude.windows.x86_64.drl
11/30/2006 10:44:29 Apply modified patch for HARMONY-2253: [classlib][swing] unit test fails:
j.s.text.ParagraphViewTest
modified ndbeyer  /harmony/enhanced/classlib/trunk/modules/swing/src/test/api/java/common/javax/swing/text/ParagraphViewTest.java
11/30/2006 10:44:29 Apply modified patch for HARMONY-2253: [classlib][swing] unit test fails:
j.s.text.ParagraphViewTest
modified ndbeyer  /harmony/enhanced/classlib/trunk/modules/swing/make/exclude.linux.x86.ibm
11/30/2006 10:44:29 Apply modified patch for HARMONY-2253: [classlib][swing] unit test fails:
j.s.text.ParagraphViewTest
modified mloenko  /harmony/enhanced/classlib/trunk/modules/awt/make/exclude.windows.x86_64.drl
11/30/2006 10:42:34 changed mask to select real tests and removed support classes from the
exclude lists
modified mloenko  /harmony/enhanced/classlib/trunk/modules/awt/build.xml 11/30/2006 10:42:34
changed mask to select real tests and removed support classes from the exclude lists
modified mloenko  /harmony/enhanced/classlib/trunk/modules/awt/make/exclude.linux.x86.ibm
11/30/2006 10:42:34 changed mask to select real tests and removed support classes from the
exclude lists
modified mloenko  /harmony/enhanced/classlib/trunk/modules/awt/make/exclude.linux.x86_64.drl
11/30/2006 10:42:34 changed mask to select real tests and removed support classes from the
exclude lists
modified mloenko  /harmony/enhanced/classlib/trunk/modules/awt/make/exclude.windows.x86_64.ibm
11/30/2006 10:42:34 changed mask to select real tests and removed support classes from the
exclude lists
modified mloenko  /harmony/enhanced/classlib/trunk/modules/awt/make/exclude.windows.x86.drl
11/30/2006 10:42:34 changed mask to select real tests and removed support classes from the
exclude lists
modified mloenko  /harmony/enhanced/classlib/trunk/modules/awt/make/exclude.linux.x86_64.ibm
11/30/2006 10:42:34 changed mask to select real tests and removed support classes from the
exclude lists
modified mloenko  /harmony/enhanced/classlib/trunk/modules/awt/make/exclude.linux.x86.drl
11/30/2006 10:42:34 changed mask to select real tests and removed support classes from the
exclude lists
modified ndbeyer  /harmony/enhanced/classlib/trunk/modules/swing/src/main/java/common/javax/swing/text/CompositeView.java
11/30/2006 10:15:56 Apply patch for HARMONY-2189: [classlib][swing] j.s.text.CompositeView.getInsideAllocation
doesn't call inset getters
modified ndbeyer  /harmony/enhanced/classlib/trunk/modules/swing/src/test/api/java/common/javax/swing/text/CompositeViewTest.java
11/30/2006 10:15:56 Apply patch for HARMONY-2189: [classlib][swing] j.s.text.CompositeView.getInsideAllocation
doesn't call inset getters
modified ndbeyer  /harmony/enhanced/classlib/trunk/modules/swing/make/exclude.linux.x86_64.drl
11/30/2006 10:03:17 Set svn:eol-style = native
modified ndbeyer  /harmony/enhanced/classlib/trunk/modules/swing/make/exclude.windows.x86_64.ibm
11/30/2006 10:03:17 Set svn:eol-style = native
modified ndbeyer  /harmony/enhanced/classlib/trunk/modules/swing/make/exclude.windows.x86.drl
11/30/2006 10:03:17 Set svn:eol-style = native
modified ndbeyer  /harmony/enhanced/classlib/trunk/modules/swing/make/exclude.linux.x86_64.ibm
11/30/2006 10:03:17 Set svn:eol-style = native
modified ndbeyer  /harmony/enhanced/classlib/trunk/modules/swing/make/exclude.linux.x86.drl
11/30/2006 10:03:17 Set svn:eol-style = native
modified ndbeyer  /harmony/enhanced/classlib/trunk/modules/swing/make/exclude.windows.x86.ibm
11/30/2006 10:03:17 Set svn:eol-style = native
modified ndbeyer  /harmony/enhanced/classlib/trunk/modules/swing/make/exclude.windows.x86_64.drl
11/30/2006 10:03:17 Set svn:eol-style = native
modified ndbeyer  /harmony/enhanced/classlib/trunk/modules/swing/make/exclude.linux.x86.ibm
11/30/2006 10:03:17 Set svn:eol-style = native
modified ndbeyer  /harmony/enhanced/classlib/trunk/modules/swing/src/test/api/java/common/javax/swing/plaf/basic/BasicLookAndFeelTest.java
11/30/2006 09:59:11 Apply patch for HARMONY-2346: [classlib][swing] Migration to L&F 5.0
modified ndbeyer  /harmony/enhanced/classlib/trunk/modules/swing/make/exclude.linux.x86_64.drl
11/30/2006 09:59:11 Apply patch for HARMONY-2346: [classlib][swing] Migration to L&F 5.0
modified ndbeyer  /harmony/enhanced/classlib/trunk/modules/swing/make/exclude.windows.x86_64.ibm
11/30/2006 09:59:11 Apply patch for HARMONY-2346: [classlib][swing] Migration to L&F 5.0
modified ndbeyer  /harmony/enhanced/classlib/trunk/modules/swing/src/test/api/java/common/javax/swing/plaf/metal/MetalLookAndFeelTest.java
11/30/2006 09:59:11 Apply patch for HARMONY-2346: [classlib][swing] Migration to L&F 5.0
modified ndbeyer  /harmony/enhanced/classlib/trunk/modules/swing/make/exclude.windows.x86.drl
11/30/2006 09:59:11 Apply patch for HARMONY-2346: [classlib][swing] Migration to L&F 5.0
modified ndbeyer  /harmony/enhanced/classlib/trunk/modules/swing/make/exclude.linux.x86_64.ibm
11/30/2006 09:59:11 Apply patch for HARMONY-2346: [classlib][swing] Migration to L&F 5.0
modified ndbeyer  /harmony/enhanced/classlib/trunk/modules/swing/make/exclude.linux.x86.drl
11/30/2006 09:59:11 Apply patch for HARMONY-2346: [classlib][swing] Migration to L&F 5.0
modified ndbeyer  /harmony/enhanced/classlib/trunk/modules/swing/make/exclude.windows.x86.ibm
11/30/2006 09:59:11 Apply patch for HARMONY-2346: [classlib][swing] Migration to L&F 5.0
modified ndbeyer  /harmony/enhanced/classlib/trunk/modules/swing/src/test/api/java/common/javax/swing/table/DefaultTableColumnModelTest.java
11/30/2006 09:59:11 Apply patch for HARMONY-2346: [classlib][swing] Migration to L&F 5.0
modified ndbeyer  /harmony/enhanced/classlib/trunk/modules/swing/make/exclude.windows.x86_64.drl
11/30/2006 09:59:11 Apply patch for HARMONY-2346: [classlib][swing] Migration to L&F 5.0
modified ndbeyer  /harmony/enhanced/classlib/trunk/modules/swing/src/main/java/common/javax/swing/UIManager.java
11/30/2006 09:59:11 Apply patch for HARMONY-2346: [classlib][swing] Migration to L&F 5.0
modified ndbeyer  /harmony/enhanced/classlib/trunk/modules/swing/make/exclude.linux.x86.ibm
11/30/2006 09:59:11 Apply patch for HARMONY-2346: [classlib][swing] Migration to L&F 5.0
modified ndbeyer  /harmony/enhanced/classlib/trunk/modules/swing/src/test/api/java/common/javax/swing/DefaultListSelectionModelTest.java
11/30/2006 09:59:11 Apply patch for HARMONY-2346: [classlib][swing] Migration to L&F 5.0
modified ndbeyer  /harmony/enhanced/classlib/trunk/modules/archive/src/main/java/java/util/zip/Deflater.java
11/30/2006 09:40:18 Add missing synchronized element (per FindBugs report); clean up code
a bit
modified liangyx  /harmony/enhanced/classlib/trunk/modules/luni/src/main/java/java/io/ObjectInputStream.java
11/30/2006 08:47:39 Apply patch for HARMONY-2340 ([classlib][luni]ObjectInputStream.readClassDesc
throws NullPointerException when it is called outside of readObject())
modified liangyx  /harmony/enhanced/classlib/trunk/modules/luni/src/test/java/tests/api/java/io/ObjectInputStreamTest.java
11/30/2006 08:47:39 Apply patch for HARMONY-2340 ([classlib][luni]ObjectInputStream.readClassDesc
throws NullPointerException when it is called outside of readObject())

Mime
View raw message