harmony-commits mailing list archives

Site index · List index
Message view « Date » · « Thread »
Top « Date » · « Thread »
From nom...@intel.com
Subject [build-test alert] BUILD FAILED SUSE 9 1CPU gcc debug: classlib_drlvm
Date Wed, 29 Nov 2006 10:22:21 GMT
BUILD FAILED:
	Ant Error Message:
/export/viv/trunk/cc/projects/classlib/trunk/build.xml:167: The following error occurred while
executing this line: /export/viv/trunk/cc/projects/classlib/trunk/make/build-test.xml:132:
There were test errors.

Date of build:	11/29/2006 14:28:08
Time to build:	113 minutes 31 seconds
Last changed:	11/29/2006 14:17:02
Last log entry:	drlvm

***********************************************************
Errors/Warnings:	(8610)
            
Test org.apache.harmony.sound.tests.javax.sound.sampled.AudioFileFormatTest FAILED
Test org.apache.harmony.sound.tests.javax.sound.sampled.AudioFormatTest FAILED
Test org.apache.harmony.sound.tests.javax.sound.sampled.AudioInputStreamTest FAILED
Test org.apache.harmony.sound.tests.javax.sound.sampled.BooleanControlTest FAILED
Test org.apache.harmony.sound.tests.javax.sound.sampled.DataLineInfoTest FAILED
Test org.apache.harmony.sound.tests.javax.sound.sampled.EnumControlTest FAILED

***********************************************************
Unit Tests: (18767)
        
error: testAudioFileFormat org.apache.harmony.sound.tests.javax.sound.sampled.AudioFileFormatTest
error: testMatches org.apache.harmony.sound.tests.javax.sound.sampled.DataLineInfoTest
error: testMatches org.apache.harmony.sound.tests.javax.sound.sampled.LineInfoTest
failure: testAudioFormat org.apache.harmony.sound.tests.javax.sound.sampled.AudioFormatTest
failure: testMatches org.apache.harmony.sound.tests.javax.sound.sampled.AudioFormatTest
failure: testAudioInputStream org.apache.harmony.sound.tests.javax.sound.sampled.AudioInputStreamTest
failure: testEnumControl org.apache.harmony.sound.tests.javax.sound.sampled.BooleanControlTest
failure: testDataLineInfo org.apache.harmony.sound.tests.javax.sound.sampled.DataLineInfoTest
failure: testEnumControl org.apache.harmony.sound.tests.javax.sound.sampled.EnumControlTest
Unit Test Error Details: 
		(9)
                
Test: testAudioFileFormatClass: org.apache.harmony.sound.tests.javax.sound.sampled.AudioFileFormatTestjava.lang.NoSuchMethodError:
javax/sound/sampled/AudioFileFormat.getProperty(Ljava/lang/String;)Ljava/lang/Object; while
resolving constant pool entry at index 72 in class org/apache/harmony/sound/tests/javax/sound/sampled/AudioFileFormatTest
	at java.lang.reflect.VMReflection.invokeMethod(Native Method)

Test: testMatchesClass: org.apache.harmony.sound.tests.javax.sound.sampled.DataLineInfoTestorg.apache.harmony.luni.util.NotImplementedException:
not yet implemented
	at javax.sound.sampled.Line$Info.matches(Line.java:36)
	at javax.sound.sampled.DataLine$Info.matches(DataLine.java)
	at org.apache.harmony.sound.tests.javax.sound.sampled.DataLineInfoTest.testMatches(DataLineInfoTest.java:73)
	at java.lang.reflect.VMReflection.invokeMethod(Native Method)

Test: testMatchesClass: org.apache.harmony.sound.tests.javax.sound.sampled.LineInfoTestorg.apache.harmony.luni.util.NotImplementedException:
not yet implemented
	at javax.sound.sampled.Line$Info.matches(Line.java:36)
	at org.apache.harmony.sound.tests.javax.sound.sampled.LineInfoTest.testMatches(LineInfoTest.java:29)
	at java.lang.reflect.VMReflection.invokeMethod(Native Method)

Test: testAudioFormatClass: org.apache.harmony.sound.tests.javax.sound.sampled.AudioFormatTestjunit.framework.AssertionFailedError:
expected:<4> but was:<1>
	at org.apache.harmony.sound.tests.javax.sound.sampled.AudioFormatTest.testAudioFormat(AudioFormatTest.java:67)
	at java.lang.reflect.VMReflection.invokeMethod(Native Method)

Test: testMatchesClass: org.apache.harmony.sound.tests.javax.sound.sampled.AudioFormatTestjunit.framework.AssertionFailedError
	at org.apache.harmony.sound.tests.javax.sound.sampled.AudioFormatTest.testMatches(AudioFormatTest.java:135)
	at java.lang.reflect.VMReflection.invokeMethod(Native Method)

Test: testAudioInputStreamClass: org.apache.harmony.sound.tests.javax.sound.sampled.AudioInputStreamTestjunit.framework.AssertionFailedError:
expected:<40> but was:<1001>
	at org.apache.harmony.sound.tests.javax.sound.sampled.AudioInputStreamTest.testAudioInputStream(AudioInputStreamTest.java:39)
	at java.lang.reflect.VMReflection.invokeMethod(Native Method)

Test: testEnumControlClass: org.apache.harmony.sound.tests.javax.sound.sampled.BooleanControlTestjunit.framework.ComparisonFailure:
expected:<...OFF> but was:<...false>
	at org.apache.harmony.sound.tests.javax.sound.sampled.BooleanControlTest.testEnumControl(BooleanControlTest.java:36)
	at java.lang.reflect.VMReflection.invokeMethod(Native Method)

Test: testDataLineInfoClass: org.apache.harmony.sound.tests.javax.sound.sampled.DataLineInfoTestjunit.framework.ComparisonFailure:
expected:<...format ALAW 1.0 Hz, 8 bit, 3 channels, 4 bytes/frame, 5.0 frames/second, >
but was:<...ALAW 1.0 Hz, 8 bit, 3 channels, 4 bytes/frame, 5.0 frames/second>
	at org.apache.harmony.sound.tests.javax.sound.sampled.DataLineInfoTest.testDataLineInfo(DataLineInfoTest.java:53)
	at java.lang.reflect.VMReflection.invokeMethod(Native Method)

Test: testEnumControlClass: org.apache.harmony.sound.tests.javax.sound.sampled.EnumControlTestjunit.framework.ComparisonFailure:
expected:<...everb...> but was:<...EVERB...>
	at org.apache.harmony.sound.tests.javax.sound.sampled.EnumControlTest.testEnumControl(EnumControlTest.java:35)
	at java.lang.reflect.VMReflection.invokeMethod(Native Method)


***********************************************************
Modifications since last successful build:	(17)
            
add cc-drlvm log20061129141702Lbuild.2 11/29/2006 14:17:02drlvm
modified mloenko  /harmony/enhanced/classlib/trunk/modules/swing/src/test/api/java/common/org/apache/harmony/swing/tests/javax/swing/text/parser/ContentModelSemanticTest.java
11/29/2006 13:45:35 follow JUnit conventions to find failure cause
modified smishura  /harmony/enhanced/classlib/trunk/modules/sound/src/main/java/javax/sound/sampled/Line.java
11/29/2006 12:07:15 Remove NotImplementedException for Line.Info.matches(Line.Info info)
modified smishura  /harmony/enhanced/classlib/trunk/modules/sound/src/main/java/javax/sound/sampled/AudioInputStream.java
11/29/2006 11:49:05 Apply patch for HARMONY-2329 ([classlib][sound] javax.sound.sampled unit
tests)
added smishura  /harmony/enhanced/classlib/trunk/modules/sound/src/test/java/org/apache/harmony/sound/tests/javax/sound/sampled/LineInfoTest.java
11/29/2006 11:49:05 Apply patch for HARMONY-2329 ([classlib][sound] javax.sound.sampled unit
tests)
added smishura  /harmony/enhanced/classlib/trunk/modules/sound/src/test/java/org/apache/harmony/sound/tests/javax/sound/sampled/EnumControlTest.java
11/29/2006 11:49:05 Apply patch for HARMONY-2329 ([classlib][sound] javax.sound.sampled unit
tests)
modified smishura  /harmony/enhanced/classlib/trunk/modules/sound/src/main/java/javax/sound/sampled/BooleanControl.java
11/29/2006 11:49:05 Apply patch for HARMONY-2329 ([classlib][sound] javax.sound.sampled unit
tests)
modified smishura  /harmony/enhanced/classlib/trunk/modules/sound/src/main/java/javax/sound/sampled/DataLine.java
11/29/2006 11:49:05 Apply patch for HARMONY-2329 ([classlib][sound] javax.sound.sampled unit
tests)
added smishura  /harmony/enhanced/classlib/trunk/modules/sound/src/test/java/org/apache/harmony/sound/tests/javax/sound/sampled/AudioFileFormatTest.java
11/29/2006 11:49:05 Apply patch for HARMONY-2329 ([classlib][sound] javax.sound.sampled unit
tests)
added smishura  /harmony/enhanced/classlib/trunk/modules/sound/src/test/java/org/apache/harmony/sound/tests/javax/sound/sampled/AudioFormatTest.java
11/29/2006 11:49:05 Apply patch for HARMONY-2329 ([classlib][sound] javax.sound.sampled unit
tests)
modified smishura  /harmony/enhanced/classlib/trunk/modules/sound/src/main/java/javax/sound/sampled/EnumControl.java
11/29/2006 11:49:05 Apply patch for HARMONY-2329 ([classlib][sound] javax.sound.sampled unit
tests)
modified smishura  /harmony/enhanced/classlib/trunk/modules/sound/src/main/java/javax/sound/sampled/Line.java
11/29/2006 11:49:05 Apply patch for HARMONY-2329 ([classlib][sound] javax.sound.sampled unit
tests)
added smishura  /harmony/enhanced/classlib/trunk/modules/sound/src/test/java/org/apache/harmony/sound/tests/javax/sound/sampled/AudioInputStreamTest.java
11/29/2006 11:49:05 Apply patch for HARMONY-2329 ([classlib][sound] javax.sound.sampled unit
tests)
added smishura  /harmony/enhanced/classlib/trunk/modules/sound/src/test/java/org/apache/harmony/sound/tests/javax/sound/sampled/DataLineInfoTest.java
11/29/2006 11:49:05 Apply patch for HARMONY-2329 ([classlib][sound] javax.sound.sampled unit
tests)
modified smishura  /harmony/enhanced/classlib/trunk/modules/sound/src/main/java/javax/sound/sampled/AudioFileFormat.java
11/29/2006 11:49:05 Apply patch for HARMONY-2329 ([classlib][sound] javax.sound.sampled unit
tests)
modified smishura  /harmony/enhanced/classlib/trunk/modules/sound/src/main/java/javax/sound/sampled/AudioFormat.java
11/29/2006 11:49:05 Apply patch for HARMONY-2329 ([classlib][sound] javax.sound.sampled unit
tests)
added smishura  /harmony/enhanced/classlib/trunk/modules/sound/src/test/java/org/apache/harmony/sound/tests/javax/sound/sampled/BooleanControlTest.java
11/29/2006 11:49:05 Apply patch for HARMONY-2329 ([classlib][sound] javax.sound.sampled unit
tests)

Mime
View raw message