harmony-commits mailing list archives

Site index · List index
Message view « Date » · « Thread »
Top « Date » · « Thread »
From nom...@hursley.ibm.com
Subject [continuum] BUILD FAILURE: Classlib/linux.ia32 Build/Test
Date Tue, 28 Nov 2006 06:18:43 GMT
Online report : http://people.apache.org/~hindessm/continuum/classlib/linux.ia32/2006/11/28/20061128-061843.failure.log.gz
Build statistics:
  State: Failed
  Previous State: Error
  Started at: Tue, 28 Nov 2006 06:07:34 +0000
  Finished at: Tue, 28 Nov 2006 06:18:41 +0000
  Total time: 11m 7s
  Build Trigger: Schedule
  Exit code: 1
  Building machine hostname: hy2
  Operating system : Linux(unknown)
  Java version : 1.5.0_06(Sun Microsystems Inc.)

Changes
                            classlib/modules/swing/src/test/api/java/common/javax/swing/undo/AbstractUndoableEditTest.java
            classlib/modules/swing/src/test/api/java/common/javax/swing/undo/CannotUndoExceptionTest.java
            classlib/modules/swing/src/test/api/java/common/javax/swing/undo/CannotRedoExceptionTest.java
            classlib/modules/auth/src/test/java/linux/org/apache/harmony/auth/module/UnixLoginModuleTest.java
            classlib/modules/auth/src/test/java/common/org/apache/harmony/auth/tests/javax/security/auth/RefreshFailedExceptionTest.java
            classlib/modules/auth/src/test/java/common/org/apache/harmony/auth/tests/javax/security/auth/SubjectDomainCombinerTest.java
            classlib/modules/auth/src/test/java/common/org/apache/harmony/auth/tests/javax/security/auth/login/CredentialNotFoundExceptionTest.java
            classlib/modules/auth/src/test/java/common/org/apache/harmony/auth/tests/javax/security/auth/login/LoginExceptionTest.java
            classlib/modules/auth/src/test/java/common/org/apache/harmony/auth/tests/javax/security/auth/login/AccountNotFoundExceptionTest.java
            classlib/modules/auth/src/test/java/common/org/apache/harmony/auth/tests/javax/security/auth/login/CredentialExceptionTest.java
            classlib/modules/auth/src/test/java/common/org/apache/harmony/auth/tests/javax/security/auth/login/CredentialExpiredExceptionTest.java
            classlib/modules/auth/src/test/java/common/org/apache/harmony/auth/tests/javax/security/auth/login/AccountExceptionTest.java
            classlib/modules/auth/src/test/java/common/org/apache/harmony/auth/tests/javax/security/auth/login/AccountExpiredExceptionTest.java
            classlib/modules/auth/src/test/java/common/org/apache/harmony/auth/tests/javax/security/auth/login/FailedLoginExceptionTest.java
            classlib/modules/auth/src/test/java/common/org/apache/harmony/auth/tests/javax/security/auth/login/AccountLockedExceptionTest.java
            classlib/modules/auth/src/test/java/common/org/apache/harmony/auth/tests/javax/security/auth/login/LoginContext1Test.java
            classlib/modules/auth/src/test/java/common/org/apache/harmony/auth/tests/javax/security/auth/callback/PasswordCallbackTest.java
            classlib/modules/auth/src/test/java/common/org/apache/harmony/auth/tests/javax/security/auth/callback/LanguageCallbackTest.java
            classlib/modules/auth/src/test/java/common/org/apache/harmony/auth/tests/javax/security/auth/callback/TextInputCallbackTest.java
            classlib/modules/auth/src/test/java/common/org/apache/harmony/auth/tests/javax/security/auth/callback/TextOutputCallbackTest.java
            classlib/modules/auth/src/test/java/common/org/apache/harmony/auth/tests/javax/security/auth/callback/UnsupportedCallbackExceptionTest.java
            classlib/modules/auth/src/test/java/common/org/apache/harmony/auth/tests/javax/security/auth/callback/ConfirmationCallbackTest.java
            classlib/modules/auth/src/test/java/common/org/apache/harmony/auth/tests/javax/security/auth/callback/ChoiceCallbackTest.java
            classlib/modules/auth/src/test/java/common/org/apache/harmony/auth/tests/javax/security/auth/callback/NameCallbackTest.java
            classlib/modules/auth/src/test/java/common/org/apache/harmony/auth/tests/javax/security/auth/kerberos/KerberosKeyTest.java
            classlib/modules/auth/src/test/java/common/org/apache/harmony/auth/tests/javax/security/auth/kerberos/KerberosPrincipalTest.java
            classlib/modules/auth/src/test/java/common/org/apache/harmony/auth/tests/javax/security/auth/DestroyFailedExceptionTest.java
            classlib/modules/auth/src/test/java/common/org/apache/harmony/auth/tests/javax/security/sasl/SaslExceptionTest.java
            classlib/modules/auth/src/test/java/common/org/apache/harmony/auth/tests/javax/security/sasl/Sasl3Test.java
            classlib/modules/auth/src/test/java/common/org/apache/harmony/auth/tests/javax/security/sasl/Sasl4Test.java
            classlib/modules/auth/src/test/java/common/org/apache/harmony/auth/tests/javax/security/sasl/AuthorizeCallbackTest.java
            classlib/modules/auth/src/test/java/common/org/apache/harmony/auth/tests/javax/security/sasl/RealmChoiceCallbackTest.java
            classlib/modules/auth/src/test/java/common/org/apache/harmony/auth/tests/javax/security/sasl/RealmCallbackTest.java
            classlib/modules/auth/src/test/java/common/org/apache/harmony/auth/tests/javax/security/sasl/serialization/SaslExceptionTest.java
            classlib/modules/auth/src/test/java/common/org/apache/harmony/auth/tests/javax/security/sasl/serialization/AuthorizeCallbackTest.java
            classlib/modules/auth/src/test/java/common/org/apache/harmony/auth/tests/javax/security/sasl/serialization/RealmChoiceCallbackTest.java
            classlib/modules/auth/src/test/java/common/org/apache/harmony/auth/tests/javax/security/sasl/serialization/RealmCallbackTest.java
            classlib/modules/auth/src/test/java/common/org/apache/harmony/auth/tests/javax/security/sasl/serialization/AuthenticationExceptionTest.java
            classlib/modules/auth/src/test/java/common/org/apache/harmony/auth/tests/javax/security/sasl/AuthenticationExceptionTest.java
            classlib/modules/auth/src/test/java/common/org/apache/harmony/auth/login/DefaultConfigurationTest.java
            classlib/modules/auth/src/test/java/common/org/ietf/jgss/ChannelBindingTest.java
            classlib/modules/auth/src/test/java/common/org/ietf/jgss/MessagePropTest.java
            classlib/modules/auth/src/test/java/common/org/ietf/jgss/GSSManagerTest.java
            classlib/modules/auth/src/test/java/common/org/ietf/jgss/GSSExceptionTest.java
            classlib/modules/auth/src/test/java/common/org/ietf/jgss/OidTest.java
            classlib/modules/auth/src/test/java/common/org/ietf/jgss/GSSNameTest.java
            classlib/modules/auth/src/test/java/common/javax/security/auth/x500/X500PrivateCredentialTest.java
            classlib/modules/auth/src/test/java/common/javax/security/auth/x500/X500PrincipalTest.java
        
****************************************************************************
Output:
****************************************************************************
Buildfile: build.xml

build:
   [delete] Deleting directory /home/hybld/continuum-working-directory/6/classlib/deploy
     [echo] Classlib revision is 479921
     [echo] Post process: true
     [echo] JAPI: true
     [echo] Building with reference jdk/javac
     [exec] Buildfile: build.xml

     [exec] -init-hdk-for-clean:
     [exec]     [mkdir] Created dir: /home/hybld/continuum-working-directory/6/classlib/deploy/build/ant
     [exec]      [copy] Copying 1 file to /home/hybld/continuum-working-directory/6/classlib/deploy/build/ant

     [exec] clean-java:

     [exec] -modules-clean-bin:

     [exec] clean:
     [exec]    [delete] Deleting 30 files from /home/hybld/continuum-working-directory/6/classlib/build/classes
     [exec]    [delete] Deleting 15 files from /home/hybld/continuum-working-directory/6/classlib/modules/accessibility/bin/test

     [exec] clean:
     [exec]    [delete] Deleting 13 files from /home/hybld/continuum-working-directory/6/classlib/build/classes

     [exec] clean:
     [exec]    [delete] Deleting 35 files from /home/hybld/continuum-working-directory/6/classlib/build/classes
     [exec]    [delete] Deleting 1 files from /home/hybld/continuum-working-directory/6/classlib/modules/applet/bin/test

     [exec] clean:
     [exec]    [delete] Deleting 79 files from /home/hybld/continuum-working-directory/6/classlib/build/classes
     [exec]    [delete] Deleting 47 files from /home/hybld/continuum-working-directory/6/classlib/modules/archive/bin/test

     [exec] clean-native-includes:
     [exec]    [delete] /home/hybld/continuum-working-directory/6/classlib/deploy/include not found.

     [exec] clean:
     [exec]    [delete] Deleting 112 files from /home/hybld/continuum-working-directory/6/classlib/build/classes
     [exec]    [delete] Deleting 224 files from /home/hybld/continuum-working-directory/6/classlib/modules/auth/bin/test

     [exec] clean:
     [exec]    [delete] Deleting 898 files from /home/hybld/continuum-working-directory/6/classlib/build/classes
     [exec]    [delete] Deleting 575 files from /home/hybld/continuum-working-directory/6/classlib/modules/awt/bin/test

     [exec] clean:
     [exec]    [delete] Deleting 107 files from /home/hybld/continuum-working-directory/6/classlib/build/classes
     [exec]    [delete] Deleting 236 files from /home/hybld/continuum-working-directory/6/classlib/modules/beans/bin/test

     [exec] clean:
     [exec]    [delete] Deleting 125 files from /home/hybld/continuum-working-directory/6/classlib/build/classes
     [exec]    [delete] /home/hybld/continuum-working-directory/6/classlib/modules/concurrent/bin/test not found.

     [exec] clean:
     [exec]    [delete] Deleting 49 files from /home/hybld/continuum-working-directory/6/classlib/build/classes
     [exec]    [delete] Deleting 91 files from /home/hybld/continuum-working-directory/6/classlib/modules/crypto/bin/test

     [exec] clean:
     [exec]    [delete] Deleting 87 files from /home/hybld/continuum-working-directory/6/classlib/build/classes

     [exec] clean:
     [exec]    [delete] Deleting 9 files from /home/hybld/continuum-working-directory/6/classlib/build/classes
     [exec]    [delete] Deleting 20 files from /home/hybld/continuum-working-directory/6/classlib/modules/instrument/bin/test

     [exec] clean:
     [exec]    [delete] Deleting 154 files from /home/hybld/continuum-working-directory/6/classlib/build/classes
     [exec]    [delete] Deleting 163 files from /home/hybld/continuum-working-directory/6/classlib/modules/jndi/bin/test

...

     [exec]     [javac] ----------
     [exec]     [javac] 3. WARNING in /home/hybld/continuum-working-directory/6/classlib/modules/tools/src/main/java/org/apache/harmony/tools/keytool/CertChainVerifier.java
     [exec]     [javac]  (at line 477)
     [exec]     [javac] 	selfSignedTAs.add(ta);
     [exec]     [javac] 	^^^^^^^^^^^^^^^^^^^^^
     [exec]     [javac] Type safety: The method add(Object) belongs to the raw type Set. References to generic type Set<E> should be parameterized
     [exec]     [javac] ----------
     [exec]     [javac] 4. WARNING in /home/hybld/continuum-working-directory/6/classlib/modules/tools/src/main/java/org/apache/harmony/tools/keytool/CertChainVerifier.java
     [exec]     [javac]  (at line 478)
     [exec]     [javac] 	selfSignedTAsCerts.add(trCert);

...

     [exec]     [javac] 	^^^^^^^^^^^^^^^^^^^^^^^^^^^^^^
     [exec]     [javac] Type safety: The method add(Object) belongs to the raw type Collection. References to generic type Collection<E> should be parameterized
     [exec]     [javac] ----------
     [exec]     [javac] 5. WARNING in /home/hybld/continuum-working-directory/6/classlib/modules/tools/src/main/java/org/apache/harmony/tools/keytool/CertChainVerifier.java
     [exec]     [javac]  (at line 481)
     [exec]     [javac] 	trustedCerts.add(trCert);

...

     [exec]     [javac] 	^^^^^^^^^^^^^^^^^^^^^^^^
     [exec]     [javac] Type safety: The method add(Object) belongs to the raw type Collection. References to generic type Collection<E> should be parameterized
     [exec]     [javac] ----------
     [exec]     [javac] 6. WARNING in /home/hybld/continuum-working-directory/6/classlib/modules/tools/src/main/java/org/apache/harmony/tools/keytool/CertChainVerifier.java
     [exec]     [javac]  (at line 543)
     [exec]     [javac] 	selfSignedTAs.add(ta);

...

     [exec]     [javac] 	^^^^^^^^^^^^^^^^^^^^^
     [exec]     [javac] Type safety: The method add(Object) belongs to the raw type Set. References to generic type Set<E> should be parameterized
     [exec]     [javac] ----------
     [exec]     [javac] 7. WARNING in /home/hybld/continuum-working-directory/6/classlib/modules/tools/src/main/java/org/apache/harmony/tools/keytool/CertChainVerifier.java
     [exec]     [javac]  (at line 544)
     [exec]     [javac] 	selfSignedTAsCerts.add(trCert);

...

     [exec]     [javac] 	^^^^^^^^^^^^^^^^^^^^^^^^^^^^^^
     [exec]     [javac] Type safety: The method add(Object) belongs to the raw type Collection. References to generic type Collection<E> should be parameterized
     [exec]     [javac] ----------
     [exec]     [javac] 8. WARNING in /home/hybld/continuum-working-directory/6/classlib/modules/tools/src/main/java/org/apache/harmony/tools/keytool/CertChainVerifier.java
     [exec]     [javac]  (at line 547)
     [exec]     [javac] 	trustedCerts.add(trCert);

...

     [exec]     [javac] 	^^^^^^^^^^^^^^^^^^^^^^^^
     [exec]     [javac] Type safety: The method add(Object) belongs to the raw type Collection. References to generic type Collection<E> should be parameterized
     [exec]     [javac] ----------
     [exec]     [javac] ----------
     [exec]     [javac] 9. WARNING in /home/hybld/continuum-working-directory/6/classlib/modules/tools/src/main/java/org/apache/harmony/tools/keytool/CertImporter.java
     [exec]     [javac]  (at line 80)

...

     [exec]      [echo] Compiling ACCESSIBILITY tests
     [exec]     [javac] Compiling 8 source files to /home/hybld/continuum-working-directory/6/classlib/modules/accessibility/bin/test
     [exec]     [javac] Since fork is false, ignoring memoryMaximumSize setting
     [exec]     [javac] ----------
     [exec]     [javac] 1. ERROR in /home/hybld/continuum-working-directory/6/classlib/modules/accessibility/src/test/api/java/common/javax/accessibility/AccessibleBundleTest.java
     [exec]     [javac]  (at line 25)
     [exec]     [javac] 	import javax.swing.BasicSwingTestCase;
     [exec]     [javac] 	       ^^^^^^^^^^^^^^^^^^^^^^^^^^^^^^
     [exec]     [javac] The import javax.swing.BasicSwingTestCase cannot be resolved
     [exec]     [javac] ----------
     [exec]     [javac] 2. ERROR in /home/hybld/continuum-working-directory/6/classlib/modules/accessibility/src/test/api/java/common/javax/accessibility/AccessibleBundleTest.java
     [exec]     [javac]  (at line 27)
     [exec]     [javac] 	public class AccessibleBundleTest extends BasicSwingTestCase {
     [exec]     [javac] 	                                          ^^^^^^^^^^^^^^^^^^
     [exec]     [javac] BasicSwingTestCase cannot be resolved to a type
     [exec]     [javac] ----------

...

     [exec]     [javac] 3. ERROR in /home/hybld/continuum-working-directory/6/classlib/modules/accessibility/src/test/api/java/common/javax/accessibility/AccessibleBundleTest.java
     [exec]     [javac]  (at line 44)
     [exec]     [javac] 	assertEquals("DisplayString don't match resource: " + bundle.key,
     [exec]     [javac] 	^^^^^^^^^^^^
     [exec]     [javac] The method assertEquals(String, String, Object) is undefined for the type AccessibleBundleTest
     [exec]     [javac] ----------
     [exec]     [javac] 4. ERROR in /home/hybld/continuum-working-directory/6/classlib/modules/accessibility/src/test/api/java/common/javax/accessibility/AccessibleBundleTest.java
     [exec]     [javac]  (at line 46)
     [exec]     [javac] 	assertEquals("toDisplayString don't match toString: " + bundle.key,
     [exec]     [javac] 	^^^^^^^^^^^^
     [exec]     [javac] The method assertEquals(String, String, String) is undefined for the type AccessibleBundleTest
     [exec]     [javac] ----------
     [exec]     [javac] 5. ERROR in /home/hybld/continuum-working-directory/6/classlib/modules/accessibility/src/test/api/java/common/javax/accessibility/AccessibleBundleTest.java
     [exec]     [javac]  (at line 50)
     [exec]     [javac] 	assertEquals("Not bundled DisplayString should match itself",
     [exec]     [javac] 	^^^^^^^^^^^^
     [exec]     [javac] The method assertEquals(String, String, String) is undefined for the type AccessibleBundleTest
     [exec]     [javac] ----------
     [exec]     [javac] 6. ERROR in /home/hybld/continuum-working-directory/6/classlib/modules/accessibility/src/test/api/java/common/javax/accessibility/AccessibleBundleTest.java
     [exec]     [javac]  (at line 53)
     [exec]     [javac] 	testExceptionalCase(new ExceptionalCase() {
     [exec]     [javac] 	                        ^^^^^^^^^^^^^^^
     [exec]     [javac] ExceptionalCase cannot be resolved to a type
     [exec]     [javac] ----------
     [exec]     [javac] ----------
     [exec]     [javac] 7. ERROR in /home/hybld/continuum-working-directory/6/classlib/modules/accessibility/src/test/api/java/common/javax/accessibility/AccessibleContextTest.java
     [exec]     [javac]  (at line 28)
     [exec]     [javac] 	import javax.swing.BasicSwingTestCase;
     [exec]     [javac] 	       ^^^^^^^^^^^^^^^^^^^^^^^^^^^^^^
     [exec]     [javac] The import javax.swing.BasicSwingTestCase cannot be resolved
     [exec]     [javac] ----------
     [exec]     [javac] 8. ERROR in /home/hybld/continuum-working-directory/6/classlib/modules/accessibility/src/test/api/java/common/javax/accessibility/AccessibleContextTest.java
     [exec]     [javac]  (at line 30)
     [exec]     [javac] 	public class AccessibleContextTest extends BasicSwingTestCase {
     [exec]     [javac] 	                                           ^^^^^^^^^^^^^^^^^^
     [exec]     [javac] BasicSwingTestCase cannot be resolved to a type
     [exec]     [javac] ----------

...

     [exec]     [javac] 9. ERROR in /home/hybld/continuum-working-directory/6/classlib/modules/accessibility/src/test/api/java/common/javax/accessibility/AccessibleContextTest.java
     [exec]     [javac]  (at line 32)
     [exec]     [javac] 	private PropertyChangeController propertyController;
     [exec]     [javac] 	        ^^^^^^^^^^^^^^^^^^^^^^^^
     [exec]     [javac] PropertyChangeController cannot be resolved to a type
     [exec]     [javac] ----------
     [exec]     [javac] 10. ERROR in /home/hybld/continuum-working-directory/6/classlib/modules/accessibility/src/test/api/java/common/javax/accessibility/AccessibleContextTest.java
     [exec]     [javac]  (at line 55)
     [exec]     [javac] 	propertyController = new PropertyChangeController(/*true*/);
     [exec]     [javac] 	^^^^^^^^^^^^^^^^^^
     [exec]     [javac] propertyController cannot be resolved
     [exec]     [javac] ----------
     [exec]     [javac] 11. ERROR in /home/hybld/continuum-working-directory/6/classlib/modules/accessibility/src/test/api/java/common/javax/accessibility/AccessibleContextTest.java
     [exec]     [javac]  (at line 55)
     [exec]     [javac] 	propertyController = new PropertyChangeController(/*true*/);
     [exec]     [javac] 	                         ^^^^^^^^^^^^^^^^^^^^^^^^
     [exec]     [javac] PropertyChangeController cannot be resolved to a type
     [exec]     [javac] ----------

...

     [exec]     [javac] 12. ERROR in /home/hybld/continuum-working-directory/6/classlib/modules/accessibility/src/test/api/java/common/javax/accessibility/AccessibleContextTest.java
     [exec]     [javac]  (at line 56)
     [exec]     [javac] 	context.addPropertyChangeListener(propertyController);
     [exec]     [javac] 	                                  ^^^^^^^^^^^^^^^^^^
     [exec]     [javac] propertyController cannot be resolved
     [exec]     [javac] ----------

...

     [exec]     [javac] 13. ERROR in /home/hybld/continuum-working-directory/6/classlib/modules/accessibility/src/test/api/java/common/javax/accessibility/AccessibleContextTest.java
     [exec]     [javac]  (at line 66)
     [exec]     [javac] 	assertTrue(propertyController.isChanged(AccessibleContext.ACCESSIBLE_NAME_PROPERTY));
     [exec]     [javac] 	           ^^^^^^^^^^^^^^^^^^
     [exec]     [javac] propertyController cannot be resolved
     [exec]     [javac] ----------
     [exec]     [javac] 14. ERROR in /home/hybld/continuum-working-directory/6/classlib/modules/accessibility/src/test/api/java/common/javax/accessibility/AccessibleContextTest.java
     [exec]     [javac]  (at line 67)
     [exec]     [javac] 	assertEquals(name, context.getAccessibleName());
     [exec]     [javac] 	^^^^^^^^^^^^
     [exec]     [javac] The method assertEquals(String, String) is undefined for the type AccessibleContextTest
     [exec]     [javac] ----------
     [exec]     [javac] 15. ERROR in /home/hybld/continuum-working-directory/6/classlib/modules/accessibility/src/test/api/java/common/javax/accessibility/AccessibleContextTest.java
     [exec]     [javac]  (at line 68)
     [exec]     [javac] 	assertEquals(name, context.accessibleName);
     [exec]     [javac] 	^^^^^^^^^^^^
     [exec]     [javac] The method assertEquals(String, String) is undefined for the type AccessibleContextTest
     [exec]     [javac] ----------
     [exec]     [javac] 16. ERROR in /home/hybld/continuum-working-directory/6/classlib/modules/accessibility/src/test/api/java/common/javax/accessibility/AccessibleContextTest.java
     [exec]     [javac]  (at line 74)
     [exec]     [javac] 	assertTrue(propertyController.isChanged(AccessibleContext.ACCESSIBLE_DESCRIPTION_PROPERTY));
     [exec]     [javac] 	           ^^^^^^^^^^^^^^^^^^
     [exec]     [javac] propertyController cannot be resolved
     [exec]     [javac] ----------
     [exec]     [javac] 17. ERROR in /home/hybld/continuum-working-directory/6/classlib/modules/accessibility/src/test/api/java/common/javax/accessibility/AccessibleContextTest.java
     [exec]     [javac]  (at line 75)
     [exec]     [javac] 	assertEquals(description, context.getAccessibleDescription());
     [exec]     [javac] 	^^^^^^^^^^^^
     [exec]     [javac] The method assertEquals(String, String) is undefined for the type AccessibleContextTest
     [exec]     [javac] ----------
     [exec]     [javac] 18. ERROR in /home/hybld/continuum-working-directory/6/classlib/modules/accessibility/src/test/api/java/common/javax/accessibility/AccessibleContextTest.java
     [exec]     [javac]  (at line 76)
     [exec]     [javac] 	assertEquals(description, context.accessibleDescription);
     [exec]     [javac] 	^^^^^^^^^^^^
     [exec]     [javac] The method assertEquals(String, String) is undefined for the type AccessibleContextTest
     [exec]     [javac] ----------
     [exec]     [javac] 19. ERROR in /home/hybld/continuum-working-directory/6/classlib/modules/accessibility/src/test/api/java/common/javax/accessibility/AccessibleContextTest.java
     [exec]     [javac]  (at line 92)
     [exec]     [javac] 	assertEquals(parent, context.getAccessibleParent());
     [exec]     [javac] 	^^^^^^^^^^^^
     [exec]     [javac] The method assertEquals(Accessible, Accessible) is undefined for the type AccessibleContextTest
     [exec]     [javac] ----------
     [exec]     [javac] 20. ERROR in /home/hybld/continuum-working-directory/6/classlib/modules/accessibility/src/test/api/java/common/javax/accessibility/AccessibleContextTest.java
     [exec]     [javac]  (at line 93)
     [exec]     [javac] 	assertEquals(parent, context.accessibleParent);
     [exec]     [javac] 	^^^^^^^^^^^^
     [exec]     [javac] The method assertEquals(Accessible, Accessible) is undefined for the type AccessibleContextTest
     [exec]     [javac] ----------
     [exec]     [javac] 21. ERROR in /home/hybld/continuum-working-directory/6/classlib/modules/accessibility/src/test/api/java/common/javax/accessibility/AccessibleContextTest.java
     [exec]     [javac]  (at line 94)
     [exec]     [javac] 	assertFalse(propertyController.isChanged());
     [exec]     [javac] 	            ^^^^^^^^^^^^^^^^^^
     [exec]     [javac] propertyController cannot be resolved
     [exec]     [javac] ----------
     [exec]     [javac] 22. ERROR in /home/hybld/continuum-working-directory/6/classlib/modules/accessibility/src/test/api/java/common/javax/accessibility/AccessibleContextTest.java
     [exec]     [javac]  (at line 98)
     [exec]     [javac] 	assertNull(context.getAccessibleAction());
     [exec]     [javac] 	^^^^^^^^^^
     [exec]     [javac] The method assertNull(AccessibleAction) is undefined for the type AccessibleContextTest
     [exec]     [javac] ----------
     [exec]     [javac] 23. ERROR in /home/hybld/continuum-working-directory/6/classlib/modules/accessibility/src/test/api/java/common/javax/accessibility/AccessibleContextTest.java
     [exec]     [javac]  (at line 99)
     [exec]     [javac] 	assertNull(context.getAccessibleComponent());
     [exec]     [javac] 	^^^^^^^^^^
     [exec]     [javac] The method assertNull(AccessibleComponent) is undefined for the type AccessibleContextTest
     [exec]     [javac] ----------
     [exec]     [javac] 24. ERROR in /home/hybld/continuum-working-directory/6/classlib/modules/accessibility/src/test/api/java/common/javax/accessibility/AccessibleContextTest.java
     [exec]     [javac]  (at line 100)
     [exec]     [javac] 	assertNull(context.getAccessibleSelection());
     [exec]     [javac] 	^^^^^^^^^^
     [exec]     [javac] The method assertNull(AccessibleSelection) is undefined for the type AccessibleContextTest
     [exec]     [javac] ----------
     [exec]     [javac] 25. ERROR in /home/hybld/continuum-working-directory/6/classlib/modules/accessibility/src/test/api/java/common/javax/accessibility/AccessibleContextTest.java
     [exec]     [javac]  (at line 101)
     [exec]     [javac] 	assertNull(context.getAccessibleText());
     [exec]     [javac] 	^^^^^^^^^^
     [exec]     [javac] The method assertNull(AccessibleText) is undefined for the type AccessibleContextTest
     [exec]     [javac] ----------
     [exec]     [javac] 26. ERROR in /home/hybld/continuum-working-directory/6/classlib/modules/accessibility/src/test/api/java/common/javax/accessibility/AccessibleContextTest.java
     [exec]     [javac]  (at line 102)
     [exec]     [javac] 	assertNull(context.getAccessibleEditableText());
     [exec]     [javac] 	^^^^^^^^^^
     [exec]     [javac] The method assertNull(AccessibleEditableText) is undefined for the type AccessibleContextTest
     [exec]     [javac] ----------
     [exec]     [javac] 27. ERROR in /home/hybld/continuum-working-directory/6/classlib/modules/accessibility/src/test/api/java/common/javax/accessibility/AccessibleContextTest.java
     [exec]     [javac]  (at line 103)
     [exec]     [javac] 	assertNull(context.getAccessibleValue());
     [exec]     [javac] 	^^^^^^^^^^
     [exec]     [javac] The method assertNull(AccessibleValue) is undefined for the type AccessibleContextTest
     [exec]     [javac] ----------
     [exec]     [javac] 28. ERROR in /home/hybld/continuum-working-directory/6/classlib/modules/accessibility/src/test/api/java/common/javax/accessibility/AccessibleContextTest.java
     [exec]     [javac]  (at line 104)
     [exec]     [javac] 	assertNull(context.getAccessibleIcon());
     [exec]     [javac] 	^^^^^^^^^^
     [exec]     [javac] The method assertNull(AccessibleIcon[]) is undefined for the type AccessibleContextTest
     [exec]     [javac] ----------
     [exec]     [javac] 29. ERROR in /home/hybld/continuum-working-directory/6/classlib/modules/accessibility/src/test/api/java/common/javax/accessibility/AccessibleContextTest.java
     [exec]     [javac]  (at line 105)
     [exec]     [javac] 	assertSame(context.getAccessibleRelationSet(), context.getAccessibleRelationSet());
     [exec]     [javac] 	^^^^^^^^^^
     [exec]     [javac] The method assertSame(AccessibleRelationSet, AccessibleRelationSet) is undefined for the type AccessibleContextTest
     [exec]     [javac] ----------
     [exec]     [javac] 30. ERROR in /home/hybld/continuum-working-directory/6/classlib/modules/accessibility/src/test/api/java/common/javax/accessibility/AccessibleContextTest.java
     [exec]     [javac]  (at line 106)
     [exec]     [javac] 	assertNull(context.getAccessibleTable());
     [exec]     [javac] 	^^^^^^^^^^
     [exec]     [javac] The method assertNull(AccessibleTable) is undefined for the type AccessibleContextTest
     [exec]     [javac] ----------
     [exec]     [javac] 31. ERROR in /home/hybld/continuum-working-directory/6/classlib/modules/accessibility/src/test/api/java/common/javax/accessibility/AccessibleContextTest.java
     [exec]     [javac]  (at line 107)
     [exec]     [javac] 	assertFalse(propertyController.isChanged());
     [exec]     [javac] 	            ^^^^^^^^^^^^^^^^^^
     [exec]     [javac] propertyController cannot be resolved
     [exec]     [javac] ----------
     [exec]     [javac] ----------
     [exec]     [javac] 32. ERROR in /home/hybld/continuum-working-directory/6/classlib/modules/accessibility/src/test/api/java/common/javax/accessibility/AccessibleRelationSetTest.java
     [exec]     [javac]  (at line 25)
     [exec]     [javac] 	import javax.swing.BasicSwingTestCase;
     [exec]     [javac] 	       ^^^^^^^^^^^^^^^^^^^^^^^^^^^^^^
     [exec]     [javac] The import javax.swing.BasicSwingTestCase cannot be resolved
     [exec]     [javac] ----------
     [exec]     [javac] 33. ERROR in /home/hybld/continuum-working-directory/6/classlib/modules/accessibility/src/test/api/java/common/javax/accessibility/AccessibleRelationSetTest.java
     [exec]     [javac]  (at line 27)
     [exec]     [javac] 	public class AccessibleRelationSetTest extends BasicSwingTestCase {
     [exec]     [javac] 	                                               ^^^^^^^^^^^^^^^^^^
     [exec]     [javac] BasicSwingTestCase cannot be resolved to a type
     [exec]     [javac] ----------

...

     [exec]     [javac] 34. ERROR in /home/hybld/continuum-working-directory/6/classlib/modules/accessibility/src/test/api/java/common/javax/accessibility/AccessibleRelationSetTest.java
     [exec]     [javac]  (at line 45)
     [exec]     [javac] 	assertNotNull(set.relations);
     [exec]     [javac] 	^^^^^^^^^^^^^
     [exec]     [javac] The method assertNotNull(Vector<AccessibleRelation>) is undefined for the type AccessibleRelationSetTest
     [exec]     [javac] ----------
     [exec]     [javac] 35. ERROR in /home/hybld/continuum-working-directory/6/classlib/modules/accessibility/src/test/api/java/common/javax/accessibility/AccessibleRelationSetTest.java
     [exec]     [javac]  (at line 47)
     [exec]     [javac] 	testExceptionalCase(new ExceptionalCase() {
     [exec]     [javac] 	                        ^^^^^^^^^^^^^^^
     [exec]     [javac] ExceptionalCase cannot be resolved to a type
     [exec]     [javac] ----------
     [exec]     [javac] 36. ERROR in /home/hybld/continuum-working-directory/6/classlib/modules/accessibility/src/test/api/java/common/javax/accessibility/AccessibleRelationSetTest.java
     [exec]     [javac]  (at line 55)
     [exec]     [javac] 	assertTrue("Should contain added item", set.contains(AccessibleRelation.CONTROLLED_BY));
     [exec]     [javac] 	^^^^^^^^^^
     [exec]     [javac] The method assertTrue(String, boolean) is undefined for the type AccessibleRelationSetTest
     [exec]     [javac] ----------
     [exec]     [javac] 37. ERROR in /home/hybld/continuum-working-directory/6/classlib/modules/accessibility/src/test/api/java/common/javax/accessibility/AccessibleRelationSetTest.java
     [exec]     [javac]  (at line 56)
     [exec]     [javac] 	assertTrue("Should contain added item", set.contains(AccessibleRelation.MEMBER_OF));
     [exec]     [javac] 	^^^^^^^^^^
     [exec]     [javac] The method assertTrue(String, boolean) is undefined for the type AccessibleRelationSetTest
     [exec]     [javac] ----------
     [exec]     [javac] 38. ERROR in /home/hybld/continuum-working-directory/6/classlib/modules/accessibility/src/test/api/java/common/javax/accessibility/AccessibleRelationSetTest.java
     [exec]     [javac]  (at line 59)
     [exec]     [javac] 	assertTrue(set.add(relation));
     [exec]     [javac] 	^^^^^^^^^^
     [exec]     [javac] The method assertTrue(boolean) is undefined for the type AccessibleRelationSetTest
     [exec]     [javac] ----------
     [exec]     [javac] 39. ERROR in /home/hybld/continuum-working-directory/6/classlib/modules/accessibility/src/test/api/java/common/javax/accessibility/AccessibleRelationSetTest.java
     [exec]     [javac]  (at line 60)
     [exec]     [javac] 	if (isHarmony()) {
     [exec]     [javac] 	    ^^^^^^^^^
     [exec]     [javac] The method isHarmony() is undefined for the type AccessibleRelationSetTest
     [exec]     [javac] ----------
     [exec]     [javac] 40. ERROR in /home/hybld/continuum-working-directory/6/classlib/modules/accessibility/src/test/api/java/common/javax/accessibility/AccessibleRelationSetTest.java
     [exec]     [javac]  (at line 61)
     [exec]     [javac] 	assertFalse(set.add(relation));
     [exec]     [javac] 	^^^^^^^^^^^
     [exec]     [javac] The method assertFalse(boolean) is undefined for the type AccessibleRelationSetTest
     [exec]     [javac] ----------
     [exec]     [javac] 41. ERROR in /home/hybld/continuum-working-directory/6/classlib/modules/accessibility/src/test/api/java/common/javax/accessibility/AccessibleRelationSetTest.java
     [exec]     [javac]  (at line 63)
     [exec]     [javac] 	assertTrue("Should contain added item", set.contains(AccessibleRelation.CONTROLLER_FOR));
     [exec]     [javac] 	^^^^^^^^^^
     [exec]     [javac] The method assertTrue(String, boolean) is undefined for the type AccessibleRelationSetTest
     [exec]     [javac] ----------
     [exec]     [javac] 42. ERROR in /home/hybld/continuum-working-directory/6/classlib/modules/accessibility/src/test/api/java/common/javax/accessibility/AccessibleRelationSetTest.java
     [exec]     [javac]  (at line 64)
     [exec]     [javac] 	assertFalse("Should not contain not added item", set.contains(AccessibleRelation.LABEL_FOR));
     [exec]     [javac] 	^^^^^^^^^^^
     [exec]     [javac] The method assertFalse(String, boolean) is undefined for the type AccessibleRelationSetTest
     [exec]     [javac] ----------
     [exec]     [javac] 43. ERROR in /home/hybld/continuum-working-directory/6/classlib/modules/accessibility/src/test/api/java/common/javax/accessibility/AccessibleRelationSetTest.java
     [exec]     [javac]  (at line 70)
     [exec]     [javac] 	assertFalse("Empty set should not contain any item",
     [exec]     [javac] 	^^^^^^^^^^^
     [exec]     [javac] The method assertFalse(String, boolean) is undefined for the type AccessibleRelationSetTest
     [exec]     [javac] ----------
     [exec]     [javac] 44. ERROR in /home/hybld/continuum-working-directory/6/classlib/modules/accessibility/src/test/api/java/common/javax/accessibility/AccessibleRelationSetTest.java
     [exec]     [javac]  (at line 72)
     [exec]     [javac] 	assertNull("Empty set should not contain any item",
     [exec]     [javac] 	^^^^^^^^^^
     [exec]     [javac] The method assertNull(String, AccessibleRelation) is undefined for the type AccessibleRelationSetTest
     [exec]     [javac] ----------
     [exec]     [javac] 45. ERROR in /home/hybld/continuum-working-directory/6/classlib/modules/accessibility/src/test/api/java/common/javax/accessibility/AccessibleRelationSetTest.java
     [exec]     [javac]  (at line 74)
     [exec]     [javac] 	assertFalse("Empty set should not contain any item",
     [exec]     [javac] 	^^^^^^^^^^^
     [exec]     [javac] The method assertFalse(String, boolean) is undefined for the type AccessibleRelationSetTest
     [exec]     [javac] ----------
     [exec]     [javac] 46. ERROR in /home/hybld/continuum-working-directory/6/classlib/modules/accessibility/src/test/api/java/common/javax/accessibility/AccessibleRelationSetTest.java
     [exec]     [javac]  (at line 83)
     [exec]     [javac] 	if (isHarmony()) {
     [exec]     [javac] 	    ^^^^^^^^^
     [exec]     [javac] The method isHarmony() is undefined for the type AccessibleRelationSetTest
     [exec]     [javac] ----------
     [exec]     [javac] 47. ERROR in /home/hybld/continuum-working-directory/6/classlib/modules/accessibility/src/test/api/java/common/javax/accessibility/AccessibleRelationSetTest.java
     [exec]     [javac]  (at line 84)
     [exec]     [javac] 	assertFalse("Should not add duplicate item", set.add(dupeRelation));
     [exec]     [javac] 	^^^^^^^^^^^
     [exec]     [javac] The method assertFalse(String, boolean) is undefined for the type AccessibleRelationSetTest
     [exec]     [javac] ----------
     [exec]     [javac] 48. ERROR in /home/hybld/continuum-working-directory/6/classlib/modules/accessibility/src/test/api/java/common/javax/accessibility/AccessibleRelationSetTest.java
     [exec]     [javac]  (at line 85)
     [exec]     [javac] 	assertFalse("Should not add duplicate item", set.add(relations[0]));
     [exec]     [javac] 	^^^^^^^^^^^
     [exec]     [javac] The method assertFalse(String, boolean) is undefined for the type AccessibleRelationSetTest
     [exec]     [javac] ----------
     [exec]     [javac] 49. ERROR in /home/hybld/continuum-working-directory/6/classlib/modules/accessibility/src/test/api/java/common/javax/accessibility/AccessibleRelationSetTest.java
     [exec]     [javac]  (at line 87)
     [exec]     [javac] 	assertNotSame(dupeRelation, set.get(AccessibleRelation.CONTROLLED_BY));
     [exec]     [javac] 	^^^^^^^^^^^^^
     [exec]     [javac] The method assertNotSame(AccessibleRelation, AccessibleRelation) is undefined for the type AccessibleRelationSetTest
     [exec]     [javac] ----------
     [exec]     [javac] 50. ERROR in /home/hybld/continuum-working-directory/6/classlib/modules/accessibility/src/test/api/java/common/javax/accessibility/AccessibleRelationSetTest.java
     [exec]     [javac]  (at line 88)
     [exec]     [javac] 	assertSame(relations[0], set.get(AccessibleRelation.CONTROLLED_BY));
     [exec]     [javac] 	^^^^^^^^^^
     [exec]     [javac] The method assertSame(AccessibleRelation, AccessibleRelation) is undefined for the type AccessibleRelationSetTest
     [exec]     [javac] ----------
     [exec]     [javac] 51. ERROR in /home/hybld/continuum-working-directory/6/classlib/modules/accessibility/src/test/api/java/common/javax/accessibility/AccessibleRelationSetTest.java
     [exec]     [javac]  (at line 94)
     [exec]     [javac] 	assertEquals("Should not add duplicate items in addAll", relations.length,
     [exec]     [javac] 	^^^^^^^^^^^^
     [exec]     [javac] The method assertEquals(String, int, int) is undefined for the type AccessibleRelationSetTest
     [exec]     [javac] ----------
     [exec]     [javac] 52. ERROR in /home/hybld/continuum-working-directory/6/classlib/modules/accessibility/src/test/api/java/common/javax/accessibility/AccessibleRelationSetTest.java
     [exec]     [javac]  (at line 99)
     [exec]     [javac] 	assertSame("Get should return same value",
     [exec]     [javac] 	^^^^^^^^^^
     [exec]     [javac] The method assertSame(String, AccessibleRelation, AccessibleRelation) is undefined for the type AccessibleRelationSetTest
     [exec]     [javac] ----------
     [exec]     [javac] 53. ERROR in /home/hybld/continuum-working-directory/6/classlib/modules/accessibility/src/test/api/java/common/javax/accessibility/AccessibleRelationSetTest.java
     [exec]     [javac]  (at line 101)
     [exec]     [javac] 	assertNull("Get should return null if no such element present",
     [exec]     [javac] 	^^^^^^^^^^
     [exec]     [javac] The method assertNull(String, AccessibleRelation) is undefined for the type AccessibleRelationSetTest
     [exec]     [javac] ----------
     [exec]     [javac] 54. ERROR in /home/hybld/continuum-working-directory/6/classlib/modules/accessibility/src/test/api/java/common/javax/accessibility/AccessibleRelationSetTest.java
     [exec]     [javac]  (at line 107)
     [exec]     [javac] 	assertEquals("Cleared array should be empty", 0, set.relations.size());
     [exec]     [javac] 	^^^^^^^^^^^^
     [exec]     [javac] The method assertEquals(String, int, int) is undefined for the type AccessibleRelationSetTest
     [exec]     [javac] ----------
     [exec]     [javac] 55. ERROR in /home/hybld/continuum-working-directory/6/classlib/modules/accessibility/src/test/api/java/common/javax/accessibility/AccessibleRelationSetTest.java
     [exec]     [javac]  (at line 112)
     [exec]     [javac] 	assertTrue(set.remove(set.get(AccessibleRelation.CONTROLLER_FOR)));
     [exec]     [javac] 	^^^^^^^^^^
     [exec]     [javac] The method assertTrue(boolean) is undefined for the type AccessibleRelationSetTest
     [exec]     [javac] ----------
     [exec]     [javac] 56. ERROR in /home/hybld/continuum-working-directory/6/classlib/modules/accessibility/src/test/api/java/common/javax/accessibility/AccessibleRelationSetTest.java
     [exec]     [javac]  (at line 113)
     [exec]     [javac] 	assertFalse(set.contains(AccessibleRelation.CONTROLLER_FOR));
     [exec]     [javac] 	^^^^^^^^^^^
     [exec]     [javac] The method assertFalse(boolean) is undefined for the type AccessibleRelationSetTest
     [exec]     [javac] ----------
     [exec]     [javac] 57. ERROR in /home/hybld/continuum-working-directory/6/classlib/modules/accessibility/src/test/api/java/common/javax/accessibility/AccessibleRelationSetTest.java
     [exec]     [javac]  (at line 118)
     [exec]     [javac] 	assertTrue("String representation should contain elements representation",
     [exec]     [javac] 	^^^^^^^^^^
     [exec]     [javac] The method assertTrue(String, boolean) is undefined for the type AccessibleRelationSetTest
     [exec]     [javac] ----------
     [exec]     [javac] 58. ERROR in /home/hybld/continuum-working-directory/6/classlib/modules/accessibility/src/test/api/java/common/javax/accessibility/AccessibleRelationSetTest.java
     [exec]     [javac]  (at line 120)
     [exec]     [javac] 	assertTrue("String representation should contain elements representation",
     [exec]     [javac] 	^^^^^^^^^^
     [exec]     [javac] The method assertTrue(String, boolean) is undefined for the type AccessibleRelationSetTest
     [exec]     [javac] ----------
     [exec]     [javac] ----------
     [exec]     [javac] 59. ERROR in /home/hybld/continuum-working-directory/6/classlib/modules/accessibility/src/test/api/java/common/javax/accessibility/AccessibleRelationTest.java
     [exec]     [javac]  (at line 25)
     [exec]     [javac] 	import javax.swing.BasicSwingTestCase;
     [exec]     [javac] 	       ^^^^^^^^^^^^^^^^^^^^^^^^^^^^^^
     [exec]     [javac] The import javax.swing.BasicSwingTestCase cannot be resolved
     [exec]     [javac] ----------
     [exec]     [javac] 60. ERROR in /home/hybld/continuum-working-directory/6/classlib/modules/accessibility/src/test/api/java/common/javax/accessibility/AccessibleRelationTest.java
     [exec]     [javac]  (at line 27)
     [exec]     [javac] 	public class AccessibleRelationTest extends BasicSwingTestCase {
     [exec]     [javac] 	                                            ^^^^^^^^^^^^^^^^^^
     [exec]     [javac] BasicSwingTestCase cannot be resolved to a type
     [exec]     [javac] ----------

...

     [exec]     [javac] 61. ERROR in /home/hybld/continuum-working-directory/6/classlib/modules/accessibility/src/test/api/java/common/javax/accessibility/AccessibleRelationTest.java
     [exec]     [javac]  (at line 39)
     [exec]     [javac] 	assertEquals(relation.key, relation.getKey());
     [exec]     [javac] 	^^^^^^^^^^^^
     [exec]     [javac] The method assertEquals(String, String) is undefined for the type AccessibleRelationTest
     [exec]     [javac] ----------
     [exec]     [javac] 62. ERROR in /home/hybld/continuum-working-directory/6/classlib/modules/accessibility/src/test/api/java/common/javax/accessibility/AccessibleRelationTest.java
     [exec]     [javac]  (at line 43)
     [exec]     [javac] 	assertEquals(0, relation.getTarget().length);
     [exec]     [javac] 	^^^^^^^^^^^^
     [exec]     [javac] The method assertEquals(int, int) is undefined for the type AccessibleRelationTest
     [exec]     [javac] ----------
     [exec]     [javac] 63. ERROR in /home/hybld/continuum-working-directory/6/classlib/modules/accessibility/src/test/api/java/common/javax/accessibility/AccessibleRelationTest.java
     [exec]     [javac]  (at line 49)
     [exec]     [javac] 	assertEquals(1, relation.getTarget().length);
     [exec]     [javac] 	^^^^^^^^^^^^
     [exec]     [javac] The method assertEquals(int, int) is undefined for the type AccessibleRelationTest
     [exec]     [javac] ----------
     [exec]     [javac] 64. ERROR in /home/hybld/continuum-working-directory/6/classlib/modules/accessibility/src/test/api/java/common/javax/accessibility/AccessibleRelationTest.java
     [exec]     [javac]  (at line 50)
     [exec]     [javac] 	assertSame(target, relation.getTarget()[0]);
     [exec]     [javac] 	^^^^^^^^^^
     [exec]     [javac] The method assertSame(StringBuffer, Object) is undefined for the type AccessibleRelationTest
     [exec]     [javac] ----------
     [exec]     [javac] 65. ERROR in /home/hybld/continuum-working-directory/6/classlib/modules/accessibility/src/test/api/java/common/javax/accessibility/AccessibleRelationTest.java
     [exec]     [javac]  (at line 54)
     [exec]     [javac] 	assertEquals(2, relation.getTarget().length);
     [exec]     [javac] 	^^^^^^^^^^^^
     [exec]     [javac] The method assertEquals(int, int) is undefined for the type AccessibleRelationTest
     [exec]     [javac] ----------
     [exec]     [javac] 66. ERROR in /home/hybld/continuum-working-directory/6/classlib/modules/accessibility/src/test/api/java/common/javax/accessibility/AccessibleRelationTest.java
     [exec]     [javac]  (at line 55)
     [exec]     [javac] 	assertNotSame(targets, relation.getTarget());
     [exec]     [javac] 	^^^^^^^^^^^^^
     [exec]     [javac] The method assertNotSame(StringBuffer[], Object[]) is undefined for the type AccessibleRelationTest
     [exec]     [javac] ----------
     [exec]     [javac] 67. ERROR in /home/hybld/continuum-working-directory/6/classlib/modules/accessibility/src/test/api/java/common/javax/accessibility/AccessibleRelationTest.java
     [exec]     [javac]  (at line 58)
     [exec]     [javac] 	assertNotNull(relation.getTarget());
     [exec]     [javac] 	^^^^^^^^^^^^^
     [exec]     [javac] The method assertNotNull(Object[]) is undefined for the type AccessibleRelationTest
     [exec]     [javac] ----------
     [exec]     [javac] 68. ERROR in /home/hybld/continuum-working-directory/6/classlib/modules/accessibility/src/test/api/java/common/javax/accessibility/AccessibleRelationTest.java
     [exec]     [javac]  (at line 59)
     [exec]     [javac] 	assertEquals(0, relation.getTarget().length);
     [exec]     [javac] 	^^^^^^^^^^^^
     [exec]     [javac] The method assertEquals(int, int) is undefined for the type AccessibleRelationTest
     [exec]     [javac] ----------
     [exec]     [javac] 69. ERROR in /home/hybld/continuum-working-directory/6/classlib/modules/accessibility/src/test/api/java/common/javax/accessibility/AccessibleRelationTest.java
     [exec]     [javac]  (at line 62)
     [exec]     [javac] 	assertNotNull(relation.getTarget());
     [exec]     [javac] 	^^^^^^^^^^^^^
     [exec]     [javac] The method assertNotNull(Object[]) is undefined for the type AccessibleRelationTest
     [exec]     [javac] ----------
     [exec]     [javac] 70. ERROR in /home/hybld/continuum-working-directory/6/classlib/modules/accessibility/src/test/api/java/common/javax/accessibility/AccessibleRelationTest.java
     [exec]     [javac]  (at line 63)
     [exec]     [javac] 	assertEquals(1, relation.getTarget().length);
     [exec]     [javac] 	^^^^^^^^^^^^
     [exec]     [javac] The method assertEquals(int, int) is undefined for the type AccessibleRelationTest
     [exec]     [javac] ----------
     [exec]     [javac] 71. ERROR in /home/hybld/continuum-working-directory/6/classlib/modules/accessibility/src/test/api/java/common/javax/accessibility/AccessibleRelationTest.java
     [exec]     [javac]  (at line 64)
     [exec]     [javac] 	assertNull(relation.getTarget()[0]);
     [exec]     [javac] 	^^^^^^^^^^
     [exec]     [javac] The method assertNull(Object) is undefined for the type AccessibleRelationTest
     [exec]     [javac] ----------
     [exec]     [javac] ----------
     [exec]     [javac] 72. ERROR in /home/hybld/continuum-working-directory/6/classlib/modules/accessibility/src/test/api/java/common/javax/accessibility/AccessibleResourceBundleTest.java
     [exec]     [javac]  (at line 25)
     [exec]     [javac] 	import javax.swing.BasicSwingTestCase;
     [exec]     [javac] 	       ^^^^^^^^^^^^^^^^^^^^^^^^^^^^^^
     [exec]     [javac] The import javax.swing.BasicSwingTestCase cannot be resolved
     [exec]     [javac] ----------
     [exec]     [javac] 73. ERROR in /home/hybld/continuum-working-directory/6/classlib/modules/accessibility/src/test/api/java/common/javax/accessibility/AccessibleResourceBundleTest.java
     [exec]     [javac]  (at line 27)
     [exec]     [javac] 	public class AccessibleResourceBundleTest extends BasicSwingTestCase {
     [exec]     [javac] 	                                                  ^^^^^^^^^^^^^^^^^^
     [exec]     [javac] BasicSwingTestCase cannot be resolved to a type
     [exec]     [javac] ----------
     [exec]     [javac] 74. ERROR in /home/hybld/continuum-working-directory/6/classlib/modules/accessibility/src/test/api/java/common/javax/accessibility/AccessibleResourceBundleTest.java
     [exec]     [javac]  (at line 40)
     [exec]     [javac] 	if (isHarmony()) {
     [exec]     [javac] 	    ^^^^^^^^^
     [exec]     [javac] The method isHarmony() is undefined for the type AccessibleResourceBundleTest
     [exec]     [javac] ----------
     [exec]     [javac] 75. ERROR in /home/hybld/continuum-working-directory/6/classlib/modules/accessibility/src/test/api/java/common/javax/accessibility/AccessibleResourceBundleTest.java
     [exec]     [javac]  (at line 41)
     [exec]     [javac] 	assertEquals(103, contents.length);
     [exec]     [javac] 	^^^^^^^^^^^^
     [exec]     [javac] The method assertEquals(int, int) is undefined for the type AccessibleResourceBundleTest
     [exec]     [javac] ----------
     [exec]     [javac] 76. ERROR in /home/hybld/continuum-working-directory/6/classlib/modules/accessibility/src/test/api/java/common/javax/accessibility/AccessibleResourceBundleTest.java
     [exec]     [javac]  (at line 43)
     [exec]     [javac] 	assertEquals(2, contents[10].length);
     [exec]     [javac] 	^^^^^^^^^^^^
     [exec]     [javac] The method assertEquals(int, int) is undefined for the type AccessibleResourceBundleTest
     [exec]     [javac] ----------
     [exec]     [javac] 77. ERROR in /home/hybld/continuum-working-directory/6/classlib/modules/accessibility/src/test/api/java/common/javax/accessibility/AccessibleResourceBundleTest.java
     [exec]     [javac]  (at line 47)
     [exec]     [javac] 	assertSame(contents[10], contents2[10]);
     [exec]     [javac] 	^^^^^^^^^^
     [exec]     [javac] The method assertSame(Object[], Object[]) is undefined for the type AccessibleResourceBundleTest
     [exec]     [javac] ----------
     [exec]     [javac] ----------
     [exec]     [javac] 78. ERROR in /home/hybld/continuum-working-directory/6/classlib/modules/accessibility/src/test/api/java/common/javax/accessibility/AccessibleRoleTest.java
     [exec]     [javac]  (at line 25)
     [exec]     [javac] 	import javax.swing.BasicSwingTestCase;
     [exec]     [javac] 	       ^^^^^^^^^^^^^^^^^^^^^^^^^^^^^^
     [exec]     [javac] The import javax.swing.BasicSwingTestCase cannot be resolved
     [exec]     [javac] ----------
     [exec]     [javac] 79. ERROR in /home/hybld/continuum-working-directory/6/classlib/modules/accessibility/src/test/api/java/common/javax/accessibility/AccessibleRoleTest.java
     [exec]     [javac]  (at line 27)
     [exec]     [javac] 	public class AccessibleRoleTest extends BasicSwingTestCase {
     [exec]     [javac] 	                                        ^^^^^^^^^^^^^^^^^^
     [exec]     [javac] BasicSwingTestCase cannot be resolved to a type
     [exec]     [javac] ----------

...

     [exec]     [javac] 80. ERROR in /home/hybld/continuum-working-directory/6/classlib/modules/accessibility/src/test/api/java/common/javax/accessibility/AccessibleRoleTest.java
     [exec]     [javac]  (at line 37)
     [exec]     [javac] 	assertEquals(key, state.key);
     [exec]     [javac] 	^^^^^^^^^^^^
     [exec]     [javac] The method assertEquals(String, String) is undefined for the type AccessibleRoleTest
     [exec]     [javac] ----------
     [exec]     [javac] 81. ERROR in /home/hybld/continuum-working-directory/6/classlib/modules/accessibility/src/test/api/java/common/javax/accessibility/AccessibleRoleTest.java
     [exec]     [javac]  (at line 38)
     [exec]     [javac] 	assertEquals(key, state.toDisplayString());
     [exec]     [javac] 	^^^^^^^^^^^^
     [exec]     [javac] The method assertEquals(String, String) is undefined for the type AccessibleRoleTest
     [exec]     [javac] ----------
     [exec]     [javac] ----------
     [exec]     [javac] 82. ERROR in /home/hybld/continuum-working-directory/6/classlib/modules/accessibility/src/test/api/java/common/javax/accessibility/AccessibleStateSetTest.java
     [exec]     [javac]  (at line 27)
     [exec]     [javac] 	import javax.swing.SwingTestCase;
     [exec]     [javac] 	       ^^^^^^^^^^^^^^^^^^^^^^^^^
     [exec]     [javac] The import javax.swing.SwingTestCase cannot be resolved
     [exec]     [javac] ----------
     [exec]     [javac] 83. ERROR in /home/hybld/continuum-working-directory/6/classlib/modules/accessibility/src/test/api/java/common/javax/accessibility/AccessibleStateSetTest.java
     [exec]     [javac]  (at line 29)
     [exec]     [javac] 	public class AccessibleStateSetTest extends SwingTestCase {
     [exec]     [javac] 	                                            ^^^^^^^^^^^^^
     [exec]     [javac] SwingTestCase cannot be resolved to a type
     [exec]     [javac] ----------

...

     [exec]     [javac] 84. ERROR in /home/hybld/continuum-working-directory/6/classlib/modules/accessibility/src/test/api/java/common/javax/accessibility/AccessibleStateSetTest.java
     [exec]     [javac]  (at line 47)
     [exec]     [javac] 	assertNotNull(stateSet.states);
     [exec]     [javac] 	^^^^^^^^^^^^^
     [exec]     [javac] The method assertNotNull(Vector<AccessibleState>) is undefined for the type AccessibleStateSetTest
     [exec]     [javac] ----------
     [exec]     [javac] 85. ERROR in /home/hybld/continuum-working-directory/6/classlib/modules/accessibility/src/test/api/java/common/javax/accessibility/AccessibleStateSetTest.java
     [exec]     [javac]  (at line 49)
     [exec]     [javac] 	testExceptionalCase(new ExceptionalCase() {
     [exec]     [javac] 	                        ^^^^^^^^^^^^^^^
     [exec]     [javac] ExceptionalCase cannot be resolved to a type
     [exec]     [javac] ----------
     [exec]     [javac] 86. ERROR in /home/hybld/continuum-working-directory/6/classlib/modules/accessibility/src/test/api/java/common/javax/accessibility/AccessibleStateSetTest.java
     [exec]     [javac]  (at line 57)
     [exec]     [javac] 	assertTrue("Must contain added state", stateSet.contains(AccessibleState.ACTIVE));
     [exec]     [javac] 	^^^^^^^^^^
     [exec]     [javac] The method assertTrue(String, boolean) is undefined for the type AccessibleStateSetTest
     [exec]     [javac] ----------
     [exec]     [javac] 87. ERROR in /home/hybld/continuum-working-directory/6/classlib/modules/accessibility/src/test/api/java/common/javax/accessibility/AccessibleStateSetTest.java
     [exec]     [javac]  (at line 58)
     [exec]     [javac] 	assertTrue("Must contain added state", stateSet.contains(AccessibleState.ARMED));
     [exec]     [javac] 	^^^^^^^^^^
     [exec]     [javac] The method assertTrue(String, boolean) is undefined for the type AccessibleStateSetTest
     [exec]     [javac] ----------
     [exec]     [javac] 88. ERROR in /home/hybld/continuum-working-directory/6/classlib/modules/accessibility/src/test/api/java/common/javax/accessibility/AccessibleStateSetTest.java
     [exec]     [javac]  (at line 60)
     [exec]     [javac] 	assertEquals("Should not add duplicate item", 2, stateSet.states.size());
     [exec]     [javac] 	^^^^^^^^^^^^
     [exec]     [javac] The method assertEquals(String, int, int) is undefined for the type AccessibleStateSetTest
     [exec]     [javac] ----------
     [exec]     [javac] 89. ERROR in /home/hybld/continuum-working-directory/6/classlib/modules/accessibility/src/test/api/java/common/javax/accessibility/AccessibleStateSetTest.java
     [exec]     [javac]  (at line 61)
     [exec]     [javac] 	assertFalse("Should not add duplicate item", added);
     [exec]     [javac] 	^^^^^^^^^^^
     [exec]     [javac] The method assertFalse(String, boolean) is undefined for the type AccessibleStateSetTest
     [exec]     [javac] ----------
     [exec]     [javac] 90. ERROR in /home/hybld/continuum-working-directory/6/classlib/modules/accessibility/src/test/api/java/common/javax/accessibility/AccessibleStateSetTest.java
     [exec]     [javac]  (at line 62)
     [exec]     [javac] 	assertFalse(stateSet.contains(null));
     [exec]     [javac] 	^^^^^^^^^^^
     [exec]     [javac] The method assertFalse(boolean) is undefined for the type AccessibleStateSetTest
     [exec]     [javac] ----------
     [exec]     [javac] 91. ERROR in /home/hybld/continuum-working-directory/6/classlib/modules/accessibility/src/test/api/java/common/javax/accessibility/AccessibleStateSetTest.java
     [exec]     [javac]  (at line 64)
     [exec]     [javac] 	assertTrue(stateSet.add(null));
     [exec]     [javac] 	^^^^^^^^^^
     [exec]     [javac] The method assertTrue(boolean) is undefined for the type AccessibleStateSetTest
     [exec]     [javac] ----------
     [exec]     [javac] 92. ERROR in /home/hybld/continuum-working-directory/6/classlib/modules/accessibility/src/test/api/java/common/javax/accessibility/AccessibleStateSetTest.java
     [exec]     [javac]  (at line 65)
     [exec]     [javac] 	assertTrue(stateSet.contains(null));
     [exec]     [javac] 	^^^^^^^^^^
     [exec]     [javac] The method assertTrue(boolean) is undefined for the type AccessibleStateSetTest
     [exec]     [javac] ----------
     [exec]     [javac] 93. ERROR in /home/hybld/continuum-working-directory/6/classlib/modules/accessibility/src/test/api/java/common/javax/accessibility/AccessibleStateSetTest.java
     [exec]     [javac]  (at line 68)
     [exec]     [javac] 	assertFalse(stateSet.contains(null));
     [exec]     [javac] 	^^^^^^^^^^^
     [exec]     [javac] The method assertFalse(boolean) is undefined for the type AccessibleStateSetTest
     [exec]     [javac] ----------
     [exec]     [javac] 94. ERROR in /home/hybld/continuum-working-directory/6/classlib/modules/accessibility/src/test/api/java/common/javax/accessibility/AccessibleStateSetTest.java
     [exec]     [javac]  (at line 69)
     [exec]     [javac] 	assertNull(stateSet.states);
     [exec]     [javac] 	^^^^^^^^^^
     [exec]     [javac] The method assertNull(Vector<AccessibleState>) is undefined for the type AccessibleStateSetTest
     [exec]     [javac] ----------
     [exec]     [javac] 95. ERROR in /home/hybld/continuum-working-directory/6/classlib/modules/accessibility/src/test/api/java/common/javax/accessibility/AccessibleStateSetTest.java
     [exec]     [javac]  (at line 78)
     [exec]     [javac] 	assertEquals("Should not add duplicate items", statesArray.length, stateSet.states.size());
     [exec]     [javac] 	^^^^^^^^^^^^
     [exec]     [javac] The method assertEquals(String, int, int) is undefined for the type AccessibleStateSetTest
     [exec]     [javac] ----------
     [exec]     [javac] 96. ERROR in /home/hybld/continuum-working-directory/6/classlib/modules/accessibility/src/test/api/java/common/javax/accessibility/AccessibleStateSetTest.java
     [exec]     [javac]  (at line 80)
     [exec]     [javac] 	testExceptionalCase(new NullPointerCase() {
     [exec]     [javac] 	                        ^^^^^^^^^^^^^^^
     [exec]     [javac] NullPointerCase cannot be resolved to a type
     [exec]     [javac] ----------
     [exec]     [javac] 97. ERROR in /home/hybld/continuum-working-directory/6/classlib/modules/accessibility/src/test/api/java/common/javax/accessibility/AccessibleStateSetTest.java
     [exec]     [javac]  (at line 89)
     [exec]     [javac] 	assertFalse("Should not remove non-existing item", removed);
     [exec]     [javac] 	^^^^^^^^^^^
     [exec]     [javac] The method assertFalse(String, boolean) is undefined for the type AccessibleStateSetTest
     [exec]     [javac] ----------
     [exec]     [javac] 98. ERROR in /home/hybld/continuum-working-directory/6/classlib/modules/accessibility/src/test/api/java/common/javax/accessibility/AccessibleStateSetTest.java
     [exec]     [javac]  (at line 91)
     [exec]     [javac] 	assertFalse("Should remove existing item", stateSet.contains(AccessibleState.ACTIVE));
     [exec]     [javac] 	^^^^^^^^^^^
     [exec]     [javac] The method assertFalse(String, boolean) is undefined for the type AccessibleStateSetTest
     [exec]     [javac] ----------
     [exec]     [javac] 99. ERROR in /home/hybld/continuum-working-directory/6/classlib/modules/accessibility/src/test/api/java/common/javax/accessibility/AccessibleStateSetTest.java
     [exec]     [javac]  (at line 92)
     [exec]     [javac] 	assertTrue("Should remove existing item", removed);
     [exec]     [javac] 	^^^^^^^^^^
     [exec]     [javac] The method assertTrue(String, boolean) is undefined for the type AccessibleStateSetTest
     [exec]     [javac] ----------
     [exec]     [javac] 100. ERROR in /home/hybld/continuum-working-directory/6/classlib/modules/accessibility/src/test/api/java/common/javax/accessibility/AccessibleStateSetTest.java
     [exec]     [javac]  (at line 98)
     [exec]     [javac] 	assertEquals("Cleared set should be empty", 0, stateSet.states.size());
     [exec]     [javac] 	^^^^^^^^^^^^
     [exec]     [javac] The method assertEquals(String, int, int) is undefined for the type AccessibleStateSetTest
     [exec]     [javac] ----------
     [exec]     [javac] 101. ERROR in /home/hybld/continuum-working-directory/6/classlib/modules/accessibility/src/test/api/java/common/javax/accessibility/AccessibleStateSetTest.java
     [exec]     [javac]  (at line 106)
     [exec]     [javac] 	assertTrue("String representation should contain elements representation",
     [exec]     [javac] 	^^^^^^^^^^
     [exec]     [javac] The method assertTrue(String, boolean) is undefined for the type AccessibleStateSetTest
     [exec]     [javac] ----------
     [exec]     [javac] 102. ERROR in /home/hybld/continuum-working-directory/6/classlib/modules/accessibility/src/test/api/java/common/javax/accessibility/AccessibleStateSetTest.java
     [exec]     [javac]  (at line 108)
     [exec]     [javac] 	assertTrue("String representation should contain elements representation",
     [exec]     [javac] 	^^^^^^^^^^
     [exec]     [javac] The method assertTrue(String, boolean) is undefined for the type AccessibleStateSetTest
     [exec]     [javac] ----------
     [exec]     [javac] 103. ERROR in /home/hybld/continuum-working-directory/6/classlib/modules/accessibility/src/test/api/java/common/javax/accessibility/AccessibleStateSetTest.java
     [exec]     [javac]  (at line 117)
     [exec]     [javac] 	fail("NullPointerException expected");
     [exec]     [javac] 	^^^^
     [exec]     [javac] The method fail(String) is undefined for the type AccessibleStateSetTest
     [exec]     [javac] ----------
     [exec]     [javac] 104. ERROR in /home/hybld/continuum-working-directory/6/classlib/modules/accessibility/src/test/api/java/common/javax/accessibility/AccessibleStateSetTest.java
     [exec]     [javac]  (at line 125)
     [exec]     [javac] 	assertEquals("Returned array size don't match",
     [exec]     [javac] 	^^^^^^^^^^^^
     [exec]     [javac] The method assertEquals(String, int, int) is undefined for the type AccessibleStateSetTest
     [exec]     [javac] ----------
     [exec]     [javac] 105. ERROR in /home/hybld/continuum-working-directory/6/classlib/modules/accessibility/src/test/api/java/common/javax/accessibility/AccessibleStateSetTest.java
     [exec]     [javac]  (at line 128)
     [exec]     [javac] 	assertEquals("Returned element mismatch:" + i, statesArray[i], statesReturnedArray[i]);
     [exec]     [javac] 	^^^^^^^^^^^^
     [exec]     [javac] The method assertEquals(String, AccessibleState, AccessibleState) is undefined for the type AccessibleStateSetTest
     [exec]     [javac] ----------
     [exec]     [javac] ----------
     [exec]     [javac] 106. ERROR in /home/hybld/continuum-working-directory/6/classlib/modules/accessibility/src/test/api/java/common/javax/accessibility/AccessibleStateTest.java
     [exec]     [javac]  (at line 25)
     [exec]     [javac] 	import javax.swing.BasicSwingTestCase;
     [exec]     [javac] 	       ^^^^^^^^^^^^^^^^^^^^^^^^^^^^^^
     [exec]     [javac] The import javax.swing.BasicSwingTestCase cannot be resolved
     [exec]     [javac] ----------
     [exec]     [javac] 107. ERROR in /home/hybld/continuum-working-directory/6/classlib/modules/accessibility/src/test/api/java/common/javax/accessibility/AccessibleStateTest.java
     [exec]     [javac]  (at line 27)
     [exec]     [javac] 	public class AccessibleStateTest extends BasicSwingTestCase {
     [exec]     [javac] 	                                         ^^^^^^^^^^^^^^^^^^
     [exec]     [javac] BasicSwingTestCase cannot be resolved to a type
     [exec]     [javac] ----------

...

     [exec]     [javac] 108. ERROR in /home/hybld/continuum-working-directory/6/classlib/modules/accessibility/src/test/api/java/common/javax/accessibility/AccessibleStateTest.java
     [exec]     [javac]  (at line 37)
     [exec]     [javac] 	assertEquals(key, state.key);
     [exec]     [javac] 	^^^^^^^^^^^^
     [exec]     [javac] The method assertEquals(String, String) is undefined for the type AccessibleStateTest
     [exec]     [javac] ----------
     [exec]     [javac] 109. ERROR in /home/hybld/continuum-working-directory/6/classlib/modules/accessibility/src/test/api/java/common/javax/accessibility/AccessibleStateTest.java
     [exec]     [javac]  (at line 38)
     [exec]     [javac] 	assertEquals(key, state.toDisplayString());
     [exec]     [javac] 	^^^^^^^^^^^^
     [exec]     [javac] The method assertEquals(String, String) is undefined for the type AccessibleStateTest
     [exec]     [javac] ----------
     [exec]     [javac] 109 problems (109 errors)

     [exec] BUILD FAILED
     [exec] /home/hybld/continuum-working-directory/6/classlib/build.xml:167: The following error occurred while executing this line:
     [exec] /home/hybld/continuum-working-directory/6/classlib/make/build-test.xml:52: The following error occurred while executing this line:
     [exec] /home/hybld/continuum-working-directory/6/classlib/make/properties.xml:267: The following error occurred while executing this line:
     [exec] /home/hybld/continuum-working-directory/6/classlib/modules/accessibility/build.xml:149: Compile failed; see the compiler error output for details.

     [exec] Total time: 22 seconds
     [exec] Result: 1
     [echo] Tests.failed is set to true

check-class-load-lists:
     [exec] Checking for class load lists in classlists/app
     [exec] Placing reports in classlib/build/classload
     [exec] Comparing jre in classlib/deploy/jdk/jre

...

     [exec] Processing package java.lang.management,:=========================================================================+++++++++++++++
     [exec] Processing package java.lang.ref,:=========================================================================+++++
     [exec] Processing package java.lang.reflect,:=========================================================================+++++++++++++++++++++
     [exec] Processing class ,java:
     [exec] Failed to Japize java: java.lang.RuntimeException: NoClassDefFoundError: java
     [exec] java.lang.RuntimeException: NoClassDefFoundError: java
     [exec] 	at net.wuffies.japi.ClassFile.forName(ClassFile.java:1592)
     [exec] 	at net.wuffies.japi.Japize.getClassWrapper(Japize.java:148)
     [exec] 	at net.wuffies.japi.Japize.japizeClass(Japize.java:748)
     [exec] 	at net.wuffies.japi.Japize.processClass(Japize.java:516)

...

     [exec] 	at net.wuffies.japi.Japize.doJapize(Japize.java:443)
     [exec] 	at net.wuffies.japi.Japize.main(Japize.java:316)

     [exec] Processing class ,javax:
     [exec] Failed to Japize javax: java.lang.RuntimeException: NoClassDefFoundError: javax
     [exec] java.lang.RuntimeException: NoClassDefFoundError: javax
     [exec] 	at net.wuffies.japi.ClassFile.forName(ClassFile.java:1592)
     [exec] 	at net.wuffies.japi.Japize.getClassWrapper(Japize.java:148)
     [exec] 	at net.wuffies.japi.Japize.japizeClass(Japize.java:748)
     [exec] 	at net.wuffies.japi.Japize.processClass(Japize.java:516)

...

     [exec] 	at net.wuffies.japi.Japize.doJapize(Japize.java:443)
     [exec] 	at net.wuffies.japi.Japize.main(Japize.java:316)

     [exec] Processing class ,org:
     [exec] Failed to Japize org: java.lang.RuntimeException: NoClassDefFoundError: org
     [exec] java.lang.RuntimeException: NoClassDefFoundError: org
     [exec] 	at net.wuffies.japi.ClassFile.forName(ClassFile.java:1592)
     [exec] 	at net.wuffies.japi.Japize.getClassWrapper(Japize.java:148)
     [exec] 	at net.wuffies.japi.Japize.japizeClass(Japize.java:748)
     [exec] 	at net.wuffies.japi.Japize.processClass(Japize.java:516)

...

    [mkdir] Created dir: /home/hybld/publish/20061128-0607
     [copy] Copying 3 files to /home/hybld/publish/20061128-0607
    [mkdir] Created dir: /home/hybld/publish/20061128-0607/test

BUILD FAILED
/home/hybld/continuum-working-directory/6/build.xml:310: /home/hybld/continuum-working-directory/6/classlib/build/test_report/html not found.

Total time: 11 minutes 6 seconds

****************************************************************************

...

Mime
View raw message