harmony-commits mailing list archives

Site index · List index
Message view « Date » · « Thread »
Top « Date » · « Thread »
From nom...@intel.com
Subject [continuum] SUSE lnx 1CPU gcc: classlib
Date Fri, 24 Nov 2006 21:00:15 GMT
BUILD FAILED:
	Ant Error Message:
/export/viv/trunk/cc/projects/classlib/trunk/build.xml:167: The following error occurred while
executing this line: /export/viv/trunk/cc/projects/classlib/trunk/make/build-test.xml:132:
There were test errors.

Date of build:	11/25/2006 01:07:21
Time to build:	112 minutes 3 seconds
Last changed:	11/25/2006 00:25:32
Last log entry:	adding the "beans.4f" message that is used by the Introspector class

***********************************************************
Errors/Warnings:	(20676)
            
Test org.apache.harmony.archive.tests.internal.pack200.bytecode.ClassFileEntryTest FAILED

***********************************************************
Unit Tests: (18711)
        
error: testUTF8 org.apache.harmony.archive.tests.internal.pack200.bytecode.ClassFileEntryTest
error: testSourceAttribute org.apache.harmony.archive.tests.internal.pack200.bytecode.ClassFileEntryTest
error: testCPInteger org.apache.harmony.archive.tests.internal.pack200.bytecode.ClassFileEntryTest
error: testCPLong org.apache.harmony.archive.tests.internal.pack200.bytecode.ClassFileEntryTest
error: testCPDouble org.apache.harmony.archive.tests.internal.pack200.bytecode.ClassFileEntryTest
error: testCPFloat org.apache.harmony.archive.tests.internal.pack200.bytecode.ClassFileEntryTest
error: testCPString org.apache.harmony.archive.tests.internal.pack200.bytecode.ClassFileEntryTest
error: testCPField org.apache.harmony.archive.tests.internal.pack200.bytecode.ClassFileEntryTest
Unit Test Error Details: 
		(9)
                
Test: testUTF8Class: org.apache.harmony.archive.tests.internal.pack200.bytecode.ClassFileEntryTestjava.lang.NoClassDefFoundError:
org/apache/harmony/archive/internal/pack200/bytecode/CPUTF8
	at java.lang.reflect.VMReflection.invokeMethod(Native Method)
Caused by: java.lang.ClassNotFoundException: org.apache.harmony.archive.internal.pack200.bytecode.CPUTF8
	at java.net.URLClassLoader.findClass(URLClassLoader.java:625)
	at java.lang.ClassLoader.loadClass(Unknown Source)
	at java.lang.ClassLoader$SystemClassLoader.loadClass(Unknown Source)
	at java.lang.ClassLoader.loadClass(Unknown Source)
	at java.lang.reflect.VMReflection.invokeMethod(Native Method)
	... 12 more

Test: testSourceAttributeClass: org.apache.harmony.archive.tests.internal.pack200.bytecode.ClassFileEntryTestjava.lang.NoClassDefFoundError:
org/apache/harmony/archive/internal/pack200/bytecode/SourceFileAttribute
	at java.lang.reflect.VMReflection.invokeMethod(Native Method)
Caused by: java.lang.ClassNotFoundException: org.apache.harmony.archive.internal.pack200.bytecode.SourceFileAttribute
	at java.net.URLClassLoader.findClass(URLClassLoader.java:625)
	at java.lang.ClassLoader.loadClass(Unknown Source)
	at java.lang.ClassLoader$SystemClassLoader.loadClass(Unknown Source)
	at java.lang.ClassLoader.loadClass(Unknown Source)
	at java.lang.reflect.VMReflection.invokeMethod(Native Method)
	... 12 more

Test: testCPIntegerClass: org.apache.harmony.archive.tests.internal.pack200.bytecode.ClassFileEntryTestjava.lang.NoClassDefFoundError:
org/apache/harmony/archive/internal/pack200/bytecode/CPInteger
	at java.lang.reflect.VMReflection.invokeMethod(Native Method)
Caused by: java.lang.ClassNotFoundException: org.apache.harmony.archive.internal.pack200.bytecode.CPInteger
	at java.net.URLClassLoader.findClass(URLClassLoader.java:625)
	at java.lang.ClassLoader.loadClass(Unknown Source)
	at java.lang.ClassLoader$SystemClassLoader.loadClass(Unknown Source)
	at java.lang.ClassLoader.loadClass(Unknown Source)
	at java.lang.reflect.VMReflection.invokeMethod(Native Method)
	... 12 more

Test: testCPLongClass: org.apache.harmony.archive.tests.internal.pack200.bytecode.ClassFileEntryTestjava.lang.NoClassDefFoundError:
org/apache/harmony/archive/internal/pack200/bytecode/CPLong
	at java.lang.reflect.VMReflection.invokeMethod(Native Method)
Caused by: java.lang.ClassNotFoundException: org.apache.harmony.archive.internal.pack200.bytecode.CPLong
	at java.net.URLClassLoader.findClass(URLClassLoader.java:625)
	at java.lang.ClassLoader.loadClass(Unknown Source)
	at java.lang.ClassLoader$SystemClassLoader.loadClass(Unknown Source)
	at java.lang.ClassLoader.loadClass(Unknown Source)
	at java.lang.reflect.VMReflection.invokeMethod(Native Method)
	... 12 more

Test: testCPDoubleClass: org.apache.harmony.archive.tests.internal.pack200.bytecode.ClassFileEntryTestjava.lang.NoClassDefFoundError:
org/apache/harmony/archive/internal/pack200/bytecode/CPDouble
	at java.lang.reflect.VMReflection.invokeMethod(Native Method)
Caused by: java.lang.ClassNotFoundException: org.apache.harmony.archive.internal.pack200.bytecode.CPDouble
	at java.net.URLClassLoader.findClass(URLClassLoader.java:625)
	at java.lang.ClassLoader.loadClass(Unknown Source)
	at java.lang.ClassLoader$SystemClassLoader.loadClass(Unknown Source)
	at java.lang.ClassLoader.loadClass(Unknown Source)
	at java.lang.reflect.VMReflection.invokeMethod(Native Method)
	... 12 more

Test: testCPFloatClass: org.apache.harmony.archive.tests.internal.pack200.bytecode.ClassFileEntryTestjava.lang.NoClassDefFoundError:
org/apache/harmony/archive/internal/pack200/bytecode/CPFloat
	at java.lang.reflect.VMReflection.invokeMethod(Native Method)
Caused by: java.lang.ClassNotFoundException: org.apache.harmony.archive.internal.pack200.bytecode.CPFloat
	at java.net.URLClassLoader.findClass(URLClassLoader.java:625)
	at java.lang.ClassLoader.loadClass(Unknown Source)
	at java.lang.ClassLoader$SystemClassLoader.loadClass(Unknown Source)
	at java.lang.ClassLoader.loadClass(Unknown Source)
	at java.lang.reflect.VMReflection.invokeMethod(Native Method)
	... 12 more

Test: testCPStringClass: org.apache.harmony.archive.tests.internal.pack200.bytecode.ClassFileEntryTestjava.lang.NoClassDefFoundError:
org/apache/harmony/archive/internal/pack200/bytecode/CPString
	at java.lang.reflect.VMReflection.invokeMethod(Native Method)
Caused by: java.lang.ClassNotFoundException: org.apache.harmony.archive.internal.pack200.bytecode.CPString
	at java.net.URLClassLoader.findClass(URLClassLoader.java:625)
	at java.lang.ClassLoader.loadClass(Unknown Source)
	at java.lang.ClassLoader$SystemClassLoader.loadClass(Unknown Source)
	at java.lang.ClassLoader.loadClass(Unknown Source)
	at java.lang.reflect.VMReflection.invokeMethod(Native Method)
	... 12 more

Test: testCPFieldClass: org.apache.harmony.archive.tests.internal.pack200.bytecode.ClassFileEntryTestjava.lang.NoClassDefFoundError:
org/apache/harmony/archive/internal/pack200/bytecode/CPMember
	at java.lang.reflect.VMReflection.invokeMethod(Native Method)
Caused by: java.lang.ClassNotFoundException: org.apache.harmony.archive.internal.pack200.bytecode.CPMember
	at java.net.URLClassLoader.findClass(URLClassLoader.java:625)
	at java.lang.ClassLoader.loadClass(Unknown Source)
	at java.lang.ClassLoader$SystemClassLoader.loadClass(Unknown Source)
	at java.lang.ClassLoader.loadClass(Unknown Source)
	at java.lang.reflect.VMReflection.invokeMethod(Native Method)
	... 12 more


***********************************************************
Modifications since last successful build:	(49)
            
modified ayza  /harmony/enhanced/classlib/trunk/modules/beans/src/main/java/org/apache/harmony/beans/internal/nls/messages.properties
11/25/2006 00:25:32 adding the "beans.4f" message that is used by the Introspector class
modified ayza  /harmony/enhanced/classlib/trunk/modules/beans/src/main/java/java/beans/IndexedPropertyDescriptor.java
11/25/2006 00:17:18 Fix for equals() method, corrects two failures in IndexedPropertyDescriptorTest
modified apetrenko  /harmony/enhanced/classlib/trunk/modules/archive/src/test/java/org/apache/harmony/archive/tests/internal/pack200/AllTests.java
11/24/2006 22:29:49 Patch for HARMONY-2246 "[classlib][pack200] Ongoing implementation"
added apetrenko  /harmony/enhanced/classlib/trunk/modules/archive/src/test/java/org/apache/harmony/archive/tests/internal/pack200/bytecode
11/24/2006 22:29:49 Patch for HARMONY-2246 "[classlib][pack200] Ongoing implementation"
added apetrenko  /harmony/enhanced/classlib/trunk/modules/archive/src/test/java/org/apache/harmony/archive/tests/internal/pack200/bytecode/ConstantPoolTest.java
11/24/2006 22:29:49 Patch for HARMONY-2246 "[classlib][pack200] Ongoing implementation"
modified apetrenko  /harmony/enhanced/classlib/trunk/modules/archive/build.xml 11/24/2006
22:29:49 Patch for HARMONY-2246 "[classlib][pack200] Ongoing implementation"
added apetrenko  /harmony/enhanced/classlib/trunk/modules/archive/src/test/java/org/apache/harmony/archive/tests/internal/pack200/bytecode/ClassFileEntryTest.java
11/24/2006 22:29:49 Patch for HARMONY-2246 "[classlib][pack200] Ongoing implementation"
added apetrenko  /harmony/enhanced/classlib/trunk/modules/archive/src/main/java/org/apache/harmony/archive/internal/pack200/bytecode/CPMember.java
11/24/2006 22:28:57 Patch for HARMONY-2246 "[classlib][pack200] Ongoing implementation"
added apetrenko  /harmony/enhanced/classlib/trunk/modules/archive/src/main/java/org/apache/harmony/archive/internal/pack200/bytecode/CPDouble.java
11/24/2006 22:28:57 Patch for HARMONY-2246 "[classlib][pack200] Ongoing implementation"
modified apetrenko  /harmony/enhanced/classlib/trunk/modules/archive/src/main/java/org/apache/harmony/archive/internal/pack200/AttributeLayoutMap.java
11/24/2006 22:28:57 Patch for HARMONY-2246 "[classlib][pack200] Ongoing implementation"
added apetrenko  /harmony/enhanced/classlib/trunk/modules/archive/src/main/java/org/apache/harmony/archive/internal/pack200/bytecode/CPMethod.java
11/24/2006 22:28:57 Patch for HARMONY-2246 "[classlib][pack200] Ongoing implementation"
added apetrenko  /harmony/enhanced/classlib/trunk/modules/archive/src/main/java/org/apache/harmony/archive/internal/pack200/bytecode/CPFieldRef.java
11/24/2006 22:28:57 Patch for HARMONY-2246 "[classlib][pack200] Ongoing implementation"
added apetrenko  /harmony/enhanced/classlib/trunk/modules/archive/src/main/java/org/apache/harmony/archive/internal/pack200/bytecode/Attribute.java
11/24/2006 22:28:57 Patch for HARMONY-2246 "[classlib][pack200] Ongoing implementation"
modified apetrenko  /harmony/enhanced/classlib/trunk/modules/archive/src/main/java/org/apache/harmony/archive/internal/pack200/AttributeLayout.java
11/24/2006 22:28:57 Patch for HARMONY-2246 "[classlib][pack200] Ongoing implementation"
modified apetrenko  /harmony/enhanced/classlib/trunk/modules/archive/src/main/java/org/apache/harmony/archive/internal/pack200/Segment.java
11/24/2006 22:28:57 Patch for HARMONY-2246 "[classlib][pack200] Ongoing implementation"
added apetrenko  /harmony/enhanced/classlib/trunk/modules/archive/src/main/java/org/apache/harmony/archive/internal/pack200/bytecode/ClassFile.java
11/24/2006 22:28:57 Patch for HARMONY-2246 "[classlib][pack200] Ongoing implementation"
added apetrenko  /harmony/enhanced/classlib/trunk/modules/archive/src/main/java/org/apache/harmony/archive/internal/pack200/bytecode/ConstantPoolEntry.java
11/24/2006 22:28:57 Patch for HARMONY-2246 "[classlib][pack200] Ongoing implementation"
added apetrenko  /harmony/enhanced/classlib/trunk/modules/archive/src/main/java/org/apache/harmony/archive/internal/pack200/bytecode/ExceptionsAttribute.java
11/24/2006 22:28:57 Patch for HARMONY-2246 "[classlib][pack200] Ongoing implementation"
added apetrenko  /harmony/enhanced/classlib/trunk/modules/archive/src/main/java/org/apache/harmony/archive/internal/pack200/bytecode/CPField.java
11/24/2006 22:28:57 Patch for HARMONY-2246 "[classlib][pack200] Ongoing implementation"
deleted apetrenko  /harmony/enhanced/classlib/trunk/modules/archive/src/main/java/org/apache/harmony/archive/internal/pack200/ClassFile.java
11/24/2006 22:28:57 Patch for HARMONY-2246 "[classlib][pack200] Ongoing implementation"
deleted apetrenko  /harmony/enhanced/classlib/trunk/modules/archive/src/main/java/org/apache/harmony/archive/internal/pack200/ConstantPoolEntry.java
11/24/2006 22:28:57 Patch for HARMONY-2246 "[classlib][pack200] Ongoing implementation"
added apetrenko  /harmony/enhanced/classlib/trunk/modules/archive/src/main/java/org/apache/harmony/archive/internal/pack200/bytecode/ClassConstantPool.java
11/24/2006 22:28:57 Patch for HARMONY-2246 "[classlib][pack200] Ongoing implementation"
added apetrenko  /harmony/enhanced/classlib/trunk/modules/archive/src/main/java/org/apache/harmony/archive/internal/pack200/bytecode/CPUTF8.java
11/24/2006 22:28:57 Patch for HARMONY-2246 "[classlib][pack200] Ongoing implementation"
added apetrenko  /harmony/enhanced/classlib/trunk/modules/archive/src/main/java/org/apache/harmony/archive/internal/pack200/bytecode/ConstantValueAttribute.java
11/24/2006 22:28:57 Patch for HARMONY-2246 "[classlib][pack200] Ongoing implementation"
deleted apetrenko  /harmony/enhanced/classlib/trunk/modules/archive/src/main/java/org/apache/harmony/archive/internal/pack200/ClassConstantPool.java
11/24/2006 22:28:57 Patch for HARMONY-2246 "[classlib][pack200] Ongoing implementation"
added apetrenko  /harmony/enhanced/classlib/trunk/modules/archive/src/main/java/org/apache/harmony/archive/internal/pack200/bytecode/CPConstant.java
11/24/2006 22:28:57 Patch for HARMONY-2246 "[classlib][pack200] Ongoing implementation"
added apetrenko  /harmony/enhanced/classlib/trunk/modules/archive/src/main/java/org/apache/harmony/archive/internal/pack200/bytecode
11/24/2006 22:28:57 Patch for HARMONY-2246 "[classlib][pack200] Ongoing implementation"
added apetrenko  /harmony/enhanced/classlib/trunk/modules/archive/src/main/java/org/apache/harmony/archive/internal/pack200/bytecode/CPInteger.java
11/24/2006 22:28:57 Patch for HARMONY-2246 "[classlib][pack200] Ongoing implementation"
added apetrenko  /harmony/enhanced/classlib/trunk/modules/archive/src/main/java/org/apache/harmony/archive/internal/pack200/bytecode/CPLong.java
11/24/2006 22:28:57 Patch for HARMONY-2246 "[classlib][pack200] Ongoing implementation"
added apetrenko  /harmony/enhanced/classlib/trunk/modules/archive/src/main/java/org/apache/harmony/archive/internal/pack200/bytecode/SourceFileAttribute.java
11/24/2006 22:28:57 Patch for HARMONY-2246 "[classlib][pack200] Ongoing implementation"
added apetrenko  /harmony/enhanced/classlib/trunk/modules/archive/src/main/java/org/apache/harmony/archive/internal/pack200/bytecode/CPConstantNumber.java
11/24/2006 22:28:57 Patch for HARMONY-2246 "[classlib][pack200] Ongoing implementation"
added apetrenko  /harmony/enhanced/classlib/trunk/modules/archive/src/main/java/org/apache/harmony/archive/internal/pack200/bytecode/ClassFileEntry.java
11/24/2006 22:28:57 Patch for HARMONY-2246 "[classlib][pack200] Ongoing implementation"
added apetrenko  /harmony/enhanced/classlib/trunk/modules/archive/src/main/java/org/apache/harmony/archive/internal/pack200/bytecode/CPFloat.java
11/24/2006 22:28:57 Patch for HARMONY-2246 "[classlib][pack200] Ongoing implementation"
added apetrenko  /harmony/enhanced/classlib/trunk/modules/archive/src/main/java/org/apache/harmony/archive/internal/pack200/bytecode/CPClass.java
11/24/2006 22:28:57 Patch for HARMONY-2246 "[classlib][pack200] Ongoing implementation"
added apetrenko  /harmony/enhanced/classlib/trunk/modules/archive/src/main/java/org/apache/harmony/archive/internal/pack200/bytecode/CPNameAndType.java
11/24/2006 22:28:57 Patch for HARMONY-2246 "[classlib][pack200] Ongoing implementation"
deleted apetrenko  /harmony/enhanced/classlib/trunk/modules/archive/src/main/java/org/apache/harmony/archive/internal/pack200/ClassFileEntry.java
11/24/2006 22:28:57 Patch for HARMONY-2246 "[classlib][pack200] Ongoing implementation"
modified apetrenko  /harmony/enhanced/classlib/trunk/modules/archive/src/main/java/org/apache/harmony/archive/internal/pack200/Pack200PackerAdapter.java
11/24/2006 22:28:57 Patch for HARMONY-2246 "[classlib][pack200] Ongoing implementation"
added apetrenko  /harmony/enhanced/classlib/trunk/modules/archive/src/main/java/org/apache/harmony/archive/internal/pack200/bytecode/CPString.java
11/24/2006 22:28:57 Patch for HARMONY-2246 "[classlib][pack200] Ongoing implementation"
add cc-drlvm log20061124221134Lbuild.18 11/24/2006 22:11:34drlvm
add cc-drlvm log20061124192533Lbuild.17 11/24/2006 19:25:33drlvm
modified tellison  /harmony/enhanced/classlib/trunk/modules/security/src/main/java/common/java/security/Security.java
11/24/2006 18:26:29 Fix HARMONY-2163 ([classlib][security] Changing system property java.home
may cause incorrect initialization of java.security.Security class)Define default providers
where the java.security file cannot be found.
modified tellison  /harmony/enhanced/classlib/trunk/modules/portlib/src/main/native/thread/windows/makefile
11/24/2006 17:57:47 Combine hythread files into shared code to reduce duplication.
deleted tellison  /harmony/enhanced/classlib/trunk/modules/portlib/src/main/native/thread/linux/hythread.c
11/24/2006 17:57:47 Combine hythread files into shared code to reduce duplication.
modified tellison  /harmony/enhanced/classlib/trunk/modules/portlib/src/main/native/thread/linux/makefile
11/24/2006 17:57:47 Combine hythread files into shared code to reduce duplication.
added tellison  /harmony/enhanced/classlib/trunk/modules/portlib/src/main/native/thread/shared/hythread.c
11/24/2006 17:57:47 Combine hythread files into shared code to reduce duplication.
deleted tellison  /harmony/enhanced/classlib/trunk/modules/portlib/src/main/native/thread/windows/hythread.c
11/24/2006 17:57:47 Combine hythread files into shared code to reduce duplication.
modified mloenko  /harmony/enhanced/classlib/trunk/modules/security/src/test/impl/java/org/apache/harmony/security/tests/provider/crypto/SHA1PRNG_SecureRandomTest.java
11/24/2006 17:47:09 lower down probability of ONE MORE intermittent failure in the testsee
also HARMONY-2284[classlib][drlvm][security] intermittent failures of security module tests
modified mloenko  /harmony/enhanced/classlib/trunk/modules/security/src/test/impl/java/org/apache/harmony/security/tests/asn1/der/GeneralizedTimeTest.java
11/24/2006 17:46:01 applied patch for HARMONY-2302[classlib][security] o.a.h.security.asn1.ASN1GeneralizedTime
encodes milliseconds incorrectly
modified mloenko  /harmony/enhanced/classlib/trunk/modules/security/src/main/java/common/org/apache/harmony/security/asn1/ASN1GeneralizedTime.java
11/24/2006 17:46:01 applied patch for HARMONY-2302[classlib][security] o.a.h.security.asn1.ASN1GeneralizedTime
encodes milliseconds incorrectly

Mime
View raw message