harmony-commits mailing list archives

Site index · List index
Message view « Date » · « Thread »
Top « Date » · « Thread »
From nom...@hursley.ibm.com
Subject [continuum] BUILD FAILURE: Classlib/linux.ia32 Build/Test
Date Fri, 24 Nov 2006 17:04:27 GMT
Online report : http://people.apache.org/~hindessm/continuum/classlib/linux.ia32/2006/11/24/20061124-170427.failure.log.gz
Build statistics:
  State: Failed
  Previous State: Failed
  Started at: Fri, 24 Nov 2006 17:02:27 +0000
  Finished at: Fri, 24 Nov 2006 17:04:25 +0000
  Total time: 1m 58s
  Build Trigger: Schedule
  Exit code: 1
  Building machine hostname: hy2
  Operating system : Linux(unknown)
  Java version : 1.5.0_06(Sun Microsystems Inc.)

Changes
                            classlib/modules/archive/src/test/java/org/apache/harmony/archive/tests/internal/pack200/AllTests.java
            classlib/modules/archive/src/test/java/org/apache/harmony/archive/tests/internal/pack200/bytecode/ConstantPoolTest.java
            classlib/modules/archive/src/test/java/org/apache/harmony/archive/tests/internal/pack200/bytecode/ClassFileEntryTest.java
            classlib/modules/archive/src/main/java/org/apache/harmony/archive/internal/pack200/AttributeLayoutMap.java
            classlib/modules/archive/src/main/java/org/apache/harmony/archive/internal/pack200/AttributeLayout.java
            classlib/modules/archive/src/main/java/org/apache/harmony/archive/internal/pack200/Segment.java
            classlib/modules/archive/src/main/java/org/apache/harmony/archive/internal/pack200/Pack200PackerAdapter.java
            classlib/modules/archive/src/main/java/org/apache/harmony/archive/internal/pack200/bytecode/CPMethod.java
            classlib/modules/archive/src/main/java/org/apache/harmony/archive/internal/pack200/bytecode/CPFieldRef.java
            classlib/modules/archive/src/main/java/org/apache/harmony/archive/internal/pack200/bytecode/Attribute.java
            classlib/modules/archive/src/main/java/org/apache/harmony/archive/internal/pack200/bytecode/ClassFile.java
            classlib/modules/archive/src/main/java/org/apache/harmony/archive/internal/pack200/bytecode/ConstantPoolEntry.java
            classlib/modules/archive/src/main/java/org/apache/harmony/archive/internal/pack200/bytecode/ExceptionsAttribute.java
            classlib/modules/archive/src/main/java/org/apache/harmony/archive/internal/pack200/bytecode/CPField.java
            classlib/modules/archive/src/main/java/org/apache/harmony/archive/internal/pack200/bytecode/ClassConstantPool.java
            classlib/modules/archive/src/main/java/org/apache/harmony/archive/internal/pack200/bytecode/CPUTF8.java
            classlib/modules/archive/src/main/java/org/apache/harmony/archive/internal/pack200/bytecode/ConstantValueAttribute.java
            classlib/modules/archive/src/main/java/org/apache/harmony/archive/internal/pack200/bytecode/CPConstant.java
            classlib/modules/archive/src/main/java/org/apache/harmony/archive/internal/pack200/bytecode/CPInteger.java
            classlib/modules/archive/src/main/java/org/apache/harmony/archive/internal/pack200/bytecode/CPLong.java
            classlib/modules/archive/src/main/java/org/apache/harmony/archive/internal/pack200/bytecode/SourceFileAttribute.java
            classlib/modules/archive/src/main/java/org/apache/harmony/archive/internal/pack200/bytecode/CPConstantNumber.java
            classlib/modules/archive/src/main/java/org/apache/harmony/archive/internal/pack200/bytecode/ClassFileEntry.java
            classlib/modules/archive/src/main/java/org/apache/harmony/archive/internal/pack200/bytecode/CPNameAndType.java
            classlib/modules/archive/src/main/java/org/apache/harmony/archive/internal/pack200/bytecode/CPFloat.java
            classlib/modules/archive/src/main/java/org/apache/harmony/archive/internal/pack200/bytecode/CPClass.java
            classlib/modules/archive/src/main/java/org/apache/harmony/archive/internal/pack200/bytecode/CPString.java
            classlib/modules/archive/src/main/java/org/apache/harmony/archive/internal/pack200/bytecode/CPMember.java
            classlib/modules/archive/src/main/java/org/apache/harmony/archive/internal/pack200/bytecode/CPDouble.java
            classlib/modules/archive/build.xml

****************************************************************************
Output:
****************************************************************************
Buildfile: build.xml

build:
   [delete] Deleting directory /home/hybld/continuum-working-directory/6/classlib/deploy
     [echo] Classlib revision is 478913
     [echo] Post process: true
     [echo] JAPI: true
     [echo] Building with reference jdk/javac
     [exec] Buildfile: build.xml

     [exec] -init-hdk-for-clean:
     [exec]     [mkdir] Created dir: /home/hybld/continuum-working-directory/6/classlib/deploy/build/ant
     [exec]      [copy] Copying 1 file to /home/hybld/continuum-working-directory/6/classlib/deploy/build/ant

     [exec] clean-java:

     [exec] -modules-clean-bin:

     [exec] clean:
     [exec]    [delete] Deleting 30 files from /home/hybld/continuum-working-directory/6/classlib/build/classes
     [exec]    [delete] Deleting 15 files from /home/hybld/continuum-working-directory/6/classlib/modules/accessibility/bin/test

     [exec] clean:
     [exec]    [delete] Deleting 13 files from /home/hybld/continuum-working-directory/6/classlib/build/classes

     [exec] clean:
     [exec]    [delete] Deleting 35 files from /home/hybld/continuum-working-directory/6/classlib/build/classes
     [exec]    [delete] Deleting 1 files from /home/hybld/continuum-working-directory/6/classlib/modules/applet/bin/test

     [exec] clean:
     [exec]    [delete] Deleting 57 files from /home/hybld/continuum-working-directory/6/classlib/build/classes
     [exec]    [delete] Deleting 45 files from /home/hybld/continuum-working-directory/6/classlib/modules/archive/bin/test

     [exec] clean-native-includes:
     [exec]    [delete] /home/hybld/continuum-working-directory/6/classlib/deploy/include
not found.

     [exec] clean:
     [exec]    [delete] Deleting 112 files from /home/hybld/continuum-working-directory/6/classlib/build/classes
     [exec]    [delete] Deleting 224 files from /home/hybld/continuum-working-directory/6/classlib/modules/auth/bin/test

     [exec] clean:
     [exec]    [delete] Deleting 898 files from /home/hybld/continuum-working-directory/6/classlib/build/classes
     [exec]    [delete] Deleting 575 files from /home/hybld/continuum-working-directory/6/classlib/modules/awt/bin/test

     [exec] clean:
     [exec]    [delete] Deleting 107 files from /home/hybld/continuum-working-directory/6/classlib/build/classes
     [exec]    [delete] Deleting 236 files from /home/hybld/continuum-working-directory/6/classlib/modules/beans/bin/test

     [exec] clean:
     [exec]    [delete] Deleting 125 files from /home/hybld/continuum-working-directory/6/classlib/build/classes
     [exec]    [delete] /home/hybld/continuum-working-directory/6/classlib/modules/concurrent/bin/test
not found.

     [exec] clean:
     [exec]    [delete] Deleting 49 files from /home/hybld/continuum-working-directory/6/classlib/build/classes
     [exec]    [delete] Deleting 91 files from /home/hybld/continuum-working-directory/6/classlib/modules/crypto/bin/test

     [exec] clean:
     [exec]    [delete] Deleting 78 files from /home/hybld/continuum-working-directory/6/classlib/build/classes

     [exec] clean:
     [exec]    [delete] Deleting 9 files from /home/hybld/continuum-working-directory/6/classlib/build/classes
     [exec]    [delete] Deleting 20 files from /home/hybld/continuum-working-directory/6/classlib/modules/instrument/bin/test

     [exec] clean:
     [exec]    [delete] Deleting 154 files from /home/hybld/continuum-working-directory/6/classlib/build/classes
     [exec]    [delete] Deleting 163 files from /home/hybld/continuum-working-directory/6/classlib/modules/jndi/bin/test

     [exec] clean:
     [exec]    [delete] Deleting 15 files from /home/hybld/continuum-working-directory/6/classlib/build/classes
     [exec]    [delete] Deleting 2 files from /home/hybld/continuum-working-directory/6/classlib/modules/lang-management/bin/test

     [exec] clean:
     [exec]    [delete] Deleting 34 files from /home/hybld/continuum-working-directory/6/classlib/build/classes
     [exec]    [delete] Deleting 99 files from /home/hybld/continuum-working-directory/6/classlib/modules/logging/bin/test

     [exec] clean:
     [exec]    [delete] Deleting 965 files from /home/hybld/continuum-working-directory/6/classlib/build/classes
     [exec]    [delete] Deleting 883 files from /home/hybld/continuum-working-directory/6/classlib/modules/luni/bin/test

     [exec] clean-native-includes:
     [exec]    [delete] /home/hybld/continuum-working-directory/6/classlib/deploy/include
not found.
     [exec]    [delete] /home/hybld/continuum-working-directory/6/classlib/deploy/jdk/include
not found.

     [exec] clean:
     [exec]    [delete] Deleting 29 files from /home/hybld/continuum-working-directory/6/classlib/build/classes

     [exec] clean:
     [exec]    [delete] Deleting 14 files from /home/hybld/continuum-working-directory/6/classlib/build/classes
     [exec]    [delete] Deleting 25 files from /home/hybld/continuum-working-directory/6/classlib/modules/math/bin/test

     [exec] clean:
     [exec]    [delete] Deleting 14 files from /home/hybld/continuum-working-directory/6/classlib/build/classes

     [exec] clean:
     [exec]    [delete] Deleting 146 files from /home/hybld/continuum-working-directory/6/classlib/build/classes
     [exec]    [delete] Deleted 5 directories from /home/hybld/continuum-working-directory/6/classlib/build/classes
     [exec]    [delete] Deleting 156 files from /home/hybld/continuum-working-directory/6/classlib/modules/nio/bin/test
     [exec]    [delete] Deleted 19 directories from /home/hybld/continuum-working-directory/6/classlib/modules/nio/bin/test

     [exec] clean:
     [exec]    [delete] Deleting 20 files from /home/hybld/continuum-working-directory/6/classlib/build/classes
     [exec]    [delete] Deleting 77 files from /home/hybld/continuum-working-directory/6/classlib/modules/nio_char/bin/test

     [exec] clean:

     [exec] clean-native-includes:
     [exec]    [delete] /home/hybld/continuum-working-directory/6/classlib/deploy/include
not found.

     [exec] clean:
     [exec]    [delete] Deleting 32 files from /home/hybld/continuum-working-directory/6/classlib/build/classes

...

     [exec] -clean-bin-catch-all:
     [exec]    [delete] Deleting 8 files from /home/hybld/continuum-working-directory/6/classlib/build/classes
     [exec]    [delete] Deleted 304 directories from /home/hybld/continuum-working-directory/6/classlib/build/classes

     [exec] BUILD FAILED
     [exec] /home/hybld/continuum-working-directory/6/classlib/build.xml:123: The following
error occurred while executing this line:
     [exec] /home/hybld/continuum-working-directory/6/classlib/make/build-java.xml:96: ...

     [exec] Built files still exist after module clean targets have run.  This
     [exec] probably means that one or more patternsets are incomplete.  The
     [exec] remaining files are:

...

     [exec] /home/hybld/continuum-working-directory/6/classlib/build/classes/org/apache/harmony/archive/internal/pack200/ConstantPoolEntry.class

     [exec] Total time: 1 minute 53 seconds

BUILD FAILED
/home/hybld/continuum-working-directory/6/build.xml:114: exec returned: 1

Total time: 1 minute 57 seconds

****************************************************************************

...

Mime
View raw message