harmony-commits mailing list archives

Site index · List index
Message view « Date » · « Thread »
Top « Date » · « Thread »
From nom...@hursley.ibm.com
Subject [continuum] BUILD FAILURE: Classlib/linux.ia32 Build/Test
Date Thu, 09 Nov 2006 13:18:44 GMT
Online report : http://people.apache.org/~hindessm/continuum/classlib/linux.ia32/2006/11/09/20061109-131844.failure.log.gz
Build statistics:
  State: Failed
  Previous State: Failed
  Started at: Thu, 9 Nov 2006 11:07:57 +0000
  Finished at: Thu, 9 Nov 2006 13:18:42 +0000
  Total time: 2h 10m 45s
  Build Trigger: Schedule
  Exit code: 1
  Building machine hostname: hy2
  Operating system : Linux(unknown)
  Java version : 1.5.0_06(Sun Microsystems Inc.)

Changes
                            classlib/modules/beans/src/test/java/org/apache/harmony/beans/tests/java/beans/IntrospectorTest.java
            classlib/modules/beans/src/main/java/java/beans/PropertyDescriptor.java
            classlib/modules/beans/src/main/java/java/beans/IndexedPropertyDescriptor.java
        
****************************************************************************
Output:
****************************************************************************
Buildfile: build.xml

build:
   [delete] Deleting directory /home/hybld/continuum-working-directory/6/classlib/deploy
     [echo] Classlib revision is 472859
     [echo] Post process: true
     [echo] JAPI: true
     [echo] Building with reference jdk/javac
     [exec] Buildfile: build.xml

     [exec] -init-hdk-for-clean:
     [exec]     [mkdir] Created dir: /home/hybld/continuum-working-directory/6/classlib/deploy/build/ant
     [exec]      [copy] Copying 1 file to /home/hybld/continuum-working-directory/6/classlib/deploy/build/ant

     [exec] clean-java:

     [exec] -modules-clean-bin:

     [exec] clean:
     [exec]    [delete] Deleting 30 files from /home/hybld/continuum-working-directory/6/classlib/build/classes
     [exec]    [delete] Deleting 15 files from /home/hybld/continuum-working-directory/6/classlib/modules/accessibility/bin/test

     [exec] clean:
     [exec]    [delete] Deleting 13 files from /home/hybld/continuum-working-directory/6/classlib/build/classes

     [exec] clean:
     [exec]    [delete] Deleting 35 files from /home/hybld/continuum-working-directory/6/classlib/build/classes
     [exec]    [delete] Deleting 1 files from /home/hybld/continuum-working-directory/6/classlib/modules/applet/bin/test

     [exec] clean:
     [exec]    [delete] Deleting 65 files from /home/hybld/continuum-working-directory/6/classlib/build/classes
     [exec]    [delete] Deleting 45 files from /home/hybld/continuum-working-directory/6/classlib/modules/archive/bin/test

     [exec] clean-native-includes:
     [exec]    [delete] /home/hybld/continuum-working-directory/6/classlib/deploy/include not found.

     [exec] clean:
     [exec]    [delete] Deleting 110 files from /home/hybld/continuum-working-directory/6/classlib/build/classes
     [exec]    [delete] Deleting 222 files from /home/hybld/continuum-working-directory/6/classlib/modules/auth/bin/test

     [exec] clean:
     [exec]    [delete] Deleting 898 files from /home/hybld/continuum-working-directory/6/classlib/build/classes
     [exec]    [delete] Deleting 582 files from /home/hybld/continuum-working-directory/6/classlib/modules/awt/bin/test

     [exec] clean:
     [exec]    [delete] Deleting 107 files from /home/hybld/continuum-working-directory/6/classlib/build/classes
     [exec]    [delete] Deleting 234 files from /home/hybld/continuum-working-directory/6/classlib/modules/beans/bin/test

     [exec] clean:
     [exec]    [delete] Deleting 125 files from /home/hybld/continuum-working-directory/6/classlib/build/classes
     [exec]    [delete] /home/hybld/continuum-working-directory/6/classlib/modules/concurrent/bin/test not found.

     [exec] clean:
     [exec]    [delete] Deleting 49 files from /home/hybld/continuum-working-directory/6/classlib/build/classes
     [exec]    [delete] Deleting 91 files from /home/hybld/continuum-working-directory/6/classlib/modules/crypto/bin/test

     [exec] clean:
     [exec]    [delete] Deleting 59 files from /home/hybld/continuum-working-directory/6/classlib/build/classes

     [exec] clean:
     [exec]    [delete] Deleting 9 files from /home/hybld/continuum-working-directory/6/classlib/build/classes
     [exec]    [delete] Deleting 20 files from /home/hybld/continuum-working-directory/6/classlib/modules/instrument/bin/test

     [exec] clean:
     [exec]    [delete] Deleting 154 files from /home/hybld/continuum-working-directory/6/classlib/build/classes
     [exec]    [delete] Deleting 163 files from /home/hybld/continuum-working-directory/6/classlib/modules/jndi/bin/test

     [exec] clean:
     [exec]    [delete] Deleting 15 files from /home/hybld/continuum-working-directory/6/classlib/build/classes
     [exec]    [delete] Deleting 2 files from /home/hybld/continuum-working-directory/6/classlib/modules/lang-management/bin/test

     [exec] clean:
     [exec]    [delete] Deleting 34 files from /home/hybld/continuum-working-directory/6/classlib/build/classes
     [exec]    [delete] Deleting 99 files from /home/hybld/continuum-working-directory/6/classlib/modules/logging/bin/test

     [exec] clean:
     [exec]    [delete] Deleting 962 files from /home/hybld/continuum-working-directory/6/classlib/build/classes
     [exec]    [delete] Deleting 872 files from /home/hybld/continuum-working-directory/6/classlib/modules/luni/bin/test

     [exec] clean-native-includes:
     [exec]    [delete] /home/hybld/continuum-working-directory/6/classlib/deploy/include not found.
     [exec]    [delete] /home/hybld/continuum-working-directory/6/classlib/deploy/jdk/include not found.

     [exec] clean:
     [exec]    [delete] Deleting 29 files from /home/hybld/continuum-working-directory/6/classlib/build/classes

     [exec] clean:
     [exec]    [delete] Deleting 14 files from /home/hybld/continuum-working-directory/6/classlib/build/classes
     [exec]    [delete] Deleting 25 files from /home/hybld/continuum-working-directory/6/classlib/modules/math/bin/test

     [exec] clean:
     [exec]    [delete] Deleting 14 files from /home/hybld/continuum-working-directory/6/classlib/build/classes

     [exec] clean:
     [exec]    [delete] Deleting 146 files from /home/hybld/continuum-working-directory/6/classlib/build/classes
     [exec]    [delete] Deleted 5 directories from /home/hybld/continuum-working-directory/6/classlib/build/classes
     [exec]    [delete] Deleting 156 files from /home/hybld/continuum-working-directory/6/classlib/modules/nio/bin/test
     [exec]    [delete] Deleted 19 directories from /home/hybld/continuum-working-directory/6/classlib/modules/nio/bin/test

     [exec] clean:
     [exec]    [delete] Deleting 20 files from /home/hybld/continuum-working-directory/6/classlib/build/classes
     [exec]    [delete] Deleting 77 files from /home/hybld/continuum-working-directory/6/classlib/modules/nio_char/bin/test

     [exec] clean:

     [exec] clean-native-includes:
     [exec]    [delete] /home/hybld/continuum-working-directory/6/classlib/deploy/include not found.

     [exec] clean:
     [exec]    [delete] Deleting 32 files from /home/hybld/continuum-working-directory/6/classlib/build/classes
     [exec]    [delete] Deleting 34 files from /home/hybld/continuum-working-directory/6/classlib/modules/prefs/bin/test

     [exec] clean:
     [exec]    [delete] Deleting 205 files from /home/hybld/continuum-working-directory/6/classlib/build/classes
     [exec]    [delete] Deleting 60 files from /home/hybld/continuum-working-directory/6/classlib/modules/print/bin/test

     [exec] clean:
     [exec]    [delete] Deleting 156 files from /home/hybld/continuum-working-directory/6/classlib/build/classes
     [exec]    [delete] Deleting 12 files from /home/hybld/continuum-working-directory/6/classlib/modules/regex/bin/test

     [exec] clean:
     [exec]    [delete] Deleting 230 files from /home/hybld/continuum-working-directory/6/classlib/build/classes
     [exec]    [delete] Deleting 47 files from /home/hybld/continuum-working-directory/6/classlib/modules/rmi/bin/test

     [exec] clean:
     [exec]    [delete] Deleting 410 files from /home/hybld/continuum-working-directory/6/classlib/build/classes
     [exec]    [delete] Deleting 601 files from /home/hybld/continuum-working-directory/6/classlib/modules/security/bin/test

     [exec] clean:
     [exec]    [delete] Deleting 2 files from /home/hybld/continuum-working-directory/6/classlib/build/classes

     [exec] clean:
     [exec]    [delete] Deleting 72 files from /home/hybld/continuum-working-directory/6/classlib/build/classes
     [exec]    [delete] Deleting 34 files from /home/hybld/continuum-working-directory/6/classlib/modules/sound/bin/test

     [exec] clean:
     [exec]    [delete] Deleting 69 files from /home/hybld/continuum-working-directory/6/classlib/build/classes
     [exec]    [delete] Deleting 42 files from /home/hybld/continuum-working-directory/6/classlib/modules/sql/bin/test

     [exec] clean:
     [exec]    [delete] Deleting 5 files from /home/hybld/continuum-working-directory/6/classlib/build/classes

     [exec] clean:
     [exec]    [delete] Deleting 1591 files from /home/hybld/continuum-working-directory/6/classlib/build/classes
     [exec]    [delete] Deleting 1494 files from /home/hybld/continuum-working-directory/6/classlib/modules/swing/bin/test

     [exec] clean:
     [exec]    [delete] Deleting 40 files from /home/hybld/continuum-working-directory/6/classlib/build/classes
     [exec]    [delete] Deleting 32 files from /home/hybld/continuum-working-directory/6/classlib/modules/text/bin/test

     [exec] clean:
     [exec]    [delete] Deleting 33 files from /home/hybld/continuum-working-directory/6/classlib/build/classes
     [exec]    [delete] Deleting 4 files from /home/hybld/continuum-working-directory/6/classlib/modules/tools/bin/test

     [exec] clean:
     [exec]    [delete] Deleting 123 files from /home/hybld/continuum-working-directory/6/classlib/build/classes
     [exec]    [delete] Deleting 52 files from /home/hybld/continuum-working-directory/6/classlib/modules/x-net/bin/test

     [exec] -clean-bin-catch-all-test:

     [exec] -clean-bin-catch-all:
     [exec]    [delete] Deleted 299 directories from /home/hybld/continuum-working-directory/6/classlib/build/classes

     [exec] -clean-bin:

     [exec] -clean-layout:
     [exec]    [delete] /home/hybld/continuum-working-directory/6/classlib/deploy/jdk not found.

...

     [exec]     [javac] ----------
     [exec]     [javac] 3. WARNING in /home/hybld/continuum-working-directory/6/classlib/modules/tools/src/main/java/org/apache/harmony/tools/keytool/CertChainVerifier.java
     [exec]     [javac]  (at line 477)
     [exec]     [javac] 	selfSignedTAs.add(ta);
     [exec]     [javac] 	^^^^^^^^^^^^^^^^^^^^^
     [exec]     [javac] Type safety: The method add(Object) belongs to the raw type Set. References to generic type Set<E> should be parameterized
     [exec]     [javac] ----------
     [exec]     [javac] 4. WARNING in /home/hybld/continuum-working-directory/6/classlib/modules/tools/src/main/java/org/apache/harmony/tools/keytool/CertChainVerifier.java
     [exec]     [javac]  (at line 478)
     [exec]     [javac] 	selfSignedTAsCerts.add(trCert);

...

     [exec]     [javac] 	^^^^^^^^^^^^^^^^^^^^^^^^^^^^^^
     [exec]     [javac] Type safety: The method add(Object) belongs to the raw type Collection. References to generic type Collection<E> should be parameterized
     [exec]     [javac] ----------
     [exec]     [javac] 5. WARNING in /home/hybld/continuum-working-directory/6/classlib/modules/tools/src/main/java/org/apache/harmony/tools/keytool/CertChainVerifier.java
     [exec]     [javac]  (at line 481)
     [exec]     [javac] 	trustedCerts.add(trCert);

...

     [exec]     [javac] 	^^^^^^^^^^^^^^^^^^^^^^^^
     [exec]     [javac] Type safety: The method add(Object) belongs to the raw type Collection. References to generic type Collection<E> should be parameterized
     [exec]     [javac] ----------
     [exec]     [javac] 6. WARNING in /home/hybld/continuum-working-directory/6/classlib/modules/tools/src/main/java/org/apache/harmony/tools/keytool/CertChainVerifier.java
     [exec]     [javac]  (at line 543)
     [exec]     [javac] 	selfSignedTAs.add(ta);

...

     [exec]     [javac] 	^^^^^^^^^^^^^^^^^^^^^
     [exec]     [javac] Type safety: The method add(Object) belongs to the raw type Set. References to generic type Set<E> should be parameterized
     [exec]     [javac] ----------
     [exec]     [javac] 7. WARNING in /home/hybld/continuum-working-directory/6/classlib/modules/tools/src/main/java/org/apache/harmony/tools/keytool/CertChainVerifier.java
     [exec]     [javac]  (at line 544)
     [exec]     [javac] 	selfSignedTAsCerts.add(trCert);

...

     [exec]     [javac] 	^^^^^^^^^^^^^^^^^^^^^^^^^^^^^^
     [exec]     [javac] Type safety: The method add(Object) belongs to the raw type Collection. References to generic type Collection<E> should be parameterized
     [exec]     [javac] ----------
     [exec]     [javac] 8. WARNING in /home/hybld/continuum-working-directory/6/classlib/modules/tools/src/main/java/org/apache/harmony/tools/keytool/CertChainVerifier.java
     [exec]     [javac]  (at line 547)
     [exec]     [javac] 	trustedCerts.add(trCert);

...

     [exec]     [javac] 	^^^^^^^^^^^^^^^^^^^^^^^^
     [exec]     [javac] Type safety: The method add(Object) belongs to the raw type Collection. References to generic type Collection<E> should be parameterized
     [exec]     [javac] ----------
     [exec]     [javac] ----------
     [exec]     [javac] 9. WARNING in /home/hybld/continuum-working-directory/6/classlib/modules/tools/src/main/java/org/apache/harmony/tools/keytool/CertImporter.java
     [exec]     [javac]  (at line 80)

...

     [exec]     [javac] ----------
     [exec]     [javac] 1. WARNING in /home/hybld/continuum-working-directory/6/classlib/modules/archive/src/test/java/org/apache/harmony/archive/tests/internal/pack200/CodecEncodingTest.java
     [exec]     [javac]  (at line 43)
     [exec]     [javac] 	map.put(new Integer(1), "(1,256)");
     [exec]     [javac] 	^^^^^^^^^^^^^^^^^^^^^^^^^^^^^^^^^^
     [exec]     [javac] Type safety: The method put(Object, Object) belongs to the raw type Map. References to generic type Map<K,V> should be parameterized
     [exec]     [javac] ----------
     [exec]     [javac] 2. WARNING in /home/hybld/continuum-working-directory/6/classlib/modules/archive/src/test/java/org/apache/harmony/archive/tests/internal/pack200/CodecEncodingTest.java
     [exec]     [javac]  (at line 44)
     [exec]     [javac] 	map.put(new Integer(2), "(1,256,1)");

...

     [exec]     [javac] 	^^^^^^^^^^^^^^^^^^^^^^^^^^^^^^^^^^^^
     [exec]     [javac] Type safety: The method put(Object, Object) belongs to the raw type Map. References to generic type Map<K,V> should be parameterized
     [exec]     [javac] ----------
     [exec]     [javac] 3. WARNING in /home/hybld/continuum-working-directory/6/classlib/modules/archive/src/test/java/org/apache/harmony/archive/tests/internal/pack200/CodecEncodingTest.java
     [exec]     [javac]  (at line 45)
     [exec]     [javac] 	map.put(new Integer(3), "(1,256,0,1)");

...

     [exec]     [javac] 	^^^^^^^^^^^^^^^^^^^^^^^^^^^^^^^^^^^^^^
     [exec]     [javac] Type safety: The method put(Object, Object) belongs to the raw type Map. References to generic type Map<K,V> should be parameterized
     [exec]     [javac] ----------
     [exec]     [javac] 4. WARNING in /home/hybld/continuum-working-directory/6/classlib/modules/archive/src/test/java/org/apache/harmony/archive/tests/internal/pack200/CodecEncodingTest.java
     [exec]     [javac]  (at line 46)
     [exec]     [javac] 	map.put(new Integer(4), "(1,256,1,1)");

...

     [exec]     [javac] 	^^^^^^^^^^^^^^^^^^^^^^^^^^^^^^^^^^^^^^
     [exec]     [javac] Type safety: The method put(Object, Object) belongs to the raw type Map. References to generic type Map<K,V> should be parameterized
     [exec]     [javac] ----------
     [exec]     [javac] 5. WARNING in /home/hybld/continuum-working-directory/6/classlib/modules/archive/src/test/java/org/apache/harmony/archive/tests/internal/pack200/CodecEncodingTest.java
     [exec]     [javac]  (at line 47)
     [exec]     [javac] 	map.put(new Integer(5), "(2,256)");

...

     [exec]     [javac] 	^^^^^^^^^^^^^^^^^^^^^^^^^^^^^^^^^^
     [exec]     [javac] Type safety: The method put(Object, Object) belongs to the raw type Map. References to generic type Map<K,V> should be parameterized
     [exec]     [javac] ----------
     [exec]     [javac] 6. WARNING in /home/hybld/continuum-working-directory/6/classlib/modules/archive/src/test/java/org/apache/harmony/archive/tests/internal/pack200/CodecEncodingTest.java
     [exec]     [javac]  (at line 48)
     [exec]     [javac] 	map.put(new Integer(6), "(2,256,1)");

...

     [exec]     [javac] 	^^^^^^^^^^^^^^^^^^^^^^^^^^^^^^^^^^^^
     [exec]     [javac] Type safety: The method put(Object, Object) belongs to the raw type Map. References to generic type Map<K,V> should be parameterized
     [exec]     [javac] ----------
     [exec]     [javac] 7. WARNING in /home/hybld/continuum-working-directory/6/classlib/modules/archive/src/test/java/org/apache/harmony/archive/tests/internal/pack200/CodecEncodingTest.java
     [exec]     [javac]  (at line 49)
     [exec]     [javac] 	map.put(new Integer(7), "(2,256,0,1)");

...

     [exec]     [javac] 	^^^^^^^^^^^^^^^^^^^^^^^^^^^^^^^^^^^^^^
     [exec]     [javac] Type safety: The method put(Object, Object) belongs to the raw type Map. References to generic type Map<K,V> should be parameterized
     [exec]     [javac] ----------
     [exec]     [javac] 8. WARNING in /home/hybld/continuum-working-directory/6/classlib/modules/archive/src/test/java/org/apache/harmony/archive/tests/internal/pack200/CodecEncodingTest.java
     [exec]     [javac]  (at line 50)
     [exec]     [javac] 	map.put(new Integer(8), "(2,256,1,1)");

...

     [exec]     [javac] 	^^^^^^^^^^^^^^^^^^^^^^^^^^^^^^^^^^^^^^
     [exec]     [javac] Type safety: The method put(Object, Object) belongs to the raw type Map. References to generic type Map<K,V> should be parameterized
     [exec]     [javac] ----------
     [exec]     [javac] 9. WARNING in /home/hybld/continuum-working-directory/6/classlib/modules/archive/src/test/java/org/apache/harmony/archive/tests/internal/pack200/CodecEncodingTest.java
     [exec]     [javac]  (at line 51)
     [exec]     [javac] 	map.put(new Integer(9), "(3,256)");

...

     [exec]     [javac] 	^^^^^^^^^^^^^^^^^^^^^^^^^^^^^^^^^^
     [exec]     [javac] Type safety: The method put(Object, Object) belongs to the raw type Map. References to generic type Map<K,V> should be parameterized
     [exec]     [javac] ----------
     [exec]     [javac] 10. WARNING in /home/hybld/continuum-working-directory/6/classlib/modules/archive/src/test/java/org/apache/harmony/archive/tests/internal/pack200/CodecEncodingTest.java
     [exec]     [javac]  (at line 52)
     [exec]     [javac] 	map.put(new Integer(10), "(3,256,1)");

...

     [exec]     [javac] 	^^^^^^^^^^^^^^^^^^^^^^^^^^^^^^^^^^^^^
     [exec]     [javac] Type safety: The method put(Object, Object) belongs to the raw type Map. References to generic type Map<K,V> should be parameterized
     [exec]     [javac] ----------
     [exec]     [javac] 11. WARNING in /home/hybld/continuum-working-directory/6/classlib/modules/archive/src/test/java/org/apache/harmony/archive/tests/internal/pack200/CodecEncodingTest.java
     [exec]     [javac]  (at line 53)
     [exec]     [javac] 	map.put(new Integer(11), "(3,256,0,1)");

...

     [exec]     [javac] 	^^^^^^^^^^^^^^^^^^^^^^^^^^^^^^^^^^^^^^^
     [exec]     [javac] Type safety: The method put(Object, Object) belongs to the raw type Map. References to generic type Map<K,V> should be parameterized
     [exec]     [javac] ----------
     [exec]     [javac] 12. WARNING in /home/hybld/continuum-working-directory/6/classlib/modules/archive/src/test/java/org/apache/harmony/archive/tests/internal/pack200/CodecEncodingTest.java
     [exec]     [javac]  (at line 54)
     [exec]     [javac] 	map.put(new Integer(12), "(3,256,1,1)");

...

     [exec]     [javac] 	^^^^^^^^^^^^^^^^^^^^^^^^^^^^^^^^^^^^^^^
     [exec]     [javac] Type safety: The method put(Object, Object) belongs to the raw type Map. References to generic type Map<K,V> should be parameterized
     [exec]     [javac] ----------
     [exec]     [javac] 13. WARNING in /home/hybld/continuum-working-directory/6/classlib/modules/archive/src/test/java/org/apache/harmony/archive/tests/internal/pack200/CodecEncodingTest.java
     [exec]     [javac]  (at line 55)
     [exec]     [javac] 	map.put(new Integer(13), "(4,256)");

...

     [exec]     [javac] 	^^^^^^^^^^^^^^^^^^^^^^^^^^^^^^^^^^^
     [exec]     [javac] Type safety: The method put(Object, Object) belongs to the raw type Map. References to generic type Map<K,V> should be parameterized
     [exec]     [javac] ----------
     [exec]     [javac] 14. WARNING in /home/hybld/continuum-working-directory/6/classlib/modules/archive/src/test/java/org/apache/harmony/archive/tests/internal/pack200/CodecEncodingTest.java
     [exec]     [javac]  (at line 56)
     [exec]     [javac] 	map.put(new Integer(14), "(4,256,1)");

...

     [exec]     [javac] 	^^^^^^^^^^^^^^^^^^^^^^^^^^^^^^^^^^^^^
     [exec]     [javac] Type safety: The method put(Object, Object) belongs to the raw type Map. References to generic type Map<K,V> should be parameterized
     [exec]     [javac] ----------
     [exec]     [javac] 15. WARNING in /home/hybld/continuum-working-directory/6/classlib/modules/archive/src/test/java/org/apache/harmony/archive/tests/internal/pack200/CodecEncodingTest.java
     [exec]     [javac]  (at line 57)
     [exec]     [javac] 	map.put(new Integer(15), "(4,256,0,1)");

...

     [exec]     [javac] 	^^^^^^^^^^^^^^^^^^^^^^^^^^^^^^^^^^^^^^^
     [exec]     [javac] Type safety: The method put(Object, Object) belongs to the raw type Map. References to generic type Map<K,V> should be parameterized
     [exec]     [javac] ----------
     [exec]     [javac] 16. WARNING in /home/hybld/continuum-working-directory/6/classlib/modules/archive/src/test/java/org/apache/harmony/archive/tests/internal/pack200/CodecEncodingTest.java
     [exec]     [javac]  (at line 58)
     [exec]     [javac] 	map.put(new Integer(16), "(4,256,1,1)");

...

     [exec]     [javac] 	^^^^^^^^^^^^^^^^^^^^^^^^^^^^^^^^^^^^^^^
     [exec]     [javac] Type safety: The method put(Object, Object) belongs to the raw type Map. References to generic type Map<K,V> should be parameterized
     [exec]     [javac] ----------
     [exec]     [javac] 17. WARNING in /home/hybld/continuum-working-directory/6/classlib/modules/archive/src/test/java/org/apache/harmony/archive/tests/internal/pack200/CodecEncodingTest.java
     [exec]     [javac]  (at line 59)
     [exec]     [javac] 	map.put(new Integer(17), "(5,4)");

...

     [exec]     [javac] 	^^^^^^^^^^^^^^^^^^^^^^^^^^^^^^^^^
     [exec]     [javac] Type safety: The method put(Object, Object) belongs to the raw type Map. References to generic type Map<K,V> should be parameterized
     [exec]     [javac] ----------
     [exec]     [javac] 18. WARNING in /home/hybld/continuum-working-directory/6/classlib/modules/archive/src/test/java/org/apache/harmony/archive/tests/internal/pack200/CodecEncodingTest.java
     [exec]     [javac]  (at line 60)
     [exec]     [javac] 	map.put(new Integer(18), "(5,4,1)");

...

     [exec]     [javac] 	^^^^^^^^^^^^^^^^^^^^^^^^^^^^^^^^^^^
     [exec]     [javac] Type safety: The method put(Object, Object) belongs to the raw type Map. References to generic type Map<K,V> should be parameterized
     [exec]     [javac] ----------
     [exec]     [javac] 19. WARNING in /home/hybld/continuum-working-directory/6/classlib/modules/archive/src/test/java/org/apache/harmony/archive/tests/internal/pack200/CodecEncodingTest.java
     [exec]     [javac]  (at line 61)
     [exec]     [javac] 	map.put(new Integer(19), "(5,4,2)");

...

     [exec]     [javac] 	^^^^^^^^^^^^^^^^^^^^^^^^^^^^^^^^^^^
     [exec]     [javac] Type safety: The method put(Object, Object) belongs to the raw type Map. References to generic type Map<K,V> should be parameterized
     [exec]     [javac] ----------
     [exec]     [javac] 20. WARNING in /home/hybld/continuum-working-directory/6/classlib/modules/archive/src/test/java/org/apache/harmony/archive/tests/internal/pack200/CodecEncodingTest.java
     [exec]     [javac]  (at line 62)
     [exec]     [javac] 	map.put(new Integer(20), "(5,16)");

...

     [exec]     [javac] 	^^^^^^^^^^^^^^^^^^^^^^^^^^^^^^^^^^
     [exec]     [javac] Type safety: The method put(Object, Object) belongs to the raw type Map. References to generic type Map<K,V> should be parameterized
     [exec]     [javac] ----------
     [exec]     [javac] 21. WARNING in /home/hybld/continuum-working-directory/6/classlib/modules/archive/src/test/java/org/apache/harmony/archive/tests/internal/pack200/CodecEncodingTest.java
     [exec]     [javac]  (at line 63)
     [exec]     [javac] 	map.put(new Integer(21), "(5,16,1)");

...

     [exec]     [javac] 	^^^^^^^^^^^^^^^^^^^^^^^^^^^^^^^^^^^^
     [exec]     [javac] Type safety: The method put(Object, Object) belongs to the raw type Map. References to generic type Map<K,V> should be parameterized
     [exec]     [javac] ----------
     [exec]     [javac] 22. WARNING in /home/hybld/continuum-working-directory/6/classlib/modules/archive/src/test/java/org/apache/harmony/archive/tests/internal/pack200/CodecEncodingTest.java
     [exec]     [javac]  (at line 64)
     [exec]     [javac] 	map.put(new Integer(22), "(5,16,2)");

...

     [exec]     [javac] 	^^^^^^^^^^^^^^^^^^^^^^^^^^^^^^^^^^^^
     [exec]     [javac] Type safety: The method put(Object, Object) belongs to the raw type Map. References to generic type Map<K,V> should be parameterized
     [exec]     [javac] ----------
     [exec]     [javac] 23. WARNING in /home/hybld/continuum-working-directory/6/classlib/modules/archive/src/test/java/org/apache/harmony/archive/tests/internal/pack200/CodecEncodingTest.java
     [exec]     [javac]  (at line 65)
     [exec]     [javac] 	map.put(new Integer(23), "(5,32)");

...

     [exec]     [javac] 	^^^^^^^^^^^^^^^^^^^^^^^^^^^^^^^^^^
     [exec]     [javac] Type safety: The method put(Object, Object) belongs to the raw type Map. References to generic type Map<K,V> should be parameterized
     [exec]     [javac] ----------
     [exec]     [javac] 24. WARNING in /home/hybld/continuum-working-directory/6/classlib/modules/archive/src/test/java/org/apache/harmony/archive/tests/internal/pack200/CodecEncodingTest.java
     [exec]     [javac]  (at line 66)
     [exec]     [javac] 	map.put(new Integer(24), "(5,32,1)");

...

     [exec]     [javac] 	^^^^^^^^^^^^^^^^^^^^^^^^^^^^^^^^^^^^
     [exec]     [javac] Type safety: The method put(Object, Object) belongs to the raw type Map. References to generic type Map<K,V> should be parameterized
     [exec]     [javac] ----------
     [exec]     [javac] 25. WARNING in /home/hybld/continuum-working-directory/6/classlib/modules/archive/src/test/java/org/apache/harmony/archive/tests/internal/pack200/CodecEncodingTest.java
     [exec]     [javac]  (at line 67)
     [exec]     [javac] 	map.put(new Integer(25), "(5,32,2)");

...

     [exec]     [javac] 	^^^^^^^^^^^^^^^^^^^^^^^^^^^^^^^^^^^^
     [exec]     [javac] Type safety: The method put(Object, Object) belongs to the raw type Map. References to generic type Map<K,V> should be parameterized
     [exec]     [javac] ----------
     [exec]     [javac] 26. WARNING in /home/hybld/continuum-working-directory/6/classlib/modules/archive/src/test/java/org/apache/harmony/archive/tests/internal/pack200/CodecEncodingTest.java
     [exec]     [javac]  (at line 68)
     [exec]     [javac] 	map.put(new Integer(26), "(5,64)");

...

     [exec]     [javac] 	^^^^^^^^^^^^^^^^^^^^^^^^^^^^^^^^^^
     [exec]     [javac] Type safety: The method put(Object, Object) belongs to the raw type Map. References to generic type Map<K,V> should be parameterized
     [exec]     [javac] ----------
     [exec]     [javac] 27. WARNING in /home/hybld/continuum-working-directory/6/classlib/modules/archive/src/test/java/org/apache/harmony/archive/tests/internal/pack200/CodecEncodingTest.java
     [exec]     [javac]  (at line 69)
     [exec]     [javac] 	map.put(new Integer(27), "(5,64,1)");

...

     [exec]     [javac] 	^^^^^^^^^^^^^^^^^^^^^^^^^^^^^^^^^^^^
     [exec]     [javac] Type safety: The method put(Object, Object) belongs to the raw type Map. References to generic type Map<K,V> should be parameterized
     [exec]     [javac] ----------
     [exec]     [javac] 28. WARNING in /home/hybld/continuum-working-directory/6/classlib/modules/archive/src/test/java/org/apache/harmony/archive/tests/internal/pack200/CodecEncodingTest.java
     [exec]     [javac]  (at line 70)
     [exec]     [javac] 	map.put(new Integer(28), "(5,64,2)");

...

     [exec]     [javac] 	^^^^^^^^^^^^^^^^^^^^^^^^^^^^^^^^^^^^
     [exec]     [javac] Type safety: The method put(Object, Object) belongs to the raw type Map. References to generic type Map<K,V> should be parameterized
     [exec]     [javac] ----------
     [exec]     [javac] 29. WARNING in /home/hybld/continuum-working-directory/6/classlib/modules/archive/src/test/java/org/apache/harmony/archive/tests/internal/pack200/CodecEncodingTest.java
     [exec]     [javac]  (at line 71)
     [exec]     [javac] 	map.put(new Integer(29), "(5,128)");

...

     [exec]     [javac] 	^^^^^^^^^^^^^^^^^^^^^^^^^^^^^^^^^^^
     [exec]     [javac] Type safety: The method put(Object, Object) belongs to the raw type Map. References to generic type Map<K,V> should be parameterized
     [exec]     [javac] ----------
     [exec]     [javac] 30. WARNING in /home/hybld/continuum-working-directory/6/classlib/modules/archive/src/test/java/org/apache/harmony/archive/tests/internal/pack200/CodecEncodingTest.java
     [exec]     [javac]  (at line 72)
     [exec]     [javac] 	map.put(new Integer(30), "(5,128,1)");

...

     [exec]     [javac] 	^^^^^^^^^^^^^^^^^^^^^^^^^^^^^^^^^^^^^
     [exec]     [javac] Type safety: The method put(Object, Object) belongs to the raw type Map. References to generic type Map<K,V> should be parameterized
     [exec]     [javac] ----------
     [exec]     [javac] 31. WARNING in /home/hybld/continuum-working-directory/6/classlib/modules/archive/src/test/java/org/apache/harmony/archive/tests/internal/pack200/CodecEncodingTest.java
     [exec]     [javac]  (at line 73)
     [exec]     [javac] 	map.put(new Integer(31), "(5,128,2)");

...

     [exec]     [javac] 	^^^^^^^^^^^^^^^^^^^^^^^^^^^^^^^^^^^^^
     [exec]     [javac] Type safety: The method put(Object, Object) belongs to the raw type Map. References to generic type Map<K,V> should be parameterized
     [exec]     [javac] ----------
     [exec]     [javac] 32. WARNING in /home/hybld/continuum-working-directory/6/classlib/modules/archive/src/test/java/org/apache/harmony/archive/tests/internal/pack200/CodecEncodingTest.java
     [exec]     [javac]  (at line 74)
     [exec]     [javac] 	map.put(new Integer(32), "(5,4,0,1)");

...

     [exec]     [javac] 	^^^^^^^^^^^^^^^^^^^^^^^^^^^^^^^^^^^^^
     [exec]     [javac] Type safety: The method put(Object, Object) belongs to the raw type Map. References to generic type Map<K,V> should be parameterized
     [exec]     [javac] ----------
     [exec]     [javac] 33. WARNING in /home/hybld/continuum-working-directory/6/classlib/modules/archive/src/test/java/org/apache/harmony/archive/tests/internal/pack200/CodecEncodingTest.java
     [exec]     [javac]  (at line 75)
     [exec]     [javac] 	map.put(new Integer(33), "(5,4,1,1)");

...

     [exec]     [javac] 	^^^^^^^^^^^^^^^^^^^^^^^^^^^^^^^^^^^^^
     [exec]     [javac] Type safety: The method put(Object, Object) belongs to the raw type Map. References to generic type Map<K,V> should be parameterized
     [exec]     [javac] ----------
     [exec]     [javac] 34. WARNING in /home/hybld/continuum-working-directory/6/classlib/modules/archive/src/test/java/org/apache/harmony/archive/tests/internal/pack200/CodecEncodingTest.java
     [exec]     [javac]  (at line 76)
     [exec]     [javac] 	map.put(new Integer(34), "(5,4,2,1)");

...

     [exec]     [javac] 	^^^^^^^^^^^^^^^^^^^^^^^^^^^^^^^^^^^^^
     [exec]     [javac] Type safety: The method put(Object, Object) belongs to the raw type Map. References to generic type Map<K,V> should be parameterized
     [exec]     [javac] ----------
     [exec]     [javac] 35. WARNING in /home/hybld/continuum-working-directory/6/classlib/modules/archive/src/test/java/org/apache/harmony/archive/tests/internal/pack200/CodecEncodingTest.java
     [exec]     [javac]  (at line 77)
     [exec]     [javac] 	map.put(new Integer(35), "(5,16,0,1)");

...

     [exec]     [javac] 	^^^^^^^^^^^^^^^^^^^^^^^^^^^^^^^^^^^^^^
     [exec]     [javac] Type safety: The method put(Object, Object) belongs to the raw type Map. References to generic type Map<K,V> should be parameterized
     [exec]     [javac] ----------
     [exec]     [javac] 36. WARNING in /home/hybld/continuum-working-directory/6/classlib/modules/archive/src/test/java/org/apache/harmony/archive/tests/internal/pack200/CodecEncodingTest.java
     [exec]     [javac]  (at line 78)
     [exec]     [javac] 	map.put(new Integer(36), "(5,16,1,1)");

...

     [exec]     [javac] 	^^^^^^^^^^^^^^^^^^^^^^^^^^^^^^^^^^^^^^
     [exec]     [javac] Type safety: The method put(Object, Object) belongs to the raw type Map. References to generic type Map<K,V> should be parameterized
     [exec]     [javac] ----------
     [exec]     [javac] 37. WARNING in /home/hybld/continuum-working-directory/6/classlib/modules/archive/src/test/java/org/apache/harmony/archive/tests/internal/pack200/CodecEncodingTest.java
     [exec]     [javac]  (at line 79)
     [exec]     [javac] 	map.put(new Integer(37), "(5,16,2,1)");

...

     [exec]     [javac] 	^^^^^^^^^^^^^^^^^^^^^^^^^^^^^^^^^^^^^^
     [exec]     [javac] Type safety: The method put(Object, Object) belongs to the raw type Map. References to generic type Map<K,V> should be parameterized
     [exec]     [javac] ----------
     [exec]     [javac] 38. WARNING in /home/hybld/continuum-working-directory/6/classlib/modules/archive/src/test/java/org/apache/harmony/archive/tests/internal/pack200/CodecEncodingTest.java
     [exec]     [javac]  (at line 80)
     [exec]     [javac] 	map.put(new Integer(38), "(5,32,0,1)");

...

     [exec]     [javac] 	^^^^^^^^^^^^^^^^^^^^^^^^^^^^^^^^^^^^^^
     [exec]     [javac] Type safety: The method put(Object, Object) belongs to the raw type Map. References to generic type Map<K,V> should be parameterized
     [exec]     [javac] ----------
     [exec]     [javac] 39. WARNING in /home/hybld/continuum-working-directory/6/classlib/modules/archive/src/test/java/org/apache/harmony/archive/tests/internal/pack200/CodecEncodingTest.java
     [exec]     [javac]  (at line 81)
     [exec]     [javac] 	map.put(new Integer(39), "(5,32,1,1)");

...

     [exec]     [javac] 	^^^^^^^^^^^^^^^^^^^^^^^^^^^^^^^^^^^^^^
     [exec]     [javac] Type safety: The method put(Object, Object) belongs to the raw type Map. References to generic type Map<K,V> should be parameterized
     [exec]     [javac] ----------
     [exec]     [javac] 40. WARNING in /home/hybld/continuum-working-directory/6/classlib/modules/archive/src/test/java/org/apache/harmony/archive/tests/internal/pack200/CodecEncodingTest.java
     [exec]     [javac]  (at line 82)
     [exec]     [javac] 	map.put(new Integer(40), "(5,32,2,1)");

...

     [exec]     [javac] 	^^^^^^^^^^^^^^^^^^^^^^^^^^^^^^^^^^^^^^
     [exec]     [javac] Type safety: The method put(Object, Object) belongs to the raw type Map. References to generic type Map<K,V> should be parameterized
     [exec]     [javac] ----------
     [exec]     [javac] 41. WARNING in /home/hybld/continuum-working-directory/6/classlib/modules/archive/src/test/java/org/apache/harmony/archive/tests/internal/pack200/CodecEncodingTest.java
     [exec]     [javac]  (at line 83)
     [exec]     [javac] 	map.put(new Integer(41), "(5,64,0,1)");

...

     [exec]     [javac] 	^^^^^^^^^^^^^^^^^^^^^^^^^^^^^^^^^^^^^^
     [exec]     [javac] Type safety: The method put(Object, Object) belongs to the raw type Map. References to generic type Map<K,V> should be parameterized
     [exec]     [javac] ----------
     [exec]     [javac] 42. WARNING in /home/hybld/continuum-working-directory/6/classlib/modules/archive/src/test/java/org/apache/harmony/archive/tests/internal/pack200/CodecEncodingTest.java
     [exec]     [javac]  (at line 84)
     [exec]     [javac] 	map.put(new Integer(42), "(5,64,1,1)");

...

     [exec]     [javac] 	^^^^^^^^^^^^^^^^^^^^^^^^^^^^^^^^^^^^^^
     [exec]     [javac] Type safety: The method put(Object, Object) belongs to the raw type Map. References to generic type Map<K,V> should be parameterized
     [exec]     [javac] ----------
     [exec]     [javac] 43. WARNING in /home/hybld/continuum-working-directory/6/classlib/modules/archive/src/test/java/org/apache/harmony/archive/tests/internal/pack200/CodecEncodingTest.java
     [exec]     [javac]  (at line 85)
     [exec]     [javac] 	map.put(new Integer(43), "(5,64,2,1)");

...

     [exec]     [javac] 	^^^^^^^^^^^^^^^^^^^^^^^^^^^^^^^^^^^^^^
     [exec]     [javac] Type safety: The method put(Object, Object) belongs to the raw type Map. References to generic type Map<K,V> should be parameterized
     [exec]     [javac] ----------
     [exec]     [javac] 44. WARNING in /home/hybld/continuum-working-directory/6/classlib/modules/archive/src/test/java/org/apache/harmony/archive/tests/internal/pack200/CodecEncodingTest.java
     [exec]     [javac]  (at line 86)
     [exec]     [javac] 	map.put(new Integer(44), "(5,128,0,1)");

...

     [exec]     [javac] 	^^^^^^^^^^^^^^^^^^^^^^^^^^^^^^^^^^^^^^^
     [exec]     [javac] Type safety: The method put(Object, Object) belongs to the raw type Map. References to generic type Map<K,V> should be parameterized
     [exec]     [javac] ----------
     [exec]     [javac] 45. WARNING in /home/hybld/continuum-working-directory/6/classlib/modules/archive/src/test/java/org/apache/harmony/archive/tests/internal/pack200/CodecEncodingTest.java
     [exec]     [javac]  (at line 87)
     [exec]     [javac] 	map.put(new Integer(45), "(5,128,1,1)");

...

     [exec]     [javac] 	^^^^^^^^^^^^^^^^^^^^^^^^^^^^^^^^^^^^^^^
     [exec]     [javac] Type safety: The method put(Object, Object) belongs to the raw type Map. References to generic type Map<K,V> should be parameterized
     [exec]     [javac] ----------
     [exec]     [javac] 46. WARNING in /home/hybld/continuum-working-directory/6/classlib/modules/archive/src/test/java/org/apache/harmony/archive/tests/internal/pack200/CodecEncodingTest.java
     [exec]     [javac]  (at line 88)
     [exec]     [javac] 	map.put(new Integer(46), "(5,128,2,1)");

...

     [exec]     [javac] 	^^^^^^^^^^^^^^^^^^^^^^^^^^^^^^^^^^^^^^^
     [exec]     [javac] Type safety: The method put(Object, Object) belongs to the raw type Map. References to generic type Map<K,V> should be parameterized
     [exec]     [javac] ----------
     [exec]     [javac] 47. WARNING in /home/hybld/continuum-working-directory/6/classlib/modules/archive/src/test/java/org/apache/harmony/archive/tests/internal/pack200/CodecEncodingTest.java
     [exec]     [javac]  (at line 89)
     [exec]     [javac] 	map.put(new Integer(47), "(2,192)");

...

     [exec]     [javac] 	^^^^^^^^^^^^^^^^^^^^^^^^^^^^^^^^^^^
     [exec]     [javac] Type safety: The method put(Object, Object) belongs to the raw type Map. References to generic type Map<K,V> should be parameterized
     [exec]     [javac] ----------
     [exec]     [javac] 48. WARNING in /home/hybld/continuum-working-directory/6/classlib/modules/archive/src/test/java/org/apache/harmony/archive/tests/internal/pack200/CodecEncodingTest.java
     [exec]     [javac]  (at line 90)
     [exec]     [javac] 	map.put(new Integer(48), "(2,224)");

...

     [exec]     [javac] 	^^^^^^^^^^^^^^^^^^^^^^^^^^^^^^^^^^^
     [exec]     [javac] Type safety: The method put(Object, Object) belongs to the raw type Map. References to generic type Map<K,V> should be parameterized
     [exec]     [javac] ----------
     [exec]     [javac] 49. WARNING in /home/hybld/continuum-working-directory/6/classlib/modules/archive/src/test/java/org/apache/harmony/archive/tests/internal/pack200/CodecEncodingTest.java
     [exec]     [javac]  (at line 91)
     [exec]     [javac] 	map.put(new Integer(49), "(2,240)");

...

     [exec]     [javac] 	^^^^^^^^^^^^^^^^^^^^^^^^^^^^^^^^^^^
     [exec]     [javac] Type safety: The method put(Object, Object) belongs to the raw type Map. References to generic type Map<K,V> should be parameterized
     [exec]     [javac] ----------
     [exec]     [javac] 50. WARNING in /home/hybld/continuum-working-directory/6/classlib/modules/archive/src/test/java/org/apache/harmony/archive/tests/internal/pack200/CodecEncodingTest.java
     [exec]     [javac]  (at line 92)
     [exec]     [javac] 	map.put(new Integer(50), "(2,248)");

...

     [exec]     [javac] 	^^^^^^^^^^^^^^^^^^^^^^^^^^^^^^^^^^^
     [exec]     [javac] Type safety: The method put(Object, Object) belongs to the raw type Map. References to generic type Map<K,V> should be parameterized
     [exec]     [javac] ----------
     [exec]     [javac] 51. WARNING in /home/hybld/continuum-working-directory/6/classlib/modules/archive/src/test/java/org/apache/harmony/archive/tests/internal/pack200/CodecEncodingTest.java
     [exec]     [javac]  (at line 93)
     [exec]     [javac] 	map.put(new Integer(51), "(2,252)");

...

     [exec]     [javac] 	^^^^^^^^^^^^^^^^^^^^^^^^^^^^^^^^^^^
     [exec]     [javac] Type safety: The method put(Object, Object) belongs to the raw type Map. References to generic type Map<K,V> should be parameterized
     [exec]     [javac] ----------
     [exec]     [javac] 52. WARNING in /home/hybld/continuum-working-directory/6/classlib/modules/archive/src/test/java/org/apache/harmony/archive/tests/internal/pack200/CodecEncodingTest.java
     [exec]     [javac]  (at line 94)
     [exec]     [javac] 	map.put(new Integer(52), "(2,8,0,1)");

...

     [exec]     [javac] 	^^^^^^^^^^^^^^^^^^^^^^^^^^^^^^^^^^^^^
     [exec]     [javac] Type safety: The method put(Object, Object) belongs to the raw type Map. References to generic type Map<K,V> should be parameterized
     [exec]     [javac] ----------
     [exec]     [javac] 53. WARNING in /home/hybld/continuum-working-directory/6/classlib/modules/archive/src/test/java/org/apache/harmony/archive/tests/internal/pack200/CodecEncodingTest.java
     [exec]     [javac]  (at line 95)
     [exec]     [javac] 	map.put(new Integer(53), "(2,8,1,1)");

...

     [exec]     [javac] 	^^^^^^^^^^^^^^^^^^^^^^^^^^^^^^^^^^^^^
     [exec]     [javac] Type safety: The method put(Object, Object) belongs to the raw type Map. References to generic type Map<K,V> should be parameterized
     [exec]     [javac] ----------
     [exec]     [javac] 54. WARNING in /home/hybld/continuum-working-directory/6/classlib/modules/archive/src/test/java/org/apache/harmony/archive/tests/internal/pack200/CodecEncodingTest.java
     [exec]     [javac]  (at line 96)
     [exec]     [javac] 	map.put(new Integer(54), "(2,16,0,1)");

...

     [exec]     [javac] 	^^^^^^^^^^^^^^^^^^^^^^^^^^^^^^^^^^^^^^
     [exec]     [javac] Type safety: The method put(Object, Object) belongs to the raw type Map. References to generic type Map<K,V> should be parameterized
     [exec]     [javac] ----------
     [exec]     [javac] 55. WARNING in /home/hybld/continuum-working-directory/6/classlib/modules/archive/src/test/java/org/apache/harmony/archive/tests/internal/pack200/CodecEncodingTest.java
     [exec]     [javac]  (at line 97)
     [exec]     [javac] 	map.put(new Integer(55), "(2,16,1,1)");

...

     [exec]     [javac] 	^^^^^^^^^^^^^^^^^^^^^^^^^^^^^^^^^^^^^^
     [exec]     [javac] Type safety: The method put(Object, Object) belongs to the raw type Map. References to generic type Map<K,V> should be parameterized
     [exec]     [javac] ----------
     [exec]     [javac] 56. WARNING in /home/hybld/continuum-working-directory/6/classlib/modules/archive/src/test/java/org/apache/harmony/archive/tests/internal/pack200/CodecEncodingTest.java
     [exec]     [javac]  (at line 98)
     [exec]     [javac] 	map.put(new Integer(56), "(2,32,0,1)");

...

     [exec]     [javac] 	^^^^^^^^^^^^^^^^^^^^^^^^^^^^^^^^^^^^^^
     [exec]     [javac] Type safety: The method put(Object, Object) belongs to the raw type Map. References to generic type Map<K,V> should be parameterized
     [exec]     [javac] ----------
     [exec]     [javac] 57. WARNING in /home/hybld/continuum-working-directory/6/classlib/modules/archive/src/test/java/org/apache/harmony/archive/tests/internal/pack200/CodecEncodingTest.java
     [exec]     [javac]  (at line 99)
     [exec]     [javac] 	map.put(new Integer(57), "(2,32,1,1)");

...

     [exec]     [javac] 	^^^^^^^^^^^^^^^^^^^^^^^^^^^^^^^^^^^^^^
     [exec]     [javac] Type safety: The method put(Object, Object) belongs to the raw type Map. References to generic type Map<K,V> should be parameterized
     [exec]     [javac] ----------
     [exec]     [javac] 58. WARNING in /home/hybld/continuum-working-directory/6/classlib/modules/archive/src/test/java/org/apache/harmony/archive/tests/internal/pack200/CodecEncodingTest.java
     [exec]     [javac]  (at line 100)
     [exec]     [javac] 	map.put(new Integer(58), "(2,64,0,1)");

...

     [exec]     [javac] 	^^^^^^^^^^^^^^^^^^^^^^^^^^^^^^^^^^^^^^
     [exec]     [javac] Type safety: The method put(Object, Object) belongs to the raw type Map. References to generic type Map<K,V> should be parameterized
     [exec]     [javac] ----------
     [exec]     [javac] 59. WARNING in /home/hybld/continuum-working-directory/6/classlib/modules/archive/src/test/java/org/apache/harmony/archive/tests/internal/pack200/CodecEncodingTest.java
     [exec]     [javac]  (at line 101)
     [exec]     [javac] 	map.put(new Integer(59), "(2,64,1,1)");

...

     [exec]     [javac] 	^^^^^^^^^^^^^^^^^^^^^^^^^^^^^^^^^^^^^^
     [exec]     [javac] Type safety: The method put(Object, Object) belongs to the raw type Map. References to generic type Map<K,V> should be parameterized
     [exec]     [javac] ----------
     [exec]     [javac] 60. WARNING in /home/hybld/continuum-working-directory/6/classlib/modules/archive/src/test/java/org/apache/harmony/archive/tests/internal/pack200/CodecEncodingTest.java
     [exec]     [javac]  (at line 102)
     [exec]     [javac] 	map.put(new Integer(60), "(2,128,0,1)");

...

     [exec]     [javac] 	^^^^^^^^^^^^^^^^^^^^^^^^^^^^^^^^^^^^^^^
     [exec]     [javac] Type safety: The method put(Object, Object) belongs to the raw type Map. References to generic type Map<K,V> should be parameterized
     [exec]     [javac] ----------
     [exec]     [javac] 61. WARNING in /home/hybld/continuum-working-directory/6/classlib/modules/archive/src/test/java/org/apache/harmony/archive/tests/internal/pack200/CodecEncodingTest.java
     [exec]     [javac]  (at line 103)
     [exec]     [javac] 	map.put(new Integer(61), "(2,128,1,1)");

...

     [exec]     [javac] 	^^^^^^^^^^^^^^^^^^^^^^^^^^^^^^^^^^^^^^^
     [exec]     [javac] Type safety: The method put(Object, Object) belongs to the raw type Map. References to generic type Map<K,V> should be parameterized
     [exec]     [javac] ----------
     [exec]     [javac] 62. WARNING in /home/hybld/continuum-working-directory/6/classlib/modules/archive/src/test/java/org/apache/harmony/archive/tests/internal/pack200/CodecEncodingTest.java
     [exec]     [javac]  (at line 104)
     [exec]     [javac] 	map.put(new Integer(62), "(2,192,0,1)");

...

     [exec]     [javac] 	^^^^^^^^^^^^^^^^^^^^^^^^^^^^^^^^^^^^^^^
     [exec]     [javac] Type safety: The method put(Object, Object) belongs to the raw type Map. References to generic type Map<K,V> should be parameterized
     [exec]     [javac] ----------
     [exec]     [javac] 63. WARNING in /home/hybld/continuum-working-directory/6/classlib/modules/archive/src/test/java/org/apache/harmony/archive/tests/internal/pack200/CodecEncodingTest.java
     [exec]     [javac]  (at line 105)
     [exec]     [javac] 	map.put(new Integer(63), "(2,192,1,1)");

...

     [exec]     [javac] 	^^^^^^^^^^^^^^^^^^^^^^^^^^^^^^^^^^^^^^^
     [exec]     [javac] Type safety: The method put(Object, Object) belongs to the raw type Map. References to generic type Map<K,V> should be parameterized
     [exec]     [javac] ----------
     [exec]     [javac] 64. WARNING in /home/hybld/continuum-working-directory/6/classlib/modules/archive/src/test/java/org/apache/harmony/archive/tests/internal/pack200/CodecEncodingTest.java
     [exec]     [javac]  (at line 106)
     [exec]     [javac] 	map.put(new Integer(64), "(2,224,0,1)");

...

     [exec]     [javac] 	^^^^^^^^^^^^^^^^^^^^^^^^^^^^^^^^^^^^^^^
     [exec]     [javac] Type safety: The method put(Object, Object) belongs to the raw type Map. References to generic type Map<K,V> should be parameterized
     [exec]     [javac] ----------
     [exec]     [javac] 65. WARNING in /home/hybld/continuum-working-directory/6/classlib/modules/archive/src/test/java/org/apache/harmony/archive/tests/internal/pack200/CodecEncodingTest.java
     [exec]     [javac]  (at line 107)
     [exec]     [javac] 	map.put(new Integer(65), "(2,224,1,1)");

...

     [exec]     [javac] 	^^^^^^^^^^^^^^^^^^^^^^^^^^^^^^^^^^^^^^^
     [exec]     [javac] Type safety: The method put(Object, Object) belongs to the raw type Map. References to generic type Map<K,V> should be parameterized
     [exec]     [javac] ----------
     [exec]     [javac] 66. WARNING in /home/hybld/continuum-working-directory/6/classlib/modules/archive/src/test/java/org/apache/harmony/archive/tests/internal/pack200/CodecEncodingTest.java
     [exec]     [javac]  (at line 108)
     [exec]     [javac] 	map.put(new Integer(66), "(2,240,0,1)");

...

     [exec]     [javac] 	^^^^^^^^^^^^^^^^^^^^^^^^^^^^^^^^^^^^^^^
     [exec]     [javac] Type safety: The method put(Object, Object) belongs to the raw type Map. References to generic type Map<K,V> should be parameterized
     [exec]     [javac] ----------
     [exec]     [javac] 67. WARNING in /home/hybld/continuum-working-directory/6/classlib/modules/archive/src/test/java/org/apache/harmony/archive/tests/internal/pack200/CodecEncodingTest.java
     [exec]     [javac]  (at line 109)
     [exec]     [javac] 	map.put(new Integer(67), "(2,240,1,1)");

...

     [exec]     [javac] 	^^^^^^^^^^^^^^^^^^^^^^^^^^^^^^^^^^^^^^^
     [exec]     [javac] Type safety: The method put(Object, Object) belongs to the raw type Map. References to generic type Map<K,V> should be parameterized
     [exec]     [javac] ----------
     [exec]     [javac] 68. WARNING in /home/hybld/continuum-working-directory/6/classlib/modules/archive/src/test/java/org/apache/harmony/archive/tests/internal/pack200/CodecEncodingTest.java
     [exec]     [javac]  (at line 110)
     [exec]     [javac] 	map.put(new Integer(68), "(2,248,0,1)");

...

     [exec]     [javac] 	^^^^^^^^^^^^^^^^^^^^^^^^^^^^^^^^^^^^^^^
     [exec]     [javac] Type safety: The method put(Object, Object) belongs to the raw type Map. References to generic type Map<K,V> should be parameterized
     [exec]     [javac] ----------
     [exec]     [javac] 69. WARNING in /home/hybld/continuum-working-directory/6/classlib/modules/archive/src/test/java/org/apache/harmony/archive/tests/internal/pack200/CodecEncodingTest.java
     [exec]     [javac]  (at line 111)
     [exec]     [javac] 	map.put(new Integer(69), "(2,248,1,1)");

...

     [exec]     [javac] 	^^^^^^^^^^^^^^^^^^^^^^^^^^^^^^^^^^^^^^^
     [exec]     [javac] Type safety: The method put(Object, Object) belongs to the raw type Map. References to generic type Map<K,V> should be parameterized
     [exec]     [javac] ----------
     [exec]     [javac] 70. WARNING in /home/hybld/continuum-working-directory/6/classlib/modules/archive/src/test/java/org/apache/harmony/archive/tests/internal/pack200/CodecEncodingTest.java
     [exec]     [javac]  (at line 112)
     [exec]     [javac] 	map.put(new Integer(70), "(3,192)");

...

     [exec]     [javac] 	^^^^^^^^^^^^^^^^^^^^^^^^^^^^^^^^^^^
     [exec]     [javac] Type safety: The method put(Object, Object) belongs to the raw type Map. References to generic type Map<K,V> should be parameterized
     [exec]     [javac] ----------
     [exec]     [javac] 71. WARNING in /home/hybld/continuum-working-directory/6/classlib/modules/archive/src/test/java/org/apache/harmony/archive/tests/internal/pack200/CodecEncodingTest.java
     [exec]     [javac]  (at line 113)
     [exec]     [javac] 	map.put(new Integer(71), "(3,224)");

...

     [exec]     [javac] 	^^^^^^^^^^^^^^^^^^^^^^^^^^^^^^^^^^^
     [exec]     [javac] Type safety: The method put(Object, Object) belongs to the raw type Map. References to generic type Map<K,V> should be parameterized
     [exec]     [javac] ----------
     [exec]     [javac] 72. WARNING in /home/hybld/continuum-working-directory/6/classlib/modules/archive/src/test/java/org/apache/harmony/archive/tests/internal/pack200/CodecEncodingTest.java
     [exec]     [javac]  (at line 114)
     [exec]     [javac] 	map.put(new Integer(72), "(3,240)");

...

     [exec]     [javac] 	^^^^^^^^^^^^^^^^^^^^^^^^^^^^^^^^^^^
     [exec]     [javac] Type safety: The method put(Object, Object) belongs to the raw type Map. References to generic type Map<K,V> should be parameterized
     [exec]     [javac] ----------
     [exec]     [javac] 73. WARNING in /home/hybld/continuum-working-directory/6/classlib/modules/archive/src/test/java/org/apache/harmony/archive/tests/internal/pack200/CodecEncodingTest.java
     [exec]     [javac]  (at line 115)
     [exec]     [javac] 	map.put(new Integer(73), "(3,248)");

...

     [exec]     [javac] 	^^^^^^^^^^^^^^^^^^^^^^^^^^^^^^^^^^^
     [exec]     [javac] Type safety: The method put(Object, Object) belongs to the raw type Map. References to generic type Map<K,V> should be parameterized
     [exec]     [javac] ----------
     [exec]     [javac] 74. WARNING in /home/hybld/continuum-working-directory/6/classlib/modules/archive/src/test/java/org/apache/harmony/archive/tests/internal/pack200/CodecEncodingTest.java
     [exec]     [javac]  (at line 116)
     [exec]     [javac] 	map.put(new Integer(74), "(3,252)");

...

     [exec]     [javac] 	^^^^^^^^^^^^^^^^^^^^^^^^^^^^^^^^^^^
     [exec]     [javac] Type safety: The method put(Object, Object) belongs to the raw type Map. References to generic type Map<K,V> should be parameterized
     [exec]     [javac] ----------
     [exec]     [javac] 75. WARNING in /home/hybld/continuum-working-directory/6/classlib/modules/archive/src/test/java/org/apache/harmony/archive/tests/internal/pack200/CodecEncodingTest.java
     [exec]     [javac]  (at line 117)
     [exec]     [javac] 	map.put(new Integer(75), "(3,8,0,1)");

...

     [exec]     [javac] 	^^^^^^^^^^^^^^^^^^^^^^^^^^^^^^^^^^^^^
     [exec]     [javac] Type safety: The method put(Object, Object) belongs to the raw type Map. References to generic type Map<K,V> should be parameterized
     [exec]     [javac] ----------
     [exec]     [javac] 76. WARNING in /home/hybld/continuum-working-directory/6/classlib/modules/archive/src/test/java/org/apache/harmony/archive/tests/internal/pack200/CodecEncodingTest.java
     [exec]     [javac]  (at line 118)
     [exec]     [javac] 	map.put(new Integer(76), "(3,8,1,1)");

...

     [exec]     [javac] 	^^^^^^^^^^^^^^^^^^^^^^^^^^^^^^^^^^^^^
     [exec]     [javac] Type safety: The method put(Object, Object) belongs to the raw type Map. References to generic type Map<K,V> should be parameterized
     [exec]     [javac] ----------
     [exec]     [javac] 77. WARNING in /home/hybld/continuum-working-directory/6/classlib/modules/archive/src/test/java/org/apache/harmony/archive/tests/internal/pack200/CodecEncodingTest.java
     [exec]     [javac]  (at line 119)
     [exec]     [javac] 	map.put(new Integer(77), "(3,16,0,1)");

...

     [exec]     [javac] 	^^^^^^^^^^^^^^^^^^^^^^^^^^^^^^^^^^^^^^
     [exec]     [javac] Type safety: The method put(Object, Object) belongs to the raw type Map. References to generic type Map<K,V> should be parameterized
     [exec]     [javac] ----------
     [exec]     [javac] 78. WARNING in /home/hybld/continuum-working-directory/6/classlib/modules/archive/src/test/java/org/apache/harmony/archive/tests/internal/pack200/CodecEncodingTest.java
     [exec]     [javac]  (at line 120)
     [exec]     [javac] 	map.put(new Integer(78), "(3,16,1,1)");

...

     [exec]     [javac] 	^^^^^^^^^^^^^^^^^^^^^^^^^^^^^^^^^^^^^^
     [exec]     [javac] Type safety: The method put(Object, Object) belongs to the raw type Map. References to generic type Map<K,V> should be parameterized
     [exec]     [javac] ----------
     [exec]     [javac] 79. WARNING in /home/hybld/continuum-working-directory/6/classlib/modules/archive/src/test/java/org/apache/harmony/archive/tests/internal/pack200/CodecEncodingTest.java
     [exec]     [javac]  (at line 121)
     [exec]     [javac] 	map.put(new Integer(79), "(3,32,0,1)");

...

     [exec]     [javac] 	^^^^^^^^^^^^^^^^^^^^^^^^^^^^^^^^^^^^^^
     [exec]     [javac] Type safety: The method put(Object, Object) belongs to the raw type Map. References to generic type Map<K,V> should be parameterized
     [exec]     [javac] ----------
     [exec]     [javac] 80. WARNING in /home/hybld/continuum-working-directory/6/classlib/modules/archive/src/test/java/org/apache/harmony/archive/tests/internal/pack200/CodecEncodingTest.java
     [exec]     [javac]  (at line 122)
     [exec]     [javac] 	map.put(new Integer(80), "(3,32,1,1)");

...

     [exec]     [javac] 	^^^^^^^^^^^^^^^^^^^^^^^^^^^^^^^^^^^^^^
     [exec]     [javac] Type safety: The method put(Object, Object) belongs to the raw type Map. References to generic type Map<K,V> should be parameterized
     [exec]     [javac] ----------
     [exec]     [javac] 81. WARNING in /home/hybld/continuum-working-directory/6/classlib/modules/archive/src/test/java/org/apache/harmony/archive/tests/internal/pack200/CodecEncodingTest.java
     [exec]     [javac]  (at line 123)
     [exec]     [javac] 	map.put(new Integer(81), "(3,64,0,1)");

...

     [exec]     [javac] 	^^^^^^^^^^^^^^^^^^^^^^^^^^^^^^^^^^^^^^
     [exec]     [javac] Type safety: The method put(Object, Object) belongs to the raw type Map. References to generic type Map<K,V> should be parameterized
     [exec]     [javac] ----------
     [exec]     [javac] 82. WARNING in /home/hybld/continuum-working-directory/6/classlib/modules/archive/src/test/java/org/apache/harmony/archive/tests/internal/pack200/CodecEncodingTest.java
     [exec]     [javac]  (at line 124)
     [exec]     [javac] 	map.put(new Integer(82), "(3,64,1,1)");

...

     [exec]     [javac] 	^^^^^^^^^^^^^^^^^^^^^^^^^^^^^^^^^^^^^^
     [exec]     [javac] Type safety: The method put(Object, Object) belongs to the raw type Map. References to generic type Map<K,V> should be parameterized
     [exec]     [javac] ----------
     [exec]     [javac] 83. WARNING in /home/hybld/continuum-working-directory/6/classlib/modules/archive/src/test/java/org/apache/harmony/archive/tests/internal/pack200/CodecEncodingTest.java
     [exec]     [javac]  (at line 125)
     [exec]     [javac] 	map.put(new Integer(83), "(3,128,0,1)");

...

     [exec]     [javac] 	^^^^^^^^^^^^^^^^^^^^^^^^^^^^^^^^^^^^^^^
     [exec]     [javac] Type safety: The method put(Object, Object) belongs to the raw type Map. References to generic type Map<K,V> should be parameterized
     [exec]     [javac] ----------
     [exec]     [javac] 84. WARNING in /home/hybld/continuum-working-directory/6/classlib/modules/archive/src/test/java/org/apache/harmony/archive/tests/internal/pack200/CodecEncodingTest.java
     [exec]     [javac]  (at line 126)
     [exec]     [javac] 	map.put(new Integer(84), "(3,128,1,1)");

...

     [exec]     [javac] 	^^^^^^^^^^^^^^^^^^^^^^^^^^^^^^^^^^^^^^^
     [exec]     [javac] Type safety: The method put(Object, Object) belongs to the raw type Map. References to generic type Map<K,V> should be parameterized
     [exec]     [javac] ----------
     [exec]     [javac] 85. WARNING in /home/hybld/continuum-working-directory/6/classlib/modules/archive/src/test/java/org/apache/harmony/archive/tests/internal/pack200/CodecEncodingTest.java
     [exec]     [javac]  (at line 127)
     [exec]     [javac] 	map.put(new Integer(85), "(3,192,0,1)");

...

     [exec]     [javac] 	^^^^^^^^^^^^^^^^^^^^^^^^^^^^^^^^^^^^^^^
     [exec]     [javac] Type safety: The method put(Object, Object) belongs to the raw type Map. References to generic type Map<K,V> should be parameterized
     [exec]     [javac] ----------
     [exec]     [javac] 86. WARNING in /home/hybld/continuum-working-directory/6/classlib/modules/archive/src/test/java/org/apache/harmony/archive/tests/internal/pack200/CodecEncodingTest.java
     [exec]     [javac]  (at line 128)
     [exec]     [javac] 	map.put(new Integer(86), "(3,192,1,1)");

...

     [exec]     [javac] 	^^^^^^^^^^^^^^^^^^^^^^^^^^^^^^^^^^^^^^^
     [exec]     [javac] Type safety: The method put(Object, Object) belongs to the raw type Map. References to generic type Map<K,V> should be parameterized
     [exec]     [javac] ----------
     [exec]     [javac] 87. WARNING in /home/hybld/continuum-working-directory/6/classlib/modules/archive/src/test/java/org/apache/harmony/archive/tests/internal/pack200/CodecEncodingTest.java
     [exec]     [javac]  (at line 129)
     [exec]     [javac] 	map.put(new Integer(87), "(3,224,0,1)");

...

     [exec]     [javac] 	^^^^^^^^^^^^^^^^^^^^^^^^^^^^^^^^^^^^^^^
     [exec]     [javac] Type safety: The method put(Object, Object) belongs to the raw type Map. References to generic type Map<K,V> should be parameterized
     [exec]     [javac] ----------
     [exec]     [javac] 88. WARNING in /home/hybld/continuum-working-directory/6/classlib/modules/archive/src/test/java/org/apache/harmony/archive/tests/internal/pack200/CodecEncodingTest.java
     [exec]     [javac]  (at line 130)
     [exec]     [javac] 	map.put(new Integer(88), "(3,224,1,1)");

...

     [exec]     [javac] 	^^^^^^^^^^^^^^^^^^^^^^^^^^^^^^^^^^^^^^^
     [exec]     [javac] Type safety: The method put(Object, Object) belongs to the raw type Map. References to generic type Map<K,V> should be parameterized
     [exec]     [javac] ----------
     [exec]     [javac] 89. WARNING in /home/hybld/continuum-working-directory/6/classlib/modules/archive/src/test/java/org/apache/harmony/archive/tests/internal/pack200/CodecEncodingTest.java
     [exec]     [javac]  (at line 131)
     [exec]     [javac] 	map.put(new Integer(89), "(3,240,0,1)");

...

     [exec]     [javac] 	^^^^^^^^^^^^^^^^^^^^^^^^^^^^^^^^^^^^^^^
     [exec]     [javac] Type safety: The method put(Object, Object) belongs to the raw type Map. References to generic type Map<K,V> should be parameterized
     [exec]     [javac] ----------
     [exec]     [javac] 90. WARNING in /home/hybld/continuum-working-directory/6/classlib/modules/archive/src/test/java/org/apache/harmony/archive/tests/internal/pack200/CodecEncodingTest.java
     [exec]     [javac]  (at line 132)
     [exec]     [javac] 	map.put(new Integer(90), "(3,240,1,1)");

...

     [exec]     [javac] 	^^^^^^^^^^^^^^^^^^^^^^^^^^^^^^^^^^^^^^^
     [exec]     [javac] Type safety: The method put(Object, Object) belongs to the raw type Map. References to generic type Map<K,V> should be parameterized
     [exec]     [javac] ----------
     [exec]     [javac] 91. WARNING in /home/hybld/continuum-working-directory/6/classlib/modules/archive/src/test/java/org/apache/harmony/archive/tests/internal/pack200/CodecEncodingTest.java
     [exec]     [javac]  (at line 133)
     [exec]     [javac] 	map.put(new Integer(91), "(3,248,0,1)");

...

     [exec]     [javac] 	^^^^^^^^^^^^^^^^^^^^^^^^^^^^^^^^^^^^^^^
     [exec]     [javac] Type safety: The method put(Object, Object) belongs to the raw type Map. References to generic type Map<K,V> should be parameterized
     [exec]     [javac] ----------
     [exec]     [javac] 92. WARNING in /home/hybld/continuum-working-directory/6/classlib/modules/archive/src/test/java/org/apache/harmony/archive/tests/internal/pack200/CodecEncodingTest.java
     [exec]     [javac]  (at line 134)
     [exec]     [javac] 	map.put(new Integer(92), "(3,248,1,1)");

...

     [exec]     [javac] 	^^^^^^^^^^^^^^^^^^^^^^^^^^^^^^^^^^^^^^^
     [exec]     [javac] Type safety: The method put(Object, Object) belongs to the raw type Map. References to generic type Map<K,V> should be parameterized
     [exec]     [javac] ----------
     [exec]     [javac] 93. WARNING in /home/hybld/continuum-working-directory/6/classlib/modules/archive/src/test/java/org/apache/harmony/archive/tests/internal/pack200/CodecEncodingTest.java
     [exec]     [javac]  (at line 135)
     [exec]     [javac] 	map.put(new Integer(93), "(4,192)");

...

     [exec]     [javac] 	^^^^^^^^^^^^^^^^^^^^^^^^^^^^^^^^^^^
     [exec]     [javac] Type safety: The method put(Object, Object) belongs to the raw type Map. References to generic type Map<K,V> should be parameterized
     [exec]     [javac] ----------
     [exec]     [javac] 94. WARNING in /home/hybld/continuum-working-directory/6/classlib/modules/archive/src/test/java/org/apache/harmony/archive/tests/internal/pack200/CodecEncodingTest.java
     [exec]     [javac]  (at line 136)
     [exec]     [javac] 	map.put(new Integer(94), "(4,224)");

...

     [exec]     [javac] 	^^^^^^^^^^^^^^^^^^^^^^^^^^^^^^^^^^^
     [exec]     [javac] Type safety: The method put(Object, Object) belongs to the raw type Map. References to generic type Map<K,V> should be parameterized
     [exec]     [javac] ----------
     [exec]     [javac] 95. WARNING in /home/hybld/continuum-working-directory/6/classlib/modules/archive/src/test/java/org/apache/harmony/archive/tests/internal/pack200/CodecEncodingTest.java
     [exec]     [javac]  (at line 137)
     [exec]     [javac] 	map.put(new Integer(95), "(4,240)");

...

     [exec]     [javac] 	^^^^^^^^^^^^^^^^^^^^^^^^^^^^^^^^^^^
     [exec]     [javac] Type safety: The method put(Object, Object) belongs to the raw type Map. References to generic type Map<K,V> should be parameterized
     [exec]     [javac] ----------
     [exec]     [javac] 96. WARNING in /home/hybld/continuum-working-directory/6/classlib/modules/archive/src/test/java/org/apache/harmony/archive/tests/internal/pack200/CodecEncodingTest.java
     [exec]     [javac]  (at line 138)
     [exec]     [javac] 	map.put(new Integer(96), "(4,248)");

...

     [exec]     [javac] 	^^^^^^^^^^^^^^^^^^^^^^^^^^^^^^^^^^^
     [exec]     [javac] Type safety: The method put(Object, Object) belongs to the raw type Map. References to generic type Map<K,V> should be parameterized
     [exec]     [javac] ----------
     [exec]     [javac] 97. WARNING in /home/hybld/continuum-working-directory/6/classlib/modules/archive/src/test/java/org/apache/harmony/archive/tests/internal/pack200/CodecEncodingTest.java
     [exec]     [javac]  (at line 139)
     [exec]     [javac] 	map.put(new Integer(97), "(4,252)");

...

     [exec]     [javac] 	^^^^^^^^^^^^^^^^^^^^^^^^^^^^^^^^^^^
     [exec]     [javac] Type safety: The method put(Object, Object) belongs to the raw type Map. References to generic type Map<K,V> should be parameterized
     [exec]     [javac] ----------
     [exec]     [javac] 98. WARNING in /home/hybld/continuum-working-directory/6/classlib/modules/archive/src/test/java/org/apache/harmony/archive/tests/internal/pack200/CodecEncodingTest.java
     [exec]     [javac]  (at line 140)
     [exec]     [javac] 	map.put(new Integer(98), "(4,8,0,1)");

...

     [exec]     [javac] 	^^^^^^^^^^^^^^^^^^^^^^^^^^^^^^^^^^^^^
     [exec]     [javac] Type safety: The method put(Object, Object) belongs to the raw type Map. References to generic type Map<K,V> should be parameterized
     [exec]     [javac] ----------
     [exec]     [javac] 99. WARNING in /home/hybld/continuum-working-directory/6/classlib/modules/archive/src/test/java/org/apache/harmony/archive/tests/internal/pack200/CodecEncodingTest.java
     [exec]     [javac]  (at line 141)
     [exec]     [javac] 	map.put(new Integer(99), "(4,8,1,1)");

...

     [exec]     [javac] 	^^^^^^^^^^^^^^^^^^^^^^^^^^^^^^^^^^^^^
     [exec]     [javac] Type safety: The method put(Object, Object) belongs to the raw type Map. References to generic type Map<K,V> should be parameterized
     [exec]     [javac] ----------
     [exec]     [javac] 100. WARNING in /home/hybld/continuum-working-directory/6/classlib/modules/archive/src/test/java/org/apache/harmony/archive/tests/internal/pack200/CodecEncodingTest.java
     [exec]     [javac]  (at line 142)
     [exec]     [javac] 	map.put(new Integer(100), "(4,16,0,1)");

...

     [exec]     [javac] 	^^^^^^^^^^^^^^^^^^^^^^^^^^^^^^^^^^^^^^^
     [exec]     [javac] Type safety: The method put(Object, Object) belongs to the raw type Map. References to generic type Map<K,V> should be parameterized
     [exec]     [javac] ----------
     [exec]     [javac] 100 problems (100 warnings)

     [exec] run-tests:

...

     [exec]     [javac] ----------
     [exec]     [javac] 1. WARNING in /home/hybld/continuum-working-directory/6/classlib/modules/auth/src/test/java/linux/org/apache/harmony/auth/module/UnixLoginModuleTest.java
     [exec]     [javac]  (at line 59)
     [exec]     [javac] 	lm.initialize(subj, cbh, sharedState, options);
     [exec]     [javac] 	                         ^^^^^^^^^^^
     [exec]     [javac] Type safety: The expression of type Map needs unchecked conversion to conform to Map<String,?>
     [exec]     [javac] ----------
     [exec]     [javac] 2. WARNING in /home/hybld/continuum-working-directory/6/classlib/modules/auth/src/test/java/linux/org/apache/harmony/auth/module/UnixLoginModuleTest.java
     [exec]     [javac]  (at line 59)
     [exec]     [javac] 	lm.initialize(subj, cbh, sharedState, options);

...

     [exec]     [javac] 	                                      ^^^^^^^
     [exec]     [javac] Type safety: The expression of type Map needs unchecked conversion to conform to Map<String,?>
     [exec]     [javac] ----------
     [exec]     [javac] 3. WARNING in /home/hybld/continuum-working-directory/6/classlib/modules/auth/src/test/java/linux/org/apache/harmony/auth/module/UnixLoginModuleTest.java
     [exec]     [javac]  (at line 80)
     [exec]     [javac] 	lm.initialize(null, cbh, shared, options);

...

     [exec]     [javac] 	                         ^^^^^^
     [exec]     [javac] Type safety: The expression of type Map needs unchecked conversion to conform to Map<String,?>
     [exec]     [javac] ----------
     [exec]     [javac] 4. WARNING in /home/hybld/continuum-working-directory/6/classlib/modules/auth/src/test/java/linux/org/apache/harmony/auth/module/UnixLoginModuleTest.java
     [exec]     [javac]  (at line 80)
     [exec]     [javac] 	lm.initialize(null, cbh, shared, options);

...

     [exec]     [javac] 	                                 ^^^^^^^
     [exec]     [javac] Type safety: The expression of type Map needs unchecked conversion to conform to Map<String,?>
     [exec]     [javac] ----------
     [exec]     [javac] 5. WARNING in /home/hybld/continuum-working-directory/6/classlib/modules/auth/src/test/java/linux/org/apache/harmony/auth/module/UnixLoginModuleTest.java
     [exec]     [javac]  (at line 87)
     [exec]     [javac] 	lm.initialize(subj, null, shared, options);

...

     [exec]     [javac] 	                          ^^^^^^
     [exec]     [javac] Type safety: The expression of type Map needs unchecked conversion to conform to Map<String,?>
     [exec]     [javac] ----------
     [exec]     [javac] 6. WARNING in /home/hybld/continuum-working-directory/6/classlib/modules/auth/src/test/java/linux/org/apache/harmony/auth/module/UnixLoginModuleTest.java
     [exec]     [javac]  (at line 87)
     [exec]     [javac] 	lm.initialize(subj, null, shared, options);

...

     [exec]     [javac] 	                                  ^^^^^^^
     [exec]     [javac] Type safety: The expression of type Map needs unchecked conversion to conform to Map<String,?>
     [exec]     [javac] ----------
     [exec]     [javac] 7. WARNING in /home/hybld/continuum-working-directory/6/classlib/modules/auth/src/test/java/linux/org/apache/harmony/auth/module/UnixLoginModuleTest.java
     [exec]     [javac]  (at line 89)
     [exec]     [javac] 	lm.initialize(subj, cbh, null, options);

...

     [exec]     [javac] 	                               ^^^^^^^
     [exec]     [javac] Type safety: The expression of type Map needs unchecked conversion to conform to Map<String,?>
     [exec]     [javac] ----------
     [exec]     [javac] 8. WARNING in /home/hybld/continuum-working-directory/6/classlib/modules/auth/src/test/java/linux/org/apache/harmony/auth/module/UnixLoginModuleTest.java
     [exec]     [javac]  (at line 92)
     [exec]     [javac] 	lm.initialize(subj, cbh, shared, null);

...

     [exec]     [javac] 	                         ^^^^^^
     [exec]     [javac] Type safety: The expression of type Map needs unchecked conversion to conform to Map<String,?>
     [exec]     [javac] ----------
     [exec]     [javac] 8 problems (8 warnings)

     [exec] run-tests:

...

     [exec]     [javac] ----------
     [exec]     [javac] 1. WARNING in /home/hybld/continuum-working-directory/6/classlib/modules/awt/src/test/api/java/common/org/apache/harmony/awt/gl/MultiRectAreaTestCase.java
     [exec]     [javac]  (at line 62)
     [exec]     [javac] 	private String concat(String msg1, String msg2) {
     [exec]     [javac] 	               ^^^^^^^^^^^^^^^^^^^^^^^^^^^^^^^^
     [exec]     [javac] The method MultiRectAreaTestCase.concat(String, String) does not override the inherited method from GeomTestCase since it is private to a different package.
     [exec]     [javac] ----------
     [exec]     [javac] ----------
     [exec]     [javac] 2. WARNING in /home/hybld/continuum-working-directory/6/classlib/modules/awt/src/test/api/java/linux/org/apache/harmony/awt/gl/font/LineMetricsImplRTest.java
     [exec]     [javac]  (at line 37)

...

     [exec]     [javac] 	LineMetrics lm = font.getLineMetrics("", frc);
     [exec]     [javac] 	            ^^
     [exec]     [javac] The local variable lm is never read
     [exec]     [javac] ----------
     [exec]     [javac] 2 problems (2 warnings)
     [exec]      [copy] Copying 102 files to /home/hybld/continuum-working-directory/6/classlib/modules/awt/bin/test/java/awt/geom/shapes
     [exec]      [copy] Copying 2 files to /home/hybld/continuum-working-directory/6/classlib/modules/awt/bin/test/java/awt/geom/serialization

...

     [exec]     [junit] Running java.awt.GradientPaintTest
     [exec]     [junit] Tests run: 6, Failures: 0, Errors: 0, Time elapsed: 0.233 sec
     [exec]     [junit] Running java.awt.Graphics2DTest
     [exec]     [junit] Unhandled exception
     [exec]     [junit] Type=Segmentation error vmState=0x00040000
     [exec]     [junit] J9Generic_Signal_Number=00000004 Signal_Number=0000000b Error_Value=00000000 Signal_Code=00000001
     [exec]     [junit] Handler1=402504A4 Handler2=401FD343 InaccessibleAddress=00000000
     [exec]     [junit] EDI=0816CC00 ESI=0000001B EAX=BB715CA4 EBX=BB715B38
     [exec]     [junit] ECX=00000000 EDX=0821A4B8
     [exec]     [junit] EIP=00000000 ES=0000007B DS=C010007B ESP=BFFFE5F8

...

     [exec]     [junit] Note: dump may be truncated if "ulimit -c" is set too low

     [exec]     [junit] Generated system dump: {default OS core name}

     [exec]     [junit] Thread: main (priority 5) (LOCATION OF ERROR)
     [exec]     [junit]  NATIVE   org/apache/harmony/awt/nativebridge/linux/X11.XmuLookupStandardColormap(JIJIJII)I
     [exec]     [junit]  00000080 org/apache/harmony/awt/gl/linux/XGraphicsConfiguration.obtainRGBColorMap()J
     [exec]     [junit]  00000015 org/apache/harmony/awt/gl/linux/XGraphicsConfiguration.<init>(Lorg/apache/harmony/awt/gl/linux/XGraphicsDevice;Lorg/apache/harmony/awt/nativebridge/linux/X11$XVisualInfo;)V
     [exec]     [junit]  000000a5 org/apache/harmony/awt/gl/linux/XGraphicsDevice.createConfigs()V
     [exec]     [junit]  00000008 org/apache/harmony/awt/gl/linux/XGraphicsDevice.getConfigs()[Lorg/apache/harmony/awt/gl/linux/XGraphicsConfiguration;

...

     [exec]     [junit]  00000027 java/awt/EventDispatchThread.waitForAnyEvent()V
     [exec]     [junit]  000000b4 java/awt/EventDispatchThread.runModalLoop(Ljava/awt/ModalContext;)V
     [exec]     [junit]  0000000d java/awt/EventDispatchThread.run()V

     [exec]     [junit] An unhandled error (4) has occurred.
     [exec]     [junit] HyGeneric_Signal_Number=00000004
     [exec]     [junit] Signal_Number=0000000b
     [exec]     [junit] Error_Value=00000000
     [exec]     [junit] Signal_Code=00000001
     [exec]     [junit] Handler1=0804A804

...

     [exec]     [junit] EFlags=00010282
     [exec]     [junit] CS=00000073
     [exec]     [junit] SS=0000007B
     [exec]     [junit] EBP=BFFFE644
     [exec]     [junit] Test java.awt.Graphics2DTest FAILED
     [exec]     [junit] Running java.awt.GridBagLayoutRTest
     [exec]     [junit] Tests run: 5, Failures: 0, Errors: 0, Time elapsed: 0.453 sec
     [exec]     [junit] Running java.awt.GridLayoutRTest
     [exec]     [junit] Tests run: 4, Failures: 0, Errors: 0, Time elapsed: 0.606 sec
     [exec]     [junit] Running java.awt.LabelTest

...

     [exec]     [javac] ----------
     [exec]     [javac] 1. WARNING in /home/hybld/continuum-working-directory/6/classlib/modules/beans/src/test/java/org/apache/harmony/beans/tests/java/beans/BeanDescriptorTest.java
     [exec]     [javac]  (at line 136)
     [exec]     [javac] 	class MyCustomizer extends Component implements Customizer {
     [exec]     [javac] 	      ^^^^^^^^^^^^
     [exec]     [javac] The serializable class MyCustomizer does not declare a static final serialVersionUID field of type long
     [exec]     [javac] ----------
     [exec]     [javac] ----------
     [exec]     [javac] 2. WARNING in /home/hybld/continuum-working-directory/6/classlib/modules/beans/src/test/java/org/apache/harmony/beans/tests/java/beans/DefaultPersistenceDelegateTest.java
     [exec]     [javac]  (at line 478)

...

     [exec]     [javac] 	MockFooLabel complexLabel;
     [exec]     [javac] 	             ^^^^^^^^^^^^
     [exec]     [javac] The local variable complexLabel is never read
     [exec]     [javac] ----------
     [exec]     [javac] 3. WARNING in /home/hybld/continuum-working-directory/6/classlib/modules/beans/src/test/java/org/apache/harmony/beans/tests/java/beans/DefaultPersistenceDelegateTest.java
     [exec]     [javac]  (at line 720)
     [exec]     [javac] 	public static class MockNoGetterBean extends MockFoo {

...

     [exec]     [javac] 	                    ^^^^^^^^^^^^^^^^
     [exec]     [javac] The serializable class MockNoGetterBean does not declare a static final serialVersionUID field of type long
     [exec]     [javac] ----------
     [exec]     [javac] 4. WARNING in /home/hybld/continuum-working-directory/6/classlib/modules/beans/src/test/java/org/apache/harmony/beans/tests/java/beans/DefaultPersistenceDelegateTest.java
     [exec]     [javac]  (at line 796)
     [exec]     [javac] 	public static class MockTransientBean extends MockFoo {

...

     [exec]     [javac] 	                    ^^^^^^^^^^^^^^^^^
     [exec]     [javac] The serializable class MockTransientBean does not declare a static final serialVersionUID field of type long
     [exec]     [javac] ----------
     [exec]     [javac] ----------
     [exec]     [javac] 5. WARNING in /home/hybld/continuum-working-directory/6/classlib/modules/beans/src/test/java/org/apache/harmony/beans/tests/java/beans/PropertyChangeSupportTest.java
     [exec]     [javac]  (at line 1291)

...

     [exec]     [javac] 	static class MockPropertyChangeListener implements PropertyChangeListener,
     [exec]     [javac] 	             ^^^^^^^^^^^^^^^^^^^^^^^^^^
     [exec]     [javac] The serializable class MockPropertyChangeListener does not declare a static final serialVersionUID field of type long
     [exec]     [javac] ----------
     [exec]     [javac] 6. WARNING in /home/hybld/continuum-working-directory/6/classlib/modules/beans/src/test/java/org/apache/harmony/beans/tests/java/beans/PropertyChangeSupportTest.java
     [exec]     [javac]  (at line 1391)
     [exec]     [javac] 	MockPropertyChangeListener3 changeListener = new MockPropertyChangeListener3(

...

     [exec]     [javac] 	                            ^^^^^^^^^^^^^^
     [exec]     [javac] The local variable changeListener is never read
     [exec]     [javac] ----------
     [exec]     [javac] ----------
     [exec]     [javac] 7. WARNING in /home/hybld/continuum-working-directory/6/classlib/modules/beans/src/test/java/org/apache/harmony/beans/tests/java/beans/VetoableChangeSupportTest.java
     [exec]     [javac]  (at line 1671)

...

     [exec]     [javac] 	public static class MockSource implements Serializable {
     [exec]     [javac] 	                    ^^^^^^^^^^
     [exec]     [javac] The serializable class MockSource does not declare a static final serialVersionUID field of type long
     [exec]     [javac] ----------
     [exec]     [javac] ----------
     [exec]     [javac] 8. WARNING in /home/hybld/continuum-working-directory/6/classlib/modules/beans/src/test/java/org/apache/harmony/beans/tests/java/beans/beancontext/BeanContextSupportTest.java
     [exec]     [javac]  (at line 953)

...

     [exec]     [javac] 	class TestBeanException extends BeanContextChildSupport implements
     [exec]     [javac] 	      ^^^^^^^^^^^^^^^^^
     [exec]     [javac] The serializable class TestBeanException does not declare a static final serialVersionUID field of type long
     [exec]     [javac] ----------
     [exec]     [javac] 8 problems (8 warnings)

     [exec] run-tests:

...

     [exec]     [javac] ----------
     [exec]     [javac] 1. WARNING in /home/hybld/continuum-working-directory/6/classlib/modules/security/src/test/support/common/java/org/apache/harmony/security/tests/support/IdentityScopeStub.java
     [exec]     [javac]  (at line 35)
     [exec]     [javac] 	public class IdentityScopeStub extends IdentityScope {
     [exec]     [javac] 	             ^^^^^^^^^^^^^^^^^
     [exec]     [javac] The serializable class IdentityScopeStub does not declare a static final serialVersionUID field of type long
     [exec]     [javac] ----------
     [exec]     [javac] 2. WARNING in /home/hybld/continuum-working-directory/6/classlib/modules/security/src/test/support/common/java/org/apache/harmony/security/tests/support/IdentityScopeStub.java
     [exec]     [javac]  (at line 112)
     [exec]     [javac] 	public Enumeration identities() {

...

     [exec]     [javac] 	       ^^^^^^^^^^^
     [exec]     [javac] Type safety: The return type Enumeration for identities() from the type IdentityScopeStub needs unchecked conversion to conform to Enumeration<Identity> from the type IdentityScope
     [exec]     [javac] ----------
     [exec]     [javac] ----------
     [exec]     [javac] 3. WARNING in /home/hybld/continuum-working-directory/6/classlib/modules/security/src/test/support/common/java/org/apache/harmony/security/tests/support/IdentityStub.java
     [exec]     [javac]  (at line 35)

...

     [exec]     [javac] 	public class IdentityStub extends Identity {
     [exec]     [javac] 	             ^^^^^^^^^^^^
     [exec]     [javac] The serializable class IdentityStub does not declare a static final serialVersionUID field of type long
     [exec]     [javac] ----------
     [exec]     [javac] ----------
     [exec]     [javac] 4. WARNING in /home/hybld/continuum-working-directory/6/classlib/modules/security/src/test/support/common/java/org/apache/harmony/security/tests/support/KeyStoreTestSupport.java
     [exec]     [javac]  (at line 63)

...

     [exec]     [javac] 	public static class SKey implements SecretKey {
     [exec]     [javac] 	                    ^^^^
     [exec]     [javac] The serializable class SKey does not declare a static final serialVersionUID field of type long
     [exec]     [javac] ----------
     [exec]     [javac] 5. WARNING in /home/hybld/continuum-working-directory/6/classlib/modules/security/src/test/support/common/java/org/apache/harmony/security/tests/support/KeyStoreTestSupport.java
     [exec]     [javac]  (at line 89)
     [exec]     [javac] 	public static class MyPrivateKey implements PrivateKey {

...

     [exec]     [javac] 	                    ^^^^^^^^^^^^
     [exec]     [javac] The serializable class MyPrivateKey does not declare a static final serialVersionUID field of type long
     [exec]     [javac] ----------
     [exec]     [javac] 6. WARNING in /home/hybld/continuum-working-directory/6/classlib/modules/security/src/test/support/common/java/org/apache/harmony/security/tests/support/KeyStoreTestSupport.java
     [exec]     [javac]  (at line 118)
     [exec]     [javac] 	public static class MCertificate extends Certificate {

...

     [exec]     [javac] 	                    ^^^^^^^^^^^^
     [exec]     [javac] The serializable class MCertificate does not declare a static final serialVersionUID field of type long
     [exec]     [javac] ----------
     [exec]     [javac] 7. WARNING in /home/hybld/continuum-working-directory/6/classlib/modules/security/src/test/support/common/java/org/apache/harmony/security/tests/support/KeyStoreTestSupport.java
     [exec]     [javac]  (at line 149)
     [exec]     [javac] 	return new PublicKey() {

...

     [exec]     [javac] 	           ^^^^^^^^^^^
     [exec]     [javac] The serializable class  does not declare a static final serialVersionUID field of type long
     [exec]     [javac] ----------
     [exec]     [javac] ----------
     [exec]     [javac] 8. WARNING in /home/hybld/continuum-working-directory/6/classlib/modules/security/src/test/support/common/java/org/apache/harmony/security/tests/support/MDGoldenData.java
     [exec]     [javac]  (at line 54)

...

     [exec]     [javac] ----------
     [exec]     [javac] 10. WARNING in /home/hybld/continuum-working-directory/6/classlib/modules/security/src/test/support/common/java/org/apache/harmony/security/tests/support/MDGoldenData.java
     [exec]     [javac]  (at line 71)
     [exec]     [javac] 	goldenData.put("SHA", goldenData.get("SHA-1"));
     [exec]     [javac] 	^^^^^^^^^^^^^^^^^^^^^^^^^^^^^^^^^^^^^^^^^^^^^^
     [exec]     [javac] Type safety: The method put(Object, Object) belongs to the raw type HashMap. References to generic type HashMap<K,V> should be parameterized
     [exec]     [javac] ----------
     [exec]     [javac] 11. WARNING in /home/hybld/continuum-working-directory/6/classlib/modules/security/src/test/support/common/java/org/apache/harmony/security/tests/support/MDGoldenData.java
     [exec]     [javac]  (at line 72)
     [exec]     [javac] 	goldenData.put("SHA_NU", goldenData.get("SHA-1_NU"));

...

     [exec]     [javac] ----------
     [exec]     [javac] 12. WARNING in /home/hybld/continuum-working-directory/6/classlib/modules/security/src/test/support/common/java/org/apache/harmony/security/tests/support/MDGoldenData.java
     [exec]     [javac]  (at line 74)
     [exec]     [javac] 	goldenData.put("SHA1", goldenData.get("SHA-1"));
     [exec]     [javac] 	^^^^^^^^^^^^^^^^^^^^^^^^^^^^^^^^^^^^^^^^^^^^^^^
     [exec]     [javac] Type safety: The method put(Object, Object) belongs to the raw type HashMap. References to generic type HashMap<K,V> should be parameterized
     [exec]     [javac] ----------
     [exec]     [javac] 13. WARNING in /home/hybld/continuum-working-directory/6/classlib/modules/security/src/test/support/common/java/org/apache/harmony/security/tests/support/MDGoldenData.java
     [exec]     [javac]  (at line 75)
     [exec]     [javac] 	goldenData.put("SHA1_NU", goldenData.get("SHA-1_NU"));

...

     [exec]     [javac] ----------
     [exec]     [javac] 22. WARNING in /home/hybld/continuum-working-directory/6/classlib/modules/security/src/test/support/common/java/org/apache/harmony/security/tests/support/MyAlgorithmParameters.java
     [exec]     [javac]  (at line 56)
     [exec]     [javac] 	protected AlgorithmParameterSpec engineGetParameterSpec(Class paramSpec)
     [exec]     [javac] 	          ^^^^^^^^^^^^^^^^^^^^^^
     [exec]     [javac] Type safety: The return type AlgorithmParameterSpec for engineGetParameterSpec(Class) from the type MyAlgorithmParameters needs unchecked conversion to conform to T from the type AlgorithmParametersSpi
     [exec]     [javac] ----------
     [exec]     [javac] ----------
     [exec]     [javac] 23. WARNING in /home/hybld/continuum-working-directory/6/classlib/modules/security/src/test/support/common/java/org/apache/harmony/security/tests/support/MyKeyPairGenerator1.java
     [exec]     [javac]  (at line 94)

...

     [exec]     [javac] 	public class PubKey implements PublicKey {
     [exec]     [javac] 	             ^^^^^^
     [exec]     [javac] The serializable class PubKey does not declare a static final serialVersionUID field of type long
     [exec]     [javac] ----------
     [exec]     [javac] 24. WARNING in /home/hybld/continuum-working-directory/6/classlib/modules/security/src/test/support/common/java/org/apache/harmony/security/tests/support/MyKeyPairGenerator1.java
     [exec]     [javac]  (at line 120)
     [exec]     [javac] 	public class PrivKey implements PrivateKey {

...

     [exec]     [javac] 	             ^^^^^^^
     [exec]     [javac] The serializable class PrivKey does not declare a static final serialVersionUID field of type long
     [exec]     [javac] ----------
     [exec]     [javac] ----------
     [exec]     [javac] 25. WARNING in /home/hybld/continuum-working-directory/6/classlib/modules/security/src/test/support/common/java/org/apache/harmony/security/tests/support/MyKeyStore.java
     [exec]     [javac]  (at line 97)

...

     [exec]     [javac] 	Keys.put(alias, key);
     [exec]     [javac] 	^^^^^^^^^^^^^^^^^^^^
     [exec]     [javac] Type safety: The method put(Object, Object) belongs to the raw type Hashtable. References to generic type Hashtable<K,V> should be parameterized
     [exec]     [javac] ----------
     [exec]     [javac] 26. WARNING in /home/hybld/continuum-working-directory/6/classlib/modules/security/src/test/support/common/java/org/apache/harmony/security/tests/support/MyKeyStore.java
     [exec]     [javac]  (at line 99)
     [exec]     [javac] 	Chain.put(alias, chain);

...

     [exec]     [javac] 	^^^^^^^^^^^^^^^^^^^^^^^
     [exec]     [javac] Type safety: The method put(Object, Object) belongs to the raw type Hashtable. References to generic type Hashtable<K,V> should be parameterized
     [exec]     [javac] ----------
     [exec]     [javac] 27. WARNING in /home/hybld/continuum-working-directory/6/classlib/modules/security/src/test/support/common/java/org/apache/harmony/security/tests/support/MyKeyStore.java
     [exec]     [javac]  (at line 101)
     [exec]     [javac] 	Dates.put(alias, new Date());

...

     [exec]     [javac] 	^^^^^^^^^^^^^^^^^^^^^^^^^^^^
     [exec]     [javac] Type safety: The method put(Object, Object) belongs to the raw type Hashtable. References to generic type Hashtable<K,V> should be parameterized
     [exec]     [javac] ----------
     [exec]     [javac] 28. WARNING in /home/hybld/continuum-working-directory/6/classlib/modules/security/src/test/support/common/java/org/apache/harmony/security/tests/support/MyKeyStore.java
     [exec]     [javac]  (at line 117)
     [exec]     [javac] 	Keys.put(alias, keyK);

...

     [exec]     [javac] 	^^^^^^^^^^^^^^^^^^^^^
     [exec]     [javac] Type safety: The method put(Object, Object) belongs to the raw type Hashtable. References to generic type Hashtable<K,V> should be parameterized
     [exec]     [javac] ----------
     [exec]     [javac] 29. WARNING in /home/hybld/continuum-working-directory/6/classlib/modules/security/src/test/support/common/java/org/apache/harmony/security/tests/support/MyKeyStore.java
     [exec]     [javac]  (at line 119)
     [exec]     [javac] 	Chain.put(alias, chain);

...

     [exec]     [javac] 	^^^^^^^^^^^^^^^^^^^^^^^
     [exec]     [javac] Type safety: The method put(Object, Object) belongs to the raw type Hashtable. References to generic type Hashtable<K,V> should be parameterized
     [exec]     [javac] ----------
     [exec]     [javac] 30. WARNING in /home/hybld/continuum-working-directory/6/classlib/modules/security/src/test/support/common/java/org/apache/harmony/security/tests/support/MyKeyStore.java
     [exec]     [javac]  (at line 121)
     [exec]     [javac] 	Dates.put(alias, new Date());

...

     [exec]     [javac] 	^^^^^^^^^^^^^^^^^^^^^^^^^^^^
     [exec]     [javac] Type safety: The method put(Object, Object) belongs to the raw type Hashtable. References to generic type Hashtable<K,V> should be parameterized
     [exec]     [javac] ----------
     [exec]     [javac] 31. WARNING in /home/hybld/continuum-working-directory/6/classlib/modules/security/src/test/support/common/java/org/apache/harmony/security/tests/support/MyKeyStore.java
     [exec]     [javac]  (at line 127)
     [exec]     [javac] 	Cert.put(alias, cert);

...

     [exec]     [javac] 	^^^^^^^^^^^^^^^^^^^^^
     [exec]     [javac] Type safety: The method put(Object, Object) belongs to the raw type Hashtable. References to generic type Hashtable<K,V> should be parameterized
     [exec]     [javac] ----------
     [exec]     [javac] 32. WARNING in /home/hybld/continuum-working-directory/6/classlib/modules/security/src/test/support/common/java/org/apache/harmony/security/tests/support/MyKeyStore.java
     [exec]     [javac]  (at line 128)
     [exec]     [javac] 	Dates.put(alias, new Date());

...

     [exec]     [javac] 	^^^^^^^^^^^^^^^^^^^^^^^^^^^^
     [exec]     [javac] Type safety: The method put(Object, Object) belongs to the raw type Hashtable. References to generic type Hashtable<K,V> should be parameterized
     [exec]     [javac] ----------
     [exec]     [javac] 33. WARNING in /home/hybld/continuum-working-directory/6/classlib/modules/security/src/test/support/common/java/org/apache/harmony/security/tests/support/MyKeyStore.java
     [exec]     [javac]  (at line 142)
     [exec]     [javac] 	public Enumeration engineAliases() {

...

     [exec]     [javac] 	       ^^^^^^^^^^^
     [exec]     [javac] Type safety: The return type Enumeration for engineAliases() from the type MyKeyStore needs unchecked conversion to conform to Enumeration<String> from the type KeyStoreSpi
     [exec]     [javac] ----------
     [exec]     [javac] 34. WARNING in /home/hybld/continuum-working-directory/6/classlib/modules/security/src/test/support/common/java/org/apache/harmony/security/tests/support/MyKeyStore.java
     [exec]     [javac]  (at line 187)
     [exec]     [javac] 	KeysSL.put(alias, Keys.get(alias));

...

     [exec]     [javac] 	^^^^^^^^^^^^^^^^^^^^^^^^^^^^^^^^^^
     [exec]     [javac] Type safety: The method put(Object, Object) belongs to the raw type Hashtable. References to generic type Hashtable<K,V> should be parameterized
     [exec]     [javac] ----------
     [exec]     [javac] 35. WARNING in /home/hybld/continuum-working-directory/6/classlib/modules/security/src/test/support/common/java/org/apache/harmony/security/tests/support/MyKeyStore.java
     [exec]     [javac]  (at line 188)
     [exec]     [javac] 	DatesSL.put(alias, Dates.get(alias));

...

     [exec]     [javac] 	^^^^^^^^^^^^^^^^^^^^^^^^^^^^^^^^^^^^
     [exec]     [javac] Type safety: The method put(Object, Object) belongs to the raw type Hashtable. References to generic type Hashtable<K,V> should be parameterized
     [exec]     [javac] ----------
     [exec]     [javac] 36. WARNING in /home/hybld/continuum-working-directory/6/classlib/modules/security/src/test/support/common/java/org/apache/harmony/security/tests/support/MyKeyStore.java
     [exec]     [javac]  (at line 190)
     [exec]     [javac] 	ChainSL.put(alias, Chain.get(alias));

...

     [exec]     [javac] 	^^^^^^^^^^^^^^^^^^^^^^^^^^^^^^^^^^^^
     [exec]     [javac] Type safety: The method put(Object, Object) belongs to the raw type Hashtable. References to generic type Hashtable<K,V> should be parameterized
     [exec]     [javac] ----------
     [exec]     [javac] 37. WARNING in /home/hybld/continuum-working-directory/6/classlib/modules/security/src/test/support/common/java/org/apache/harmony/security/tests/support/MyKeyStore.java
     [exec]     [javac]  (at line 196)
     [exec]     [javac] 	CertSL.put(alias, Cert.get(alias));

...

     [exec]     [javac] 	^^^^^^^^^^^^^^^^^^^^^^^^^^^^^^^^^^
     [exec]     [javac] Type safety: The method put(Object, Object) belongs to the raw type Hashtable. References to generic type Hashtable<K,V> should be parameterized
     [exec]     [javac] ----------
     [exec]     [javac] 38. WARNING in /home/hybld/continuum-working-directory/6/classlib/modules/security/src/test/support/common/java/org/apache/harmony/security/tests/support/MyKeyStore.java
     [exec]     [javac]  (at line 197)
     [exec]     [javac] 	DatesSL.put(alias, Dates.get(alias));

...

     [exec]     [javac] 	^^^^^^^^^^^^^^^^^^^^^^^^^^^^^^^^^^^^
     [exec]     [javac] Type safety: The method put(Object, Object) belongs to the raw type Hashtable. References to generic type Hashtable<K,V> should be parameterized
     [exec]     [javac] ----------
     [exec]     [javac] 39. WARNING in /home/hybld/continuum-working-directory/6/classlib/modules/security/src/test/support/common/java/org/apache/harmony/security/tests/support/MyKeyStore.java
     [exec]     [javac]  (at line 211)
     [exec]     [javac] 	Keys.put(alias, KeysSL.get(alias));

...

     [exec]     [javac] 	^^^^^^^^^^^^^^^^^^^^^^^^^^^^^^^^^^
     [exec]     [javac] Type safety: The method put(Object, Object) belongs to the raw type Hashtable. References to generic type Hashtable<K,V> should be parameterized
     [exec]     [javac] ----------
     [exec]     [javac] 40. WARNING in /home/hybld/continuum-working-directory/6/classlib/modules/security/src/test/support/common/java/org/apache/harmony/security/tests/support/MyKeyStore.java
     [exec]     [javac]  (at line 212)
     [exec]     [javac] 	Dates.put(alias, DatesSL.get(alias));

...

     [exec]     [javac] 	^^^^^^^^^^^^^^^^^^^^^^^^^^^^^^^^^^^^
     [exec]     [javac] Type safety: The method put(Object, Object) belongs to the raw type Hashtable. References to generic type Hashtable<K,V> should be parameterized
     [exec]     [javac] ----------
     [exec]     [javac] 41. WARNING in /home/hybld/continuum-working-directory/6/classlib/modules/security/src/test/support/common/java/org/apache/harmony/security/tests/support/MyKeyStore.java
     [exec]     [javac]  (at line 214)
     [exec]     [javac] 	Chain.put(alias, ChainSL.get(alias));

...

     [exec]     [javac] 	^^^^^^^^^^^^^^^^^^^^^^^^^^^^^^^^^^^^
     [exec]     [javac] Type safety: The method put(Object, Object) belongs to the raw type Hashtable. References to generic type Hashtable<K,V> should be parameterized
     [exec]     [javac] ----------
     [exec]     [javac] 42. WARNING in /home/hybld/continuum-working-directory/6/classlib/modules/security/src/test/support/common/java/org/apache/harmony/security/tests/support/MyKeyStore.java
     [exec]     [javac]  (at line 220)
     [exec]     [javac] 	Cert.put(alias, CertSL.get(alias));

...

     [exec]     [javac] 	^^^^^^^^^^^^^^^^^^^^^^^^^^^^^^^^^^
     [exec]     [javac] Type safety: The method put(Object, Object) belongs to the raw type Hashtable. References to generic type Hashtable<K,V> should be parameterized
     [exec]     [javac] ----------
     [exec]     [javac] 43. WARNING in /home/hybld/continuum-working-directory/6/classlib/modules/security/src/test/support/common/java/org/apache/harmony/security/tests/support/MyKeyStore.java
     [exec]     [javac]  (at line 221)
     [exec]     [javac] 	Dates.put(alias, DatesSL.get(alias));

...

     [exec]     [javac] 	^^^^^^^^^^^^^^^^^^^^^^^^^^^^^^^^^^^^
     [exec]     [javac] Type safety: The method put(Object, Object) belongs to the raw type Hashtable. References to generic type Hashtable<K,V> should be parameterized
     [exec]     [javac] ----------
     [exec]     [javac] ----------
     [exec]     [javac] 44. WARNING in /home/hybld/continuum-working-directory/6/classlib/modules/security/src/test/support/common/java/org/apache/harmony/security/tests/support/MyKeyStoreSpi.java
     [exec]     [javac]  (at line 86)

...

     [exec]     [javac] 	public Enumeration engineAliases() {
     [exec]     [javac] 	       ^^^^^^^^^^^
     [exec]     [javac] Type safety: The return type Enumeration for engineAliases() from the type MyKeyStoreSpi needs unchecked conversion to conform to Enumeration<String> from the type KeyStoreSpi
     [exec]     [javac] ----------
     [exec]     [javac] ----------
     [exec]     [javac] 45. WARNING in /home/hybld/continuum-working-directory/6/classlib/modules/security/src/test/support/common/java/org/apache/harmony/security/tests/support/RandomImpl.java
     [exec]     [javac]  (at line 30)

...

     [exec]     [javac] 	public class RandomImpl extends SecureRandomSpi {
     [exec]     [javac] 	             ^^^^^^^^^^
     [exec]     [javac] The serializable class RandomImpl does not declare a static final serialVersionUID field of type long
     [exec]     [javac] ----------
     [exec]     [javac] ----------
     [exec]     [javac] 46. WARNING in /home/hybld/continuum-working-directory/6/classlib/modules/security/src/test/support/common/java/org/apache/harmony/security/tests/support/SignerStub.java
     [exec]     [javac]  (at line 34)

...

     [exec]     [javac] 	public class SignerStub extends Signer {
     [exec]     [javac] 	             ^^^^^^^^^^
     [exec]     [javac] The serializable class SignerStub does not declare a static final serialVersionUID field of type long
     [exec]     [javac] ----------
     [exec]     [javac] ----------
     [exec]     [javac] 47. WARNING in /home/hybld/continuum-working-directory/6/classlib/modules/security/src/test/support/common/java/org/apache/harmony/security/tests/support/SpiEngUtils.java
     [exec]     [javac]  (at line 25)

...

     [exec]     [javac] 	import java.io.File;
     [exec]     [javac] 	       ^^^^^^^^^^^^
     [exec]     [javac] The import java.io.File is never used
     [exec]     [javac] ----------
     [exec]     [javac] 48. WARNING in /home/hybld/continuum-working-directory/6/classlib/modules/security/src/test/support/common/java/org/apache/harmony/security/tests/support/SpiEngUtils.java
     [exec]     [javac]  (at line 28)
     [exec]     [javac] 	import java.util.StringTokenizer;

...

     [exec]     [javac] 	       ^^^^^^^^^^^^^^^^^^^^^^^^^
     [exec]     [javac] The import java.util.StringTokenizer is never used
     [exec]     [javac] ----------
     [exec]     [javac] 49. WARNING in /home/hybld/continuum-working-directory/6/classlib/modules/security/src/test/support/common/java/org/apache/harmony/security/tests/support/SpiEngUtils.java
     [exec]     [javac]  (at line 62)
     [exec]     [javac] 	public class MyProvider extends Provider {

...

     [exec]     [javac] 	             ^^^^^^^^^^
     [exec]     [javac] The serializable class MyProvider does not declare a static final serialVersionUID field of type long
     [exec]     [javac] ----------
     [exec]     [javac] ----------
     [exec]     [javac] 50. WARNING in /home/hybld/continuum-working-directory/6/classlib/modules/security/src/test/support/common/java/org/apache/harmony/security/tests/support/TestCertUtils.java
     [exec]     [javac]  (at line 148)

...

     [exec]     [javac] 	public static final class TestCertPath extends CertPath implements
     [exec]     [javac] 	                          ^^^^^^^^^^^^
     [exec]     [javac] The serializable class TestCertPath does not declare a static final serialVersionUID field of type long
     [exec]     [javac] ----------
     [exec]     [javac] 51. WARNING in /home/hybld/continuum-working-directory/6/classlib/modules/security/src/test/support/common/java/org/apache/harmony/security/tests/support/TestCertUtils.java
     [exec]     [javac]  (at line 184)
     [exec]     [javac] 	public List getCertificates() {

...

     [exec]     [javac] 	       ^^^^
     [exec]     [javac] Type safety: The return type List for getCertificates() from the type TestCertUtils.TestCertPath needs unchecked conversion to conform to List<? extends Certificate> from the type CertPath
     [exec]     [javac] ----------
     [exec]     [javac] 52. WARNING in /home/hybld/continuum-working-directory/6/classlib/modules/security/src/test/support/common/java/org/apache/harmony/security/tests/support/TestCertUtils.java
     [exec]     [javac]  (at line 206)
     [exec]     [javac] 	public Iterator getEncodings() {

...

     [exec]     [javac] 	       ^^^^^^^^
     [exec]     [javac] Type safety: The return type Iterator for getEncodings() from the type TestCertUtils.TestCertPath needs unchecked conversion to conform to Iterator<String> from the type CertPath
     [exec]     [javac] ----------
     [exec]     [javac] 53. WARNING in /home/hybld/continuum-working-directory/6/classlib/modules/security/src/test/support/common/java/org/apache/harmony/security/tests/support/TestCertUtils.java
     [exec]     [javac]  (at line 208)
     [exec]     [javac] 	v.add("myTestEncoding");

...

     [exec]     [javac] 	^^^^^^^^^^^^^^^^^^^^^^^
     [exec]     [javac] Type safety: The method add(Object) belongs to the raw type Vector. References to generic type Vector<E> should be parameterized
     [exec]     [javac] ----------
     [exec]     [javac] 54. WARNING in /home/hybld/continuum-working-directory/6/classlib/modules/security/src/test/support/common/java/org/apache/harmony/security/tests/support/TestCertUtils.java
     [exec]     [javac]  (at line 277)
     [exec]     [javac] 	public static final class TestPublicKey implements PublicKey {

...

     [exec]     [javac] 	                          ^^^^^^^^^^^^^
     [exec]     [javac] The serializable class TestPublicKey does not declare a static final serialVersionUID field of type long
     [exec]     [javac] ----------
     [exec]     [javac] 55. WARNING in /home/hybld/continuum-working-directory/6/classlib/modules/security/src/test/support/common/java/org/apache/harmony/security/tests/support/TestCertUtils.java
     [exec]     [javac]  (at line 303)
     [exec]     [javac] 	public static class TestCertificate extends Certificate implements

...

     [exec]     [javac] 	                    ^^^^^^^^^^^^^^^
     [exec]     [javac] The serializable class TestCertificate does not declare a static final serialVersionUID field of type long
     [exec]     [javac] ----------
     [exec]     [javac] 56. WARNING in /home/hybld/continuum-working-directory/6/classlib/modules/security/src/test/support/common/java/org/apache/harmony/security/tests/support/TestCertUtils.java
     [exec]     [javac]  (at line 420)
     [exec]     [javac] 	public static class TestInvalidX509Certificate extends TestX509Certificate {

...

     [exec]     [javac] 	                    ^^^^^^^^^^^^^^^^^^^^^^^^^^
     [exec]     [javac] The serializable class TestInvalidX509Certificate does not declare a static final serialVersionUID field of type long
     [exec]     [javac] ----------
     [exec]     [javac] 57. WARNING in /home/hybld/continuum-working-directory/6/classlib/modules/security/src/test/support/common/java/org/apache/harmony/security/tests/support/TestCertUtils.java
     [exec]     [javac]  (at line 435)
     [exec]     [javac] 	public static class TestX509Certificate extends X509Certificate {

...

     [exec]     [javac] 	                    ^^^^^^^^^^^^^^^^^^^
     [exec]     [javac] The serializable class TestX509Certificate does not declare a static final serialVersionUID field of type long
     [exec]     [javac] ----------
     [exec]     [javac] 58. WARNING in /home/hybld/continuum-working-directory/6/classlib/modules/security/src/test/support/common/java/org/apache/harmony/security/tests/support/TestCertUtils.java
     [exec]     [javac]  (at line 542)
     [exec]     [javac] 	public Set getCriticalExtensionOIDs() {

...

     [exec]     [javac] 	       ^^^
     [exec]     [javac] Type safety: The return type Set for getCriticalExtensionOIDs() from the type TestCertUtils.TestX509Certificate needs unchecked conversion to conform to Set<String> from the type X509Extension
     [exec]     [javac] ----------
     [exec]     [javac] 59. WARNING in /home/hybld/continuum-working-directory/6/classlib/modules/security/src/test/support/common/java/org/apache/harmony/security/tests/support/TestCertUtils.java
     [exec]     [javac]  (at line 550)
     [exec]     [javac] 	public Set getNonCriticalExtensionOIDs() {

...

     [exec]     [javac] 	       ^^^
     [exec]     [javac] Type safety: The return type Set for getNonCriticalExtensionOIDs() from the type TestCertUtils.TestX509Certificate needs unchecked conversion to conform to Set<String> from the type X509Extension
     [exec]     [javac] ----------
     [exec]     [javac] 60. WARNING in /home/hybld/continuum-working-directory/6/classlib/modules/security/src/test/support/common/java/org/apache/harmony/security/tests/support/TestCertUtils.java
     [exec]     [javac]  (at line 584)
     [exec]     [javac] 	public static class TestProvider extends Provider {

...

     [exec]     [javac] 	                    ^^^^^^^^^^^^
     [exec]     [javac] The serializable class TestProvider does not declare a static final serialVersionUID field of type long
     [exec]     [javac] ----------
     [exec]     [javac] 61. WARNING in /home/hybld/continuum-working-directory/6/classlib/modules/security/src/test/support/common/java/org/apache/harmony/security/tests/support/TestCertUtils.java
     [exec]     [javac]  (at line 591)
     [exec]     [javac] 	TestFactorySpi.class.getName(), new ArrayList(), null);

...

     [exec]     [javac] 	                                ^^^^^^^^^^^^^^^
     [exec]     [javac] Type safety: The expression of type ArrayList needs unchecked conversion to conform to List<String>
     [exec]     [javac] ----------
     [exec]     [javac] 62. WARNING in /home/hybld/continuum-working-directory/6/classlib/modules/security/src/test/support/common/java/org/apache/harmony/security/tests/support/TestCertUtils.java
     [exec]     [javac]  (at line 594)
     [exec]     [javac] 	public synchronized Set getServices() {

...

     [exec]     [javac] 	                    ^^^
     [exec]     [javac] Type safety: The return type Set for getServices() from the type TestCertUtils.TestProvider needs unchecked conversion to conform to Set<Provider.Service> from the type Provider
     [exec]     [javac] ----------
     [exec]     [javac] 63. WARNING in /home/hybld/continuum-working-directory/6/classlib/modules/security/src/test/support/common/java/org/apache/harmony/security/tests/support/TestCertUtils.java
     [exec]     [javac]  (at line 596)
     [exec]     [javac] 	s.add(serv);

...

     [exec]     [javac] 	^^^^^^^^^^^
     [exec]     [javac] Type safety: The method add(Object) belongs to the raw type HashSet. References to generic type HashSet<E> should be parameterized
     [exec]     [javac] ----------
     [exec]     [javac] 64. WARNING in /home/hybld/continuum-working-directory/6/classlib/modules/security/src/test/support/common/java/org/apache/harmony/security/tests/support/TestCertUtils.java
     [exec]     [javac]  (at line 647)
     [exec]     [javac] 	public Collection engineGenerateCertificates(InputStream inStream)

...

     [exec]     [javac] 	       ^^^^^^^^^^
     [exec]     [javac] Type safety: The return type Collection for engineGenerateCertificates(InputStream) from the type TestCertUtils.TestFactorySpi needs unchecked conversion to conform to Collection<? extends Certificate> from the type CertificateFactorySpi
     [exec]     [javac] ----------
     [exec]     [javac] 65. WARNING in /home/hybld/continuum-working-directory/6/classlib/modules/security/src/test/support/common/java/org/apache/harmony/security/tests/support/TestCertUtils.java
     [exec]     [javac]  (at line 664)
     [exec]     [javac] 	public Collection engineGenerateCRLs(InputStream inStream)

...

     [exec]     [javac] 	       ^^^^^^^^^^
     [exec]     [javac] Type safety: The return type Collection for engineGenerateCRLs(InputStream) from the type TestCertUtils.TestFactorySpi needs unchecked conversion to conform to Collection<? extends CRL> from the type CertificateFactorySpi
     [exec]     [javac] ----------
     [exec]     [javac] 66. WARNING in /home/hybld/continuum-working-directory/6/classlib/modules/security/src/test/support/common/java/org/apache/harmony/security/tests/support/TestCertUtils.java
     [exec]     [javac]  (at line 686)
     [exec]     [javac] 	validCerts.add(c);

...

     [exec]     [javac] 	^^^^^^^^^^^^^^^^^
     [exec]     [javac] Type safety: The method add(Object) belongs to the raw type ArrayList. References to generic type ArrayList<E> should be parameterized
     [exec]     [javac] ----------
     [exec]     [javac] 67. WARNING in /home/hybld/continuum-working-directory/6/classlib/modules/security/src/test/support/common/java/org/apache/harmony/security/tests/support/TestCertUtils.java
     [exec]     [javac]  (at line 689)
     [exec]     [javac] 	validCerts.toArray(acerts);

...

     [exec]     [javac] 	^^^^^^^^^^^^^^^^^^^^^^^^^^
     [exec]     [javac] Type safety: The method toArray(Object[]) belongs to the raw type ArrayList. References to generic type ArrayList<E> should be parameterized
     [exec]     [javac] ----------
     [exec]     [javac] 68. WARNING in /home/hybld/continuum-working-directory/6/classlib/modules/security/src/test/support/common/java/org/apache/harmony/security/tests/support/TestCertUtils.java
     [exec]     [javac]  (at line 798)
     [exec]     [javac] 	al.add(name);

...

     [exec]     [javac] 	^^^^^^^^^^^^
     [exec]     [javac] Type safety: The method add(Object) belongs to the raw type ArrayList. References to generic type ArrayList<E> should be parameterized
     [exec]     [javac] ----------
     [exec]     [javac] 69. WARNING in /home/hybld/continuum-working-directory/6/classlib/modules/security/src/test/support/common/java/org/apache/harmony/security/tests/support/TestCertUtils.java
     [exec]     [javac]  (at line 810)
     [exec]     [javac] 	return (String[]) al.toArray(new String[al.size()]);

...

     [exec]     [javac] ----------
     [exec]     [javac] 76. WARNING in /home/hybld/continuum-working-directory/6/classlib/modules/security/src/test/support/common/java/org/apache/harmony/security/tests/support/cert/MyCertPath.java
     [exec]     [javac]  (at line 37)
     [exec]     [javac] 	public class MyCertPath extends CertPath {
     [exec]     [javac] 	             ^^^^^^^^^^
     [exec]     [javac] The serializable class MyCertPath does not declare a static final serialVersionUID field of type long
     [exec]     [javac] ----------
     [exec]     [javac] 77. WARNING in /home/hybld/continuum-working-directory/6/classlib/modules/security/src/test/support/common/java/org/apache/harmony/security/tests/support/cert/MyCertPath.java
     [exec]     [javac]  (at line 61)
     [exec]     [javac] 	certificates.add(new MyCertificate("MyEncoding", encoding));

...

     [exec]     [javac] ----------
     [exec]     [javac] 78. WARNING in /home/hybld/continuum-working-directory/6/classlib/modules/security/src/test/support/common/java/org/apache/harmony/security/tests/support/cert/MyCertPath.java
     [exec]     [javac]  (at line 63)
     [exec]     [javac] 	encodingNames.add("MyEncoding");
     [exec]     [javac] 	^^^^^^^^^^^^^^^^^^^^^^^^^^^^^^^
     [exec]     [javac] Type safety: The method add(Object) belongs to the raw type Vector. References to generic type Vector<E> should be parameterized
     [exec]     [javac] ----------
     [exec]     [javac] 79. WARNING in /home/hybld/continuum-working-directory/6/classlib/modules/security/src/test/support/common/java/org/apache/harmony/security/tests/support/cert/MyCertPath.java
     [exec]     [javac]  (at line 70)
     [exec]     [javac] 	public List getCertificates() {

...

     [exec]     [javac] 	       ^^^^
     [exec]     [javac] Type safety: The return type List for getCertificates() from the type MyCertPath needs unchecked conversion to conform to List<? extends Certificate> from the type CertPath
     [exec]     [javac] ----------
     [exec]     [javac] 80. WARNING in /home/hybld/continuum-working-directory/6/classlib/modules/security/src/test/support/common/java/org/apache/harmony/security/tests/support/cert/MyCertPath.java
     [exec]     [javac]  (at line 71)
     [exec]     [javac] 	return Collections.unmodifiableList(certificates);

...

     [exec]     [javac] ----------
     [exec]     [javac] 81. WARNING in /home/hybld/continuum-working-directory/6/classlib/modules/security/src/test/support/common/java/org/apache/harmony/security/tests/support/cert/MyCertPath.java
     [exec]     [javac]  (at line 71)
     [exec]     [javac] 	return Collections.unmodifiableList(certificates);
     [exec]     [javac] 	                                    ^^^^^^^^^^^^
     [exec]     [javac] Type safety: The expression of type Vector needs unchecked conversion to conform to List<? extends E>
     [exec]     [javac] ----------
     [exec]     [javac] 82. WARNING in /home/hybld/continuum-working-directory/6/classlib/modules/security/src/test/support/common/java/org/apache/harmony/security/tests/support/cert/MyCertPath.java
     [exec]     [javac]  (at line 102)
     [exec]     [javac] 	public Iterator getEncodings() {

...

     [exec]     [javac] 	       ^^^^^^^^
     [exec]     [javac] Type safety: The return type Iterator for getEncodings() from the type MyCertPath needs unchecked conversion to conform to Iterator<String> from the type CertPath
     [exec]     [javac] ----------
     [exec]     [javac] 83. WARNING in /home/hybld/continuum-working-directory/6/classlib/modules/security/src/test/support/common/java/org/apache/harmony/security/tests/support/cert/MyCertPath.java
     [exec]     [javac]  (at line 103)
     [exec]     [javac] 	return Collections.unmodifiableCollection(encodingNames).iterator();

...

     [exec]     [javac] ----------
     [exec]     [javac] 85. WARNING in /home/hybld/continuum-working-directory/6/classlib/modules/security/src/test/support/common/java/org/apache/harmony/security/tests/support/cert/MyCertStoreSpi.java
     [exec]     [javac]  (at line 49)
     [exec]     [javac] 	public Collection engineGetCertificates(CertSelector selector)
     [exec]     [javac] 	       ^^^^^^^^^^
     [exec]     [javac] Type safety: The return type Collection for engineGetCertificates(CertSelector) from the type MyCertStoreSpi needs unchecked conversion to conform to Collection<? extends Certificate> from the type CertStoreSpi
     [exec]     [javac] ----------
     [exec]     [javac] 86. WARNING in /home/hybld/continuum-working-directory/6/classlib/modules/security/src/test/support/common/java/org/apache/harmony/security/tests/support/cert/MyCertStoreSpi.java
     [exec]     [javac]  (at line 57)
     [exec]     [javac] 	public Collection engineGetCRLs(CRLSelector selector)

...

     [exec]     [javac] 	       ^^^^^^^^^^
     [exec]     [javac] Type safety: The return type Collection for engineGetCRLs(CRLSelector) from the type MyCertStoreSpi needs unchecked conversion to conform to Collection<? extends CRL> from the type CertStoreSpi
     [exec]     [javac] ----------
     [exec]     [javac] ----------
     [exec]     [javac] 87. WARNING in /home/hybld/continuum-working-directory/6/classlib/modules/security/src/test/support/common/java/org/apache/harmony/security/tests/support/cert/MyCertificate.java
     [exec]     [javac]  (at line 37)

...

     [exec]     [javac] 	public class MyCertificate extends Certificate {
     [exec]     [javac] 	             ^^^^^^^^^^^^^
     [exec]     [javac] The serializable class MyCertificate does not declare a static final serialVersionUID field of type long
     [exec]     [javac] ----------
     [exec]     [javac] 88. WARNING in /home/hybld/continuum-working-directory/6/classlib/modules/security/src/test/support/common/java/org/apache/harmony/security/tests/support/cert/MyCertificate.java
     [exec]     [javac]  (at line 90)
     [exec]     [javac] 	return new PublicKey() {

...

     [exec]     [javac] 	           ^^^^^^^^^^^
     [exec]     [javac] The serializable class  does not declare a static final serialVersionUID field of type long
     [exec]     [javac] ----------
     [exec]     [javac] ----------
     [exec]     [javac] 89. WARNING in /home/hybld/continuum-working-directory/6/classlib/modules/security/src/test/support/common/java/org/apache/harmony/security/tests/support/cert/MyCertificateFactorySpi.java
     [exec]     [javac]  (at line 58)

...

     [exec]     [javac] 	list.add("aa");
     [exec]     [javac] 	^^^^^^^^^^^^^^
     [exec]     [javac] Type safety: The method add(Object) belongs to the raw type Set. References to generic type Set<E> should be parameterized
     [exec]     [javac] ----------
     [exec]     [javac] 90. WARNING in /home/hybld/continuum-working-directory/6/classlib/modules/security/src/test/support/common/java/org/apache/harmony/security/tests/support/cert/MyCertificateFactorySpi.java
     [exec]     [javac]  (at line 59)
     [exec]     [javac] 	list.add("bb");

...

     [exec]     [javac] 	^^^^^^^^^^^^^^
     [exec]     [javac] Type safety: The method add(Object) belongs to the raw type Set. References to generic type Set<E> should be parameterized
     [exec]     [javac] ----------
     [exec]     [javac] 91. WARNING in /home/hybld/continuum-working-directory/6/classlib/modules/security/src/test/support/common/java/org/apache/harmony/security/tests/support/cert/MyCertificateFactorySpi.java
     [exec]     [javac]  (at line 74)
     [exec]     [javac] 	public Collection engineGenerateCertificates(InputStream inStream)

...

     [exec]     [javac] 	       ^^^^^^^^^^
     [exec]     [javac] Type safety: The return type Collection for engineGenerateCertificates(InputStream) from the type MyCertificateFactorySpi needs unchecked conversion to conform to Collection<? extends Certificate> from the type CertificateFactorySpi
     [exec]     [javac] ----------
     [exec]     [javac] 92. WARNING in /home/hybld/continuum-working-directory/6/classlib/modules/security/src/test/support/common/java/org/apache/harmony/security/tests/support/cert/MyCertificateFactorySpi.java
     [exec]     [javac]  (at line 89)
     [exec]     [javac] 	public Collection engineGenerateCRLs(InputStream inStream)

...

     [exec]     [javac] 	       ^^^^^^^^^^
     [exec]     [javac] Type safety: The return type Collection for engineGenerateCRLs(InputStream) from the type MyCertificateFactorySpi needs unchecked conversion to conform to Collection<? extends CRL> from the type CertificateFactorySpi
     [exec]     [javac] ----------
     [exec]     [javac] 93. WARNING in /home/hybld/continuum-working-directory/6/classlib/modules/security/src/test/support/common/java/org/apache/harmony/security/tests/support/cert/MyCertificateFactorySpi.java
     [exec]     [javac]  (at line 132)
     [exec]     [javac] 	public Iterator engineGetCertPathEncodings() {

...

     [exec]     [javac] 	       ^^^^^^^^
     [exec]     [javac] Type safety: The return type Iterator for engineGetCertPathEncodings() from the type MyCertificateFactorySpi needs unchecked conversion to conform to Iterator<String> from the type CertificateFactorySpi
     [exec]     [javac] ----------
     [exec]     [javac] ----------
     [exec]     [javac] 94. WARNING in /home/hybld/continuum-working-directory/6/classlib/modules/security/src/test/support/common/java/org/apache/harmony/security/tests/support/cert/TestUtils.java
     [exec]     [javac]  (at line 27)

...

     [exec]     [javac] 	import java.io.FileNotFoundException;
     [exec]     [javac] 	       ^^^^^^^^^^^^^^^^^^^^^^^^^^^^^
     [exec]     [javac] The import java.io.FileNotFoundException is never used
     [exec]     [javac] ----------
     [exec]     [javac] 95. WARNING in /home/hybld/continuum-working-directory/6/classlib/modules/security/src/test/support/common/java/org/apache/harmony/security/tests/support/cert/TestUtils.java
     [exec]     [javac]  (at line 126)
     [exec]     [javac] 	if (!set.add(ta)) {

...

     [exec]     [javac] 	     ^^^^^^^^^^^
     [exec]     [javac] Type safety: The method add(Object) belongs to the raw type HashSet. References to generic type HashSet<E> should be parameterized
     [exec]     [javac] ----------
     [exec]     [javac] 96. WARNING in /home/hybld/continuum-working-directory/6/classlib/modules/security/src/test/support/common/java/org/apache/harmony/security/tests/support/cert/TestUtils.java
     [exec]     [javac]  (at line 183)
     [exec]     [javac] 	if (!l.add(cs)) {

...

     [exec]     [javac] 	     ^^^^^^^^^
     [exec]     [javac] Type safety: The method add(Object) belongs to the raw type ArrayList. References to generic type ArrayList<E> should be parameterized
     [exec]     [javac] ----------
     [exec]     [javac] 97. WARNING in /home/hybld/continuum-working-directory/6/classlib/modules/security/src/test/support/common/java/org/apache/harmony/security/tests/support/cert/TestUtils.java
     [exec]     [javac]  (at line 203)
     [exec]     [javac] 	public Set getSupportedExtensions() {

...

     [exec]     [javac] 	       ^^^
     [exec]     [javac] Type safety: The return type Set for getSupportedExtensions() from the type new PKIXCertPathChecker(){} needs unchecked conversion to conform to Set<String> from the type PKIXCertPathChecker
     [exec]     [javac] ----------
     [exec]     [javac] 98. WARNING in /home/hybld/continuum-working-directory/6/classlib/modules/security/src/test/support/common/java/org/apache/harmony/security/tests/support/cert/TestUtils.java
     [exec]     [javac]  (at line 244)
     [exec]     [javac] 	public Iterator getChildren() {

...

     [exec]     [javac] 	       ^^^^^^^^
     [exec]     [javac] Type safety: The return type Iterator for getChildren() from the type new PolicyNode(){} needs unchecked conversion to conform to Iterator<? extends PolicyNode> from the type PolicyNode
     [exec]     [javac] ----------
     [exec]     [javac] 99. WARNING in /home/hybld/continuum-working-directory/6/classlib/modules/security/src/test/support/common/java/org/apache/harmony/security/tests/support/cert/TestUtils.java
     [exec]     [javac]  (at line 263)
     [exec]     [javac] 	public Iterator getChildren() {

...

     [exec]     [javac] 	       ^^^^^^^^
     [exec]     [javac] Type safety: The return type Iterator for getChildren() from the type new PolicyNode(){} needs unchecked conversion to conform to Iterator<? extends PolicyNode> from the type PolicyNode
     [exec]     [javac] ----------
     [exec]     [javac] 100. WARNING in /home/hybld/continuum-working-directory/6/classlib/modules/security/src/test/support/common/java/org/apache/harmony/security/tests/support/cert/TestUtils.java
     [exec]     [javac]  (at line 267)
     [exec]     [javac] 	public Set getExpectedPolicies() {

...

     [exec]     [javac] 	       ^^^
     [exec]     [javac] Type safety: The return type Set for getExpectedPolicies() from the type new PolicyNode(){} needs unchecked conversion to conform to Set<String> from the type PolicyNode
     [exec]     [javac] ----------
     [exec]     [javac] 101. WARNING in /home/hybld/continuum-working-directory/6/classlib/modules/security/src/test/support/common/java/org/apache/harmony/security/tests/support/cert/TestUtils.java
     [exec]     [javac]  (at line 271)
     [exec]     [javac] 	public Set getPolicyQualifiers() {

...

     [exec]     [javac] 	       ^^^
     [exec]     [javac] Type safety: The return type Set for getPolicyQualifiers() from the type new PolicyNode(){} needs unchecked conversion to conform to Set<? extends PolicyQualifierInfo> from the type PolicyNode
     [exec]     [javac] ----------
     [exec]     [javac] 102. WARNING in /home/hybld/continuum-working-directory/6/classlib/modules/security/src/test/support/common/java/org/apache/harmony/security/tests/support/cert/TestUtils.java
     [exec]     [javac]  (at line 276)
     [exec]     [javac] 	s.add(child);

...

     [exec]     [javac] 	^^^^^^^^^^^^
     [exec]     [javac] Type safety: The method add(Object) belongs to the raw type HashSet. References to generic type HashSet<E> should be parameterized
     [exec]     [javac] ----------
     [exec]     [javac] 103. WARNING in /home/hybld/continuum-working-directory/6/classlib/modules/security/src/test/support/common/java/org/apache/harmony/security/tests/support/cert/TestUtils.java
     [exec]     [javac]  (at line 280)
     [exec]     [javac] 	public Set getExpectedPolicies() {

...

     [exec]     [javac] 	       ^^^
     [exec]     [javac] Type safety: The return type Set for getExpectedPolicies() from the type new PolicyNode(){} needs unchecked conversion to conform to Set<String> from the type PolicyNode
     [exec]     [javac] ----------
     [exec]     [javac] 104. WARNING in /home/hybld/continuum-working-directory/6/classlib/modules/security/src/test/support/common/java/org/apache/harmony/security/tests/support/cert/TestUtils.java
     [exec]     [javac]  (at line 284)
     [exec]     [javac] 	public Set getPolicyQualifiers() {

...

     [exec]     [javac] 	       ^^^
     [exec]     [javac] Type safety: The return type Set for getPolicyQualifiers() from the type new PolicyNode(){} needs unchecked conversion to conform to Set<? extends PolicyQualifierInfo> from the type PolicyNode
     [exec]     [javac] ----------
     [exec]     [javac] 104 problems (104 warnings)
     [exec]      [echo] Compiling CRYPTO api tests
     [exec]     [javac] Compiling 37 source files to /home/hybld/continuum-working-directory/6/classlib/modules/crypto/bin/test/api

...

     [exec]     [javac] ----------
     [exec]     [javac] 1. WARNING in /home/hybld/continuum-working-directory/6/classlib/modules/crypto/src/test/api/java/org/apache/harmony/crypto/tests/javax/crypto/CipherTest.java
     [exec]     [javac]  (at line 23)
     [exec]     [javac] 	import java.security.AlgorithmParameters;
     [exec]     [javac] 	       ^^^^^^^^^^^^^^^^^^^^^^^^^^^^^^^^^
     [exec]     [javac] The import java.security.AlgorithmParameters is never used
     [exec]     [javac] ----------
     [exec]     [javac] 2. WARNING in /home/hybld/continuum-working-directory/6/classlib/modules/crypto/src/test/api/java/org/apache/harmony/crypto/tests/javax/crypto/CipherTest.java
     [exec]     [javac]  (at line 394)
     [exec]     [javac] 	byte[] b = {1,2,3,4,5,6,7,8,9,10};

...

     [exec]     [javac] 	       ^
     [exec]     [javac] The local variable b is never read
     [exec]     [javac] ----------
     [exec]     [javac] 3. WARNING in /home/hybld/continuum-working-directory/6/classlib/modules/crypto/src/test/api/java/org/apache/harmony/crypto/tests/javax/crypto/CipherTest.java
     [exec]     [javac]  (at line 395)
     [exec]     [javac] 	byte[] b1 = new byte[6];

...

     [exec]     [javac] 	       ^^
     [exec]     [javac] The local variable b1 is never read
     [exec]     [javac] ----------
     [exec]     [javac] 4. WARNING in /home/hybld/continuum-working-directory/6/classlib/modules/crypto/src/test/api/java/org/apache/harmony/crypto/tests/javax/crypto/CipherTest.java
     [exec]     [javac]  (at line 462)
     [exec]     [javac] 	new testCipher(null, new Provider("qwerty", 1.0, "qwerty") {}, "s");

...

     [exec]     [javac] ----------
     [exec]     [javac] 5. WARNING in /home/hybld/continuum-working-directory/6/classlib/modules/crypto/src/test/api/java/org/apache/harmony/crypto/tests/javax/crypto/EncryptedPrivateKeyInfoTest.java
     [exec]     [javac]  (at line 1251)
     [exec]     [javac] 	epki.getKeySpec(new Key() {
     [exec]     [javac] 	                    ^^^^^
     [exec]     [javac] The serializable class  does not declare a static final serialVersionUID field of type long
     [exec]     [javac] ----------
     [exec]     [javac] 6. WARNING in /home/hybld/continuum-working-directory/6/classlib/modules/crypto/src/test/api/java/org/apache/harmony/crypto/tests/javax/crypto/EncryptedPrivateKeyInfoTest.java
     [exec]     [javac]  (at line 1393)
     [exec]     [javac] 	epki.getKeySpec(new Key() {

...

     [exec]     [javac] 	                    ^^^^^
     [exec]     [javac] The serializable class  does not declare a static final serialVersionUID field of type long
     [exec]     [javac] ----------
     [exec]     [javac] 7. WARNING in /home/hybld/continuum-working-directory/6/classlib/modules/crypto/src/test/api/java/org/apache/harmony/crypto/tests/javax/crypto/EncryptedPrivateKeyInfoTest.java
     [exec]     [javac]  (at line 1515)
     [exec]     [javac] 	public static class AllowedFailure extends Exception {

...

     [exec]     [javac] 	                    ^^^^^^^^^^^^^^
     [exec]     [javac] The serializable class AllowedFailure does not declare a static final serialVersionUID field of type long
     [exec]     [javac] ----------
     [exec]     [javac] ----------
     [exec]     [javac] 8. WARNING in /home/hybld/continuum-working-directory/6/classlib/modules/crypto/src/test/api/java/org/apache/harmony/crypto/tests/javax/crypto/ExemptionMechanismTest.java
     [exec]     [javac]  (at line 29)

...

     [exec]     [javac] ----------
     [exec]     [javac] 9. WARNING in /home/hybld/continuum-working-directory/6/classlib/modules/crypto/src/test/api/java/org/apache/harmony/crypto/tests/javax/crypto/KeyAgreementTest.java
     [exec]     [javac]  (at line 38)
     [exec]     [javac] 	import javax.crypto.KeyAgreementSpi;
     [exec]     [javac] 	       ^^^^^^^^^^^^^^^^^^^^^^^^^^^^
     [exec]     [javac] The import javax.crypto.KeyAgreementSpi is never used
     [exec]     [javac] ----------
     [exec]     [javac] 10. WARNING in /home/hybld/continuum-working-directory/6/classlib/modules/crypto/src/test/api/java/org/apache/harmony/crypto/tests/javax/crypto/KeyAgreementTest.java
     [exec]     [javac]  (at line 42)
     [exec]     [javac] 	import org.apache.harmony.crypto.tests.support.MyKeyAgreementSpi;

...

     [exec]     [javac] ----------
     [exec]     [javac] 11. WARNING in /home/hybld/continuum-working-directory/6/classlib/modules/crypto/src/test/api/java/org/apache/harmony/crypto/tests/javax/crypto/SecretKeyTest.java
     [exec]     [javac]  (at line 55)
     [exec]     [javac] 	public class checkSecretKey implements SecretKey {
     [exec]     [javac] 	             ^^^^^^^^^^^^^^
     [exec]     [javac] The serializable class checkSecretKey does not declare a static final serialVersionUID field of type long
     [exec]     [javac] ----------
     [exec]     [javac] ----------
     [exec]     [javac] 12. WARNING in /home/hybld/continuum-working-directory/6/classlib/modules/crypto/src/test/api/java/org/apache/harmony/crypto/tests/javax/crypto/interfaces/DHPrivateKeyTest.java
     [exec]     [javac]  (at line 58)

...

     [exec]     [javac] 	public class checkDHPrivateKey implements DHPrivateKey {
     [exec]     [javac] 	             ^^^^^^^^^^^^^^^^^
     [exec]     [javac] The serializable class checkDHPrivateKey does not declare a static final serialVersionUID field of type long
     [exec]     [javac] ----------
     [exec]     [javac] ----------
     [exec]     [javac] 13. WARNING in /home/hybld/continuum-working-directory/6/classlib/modules/crypto/src/test/api/java/org/apache/harmony/crypto/tests/javax/crypto/interfaces/DHPublicKeyTest.java
     [exec]     [javac]  (at line 60)

...

     [exec]     [javac] 	public class checkDHPublicKey implements DHPublicKey {
     [exec]     [javac] 	             ^^^^^^^^^^^^^^^^
     [exec]     [javac] The serializable class checkDHPublicKey does not declare a static final serialVersionUID field of type long
     [exec]     [javac] ----------
     [exec]     [javac] ----------
     [exec]     [javac] 14. WARNING in /home/hybld/continuum-working-directory/6/classlib/modules/crypto/src/test/api/java/org/apache/harmony/crypto/tests/javax/crypto/interfaces/PBEKeyTest.java
     [exec]     [javac]  (at line 57)

...

     [exec]     [javac] 	public class checkPBEKey implements PBEKey {
     [exec]     [javac] 	             ^^^^^^^^^^^
     [exec]     [javac] The serializable class checkPBEKey does not declare a static final serialVersionUID field of type long
     [exec]     [javac] ----------
     [exec]     [javac] 14 problems (14 warnings)
     [exec]      [echo] Compiling CRYPTO api injected tests
     [exec]     [javac] Compiling 10 source files to /home/hybld/continuum-working-directory/6/classlib/modules/crypto/bin/test/api.injected

...

     [exec]     [javac] ----------
     [exec]     [javac] 1. WARNING in /home/hybld/continuum-working-directory/6/classlib/modules/crypto/src/test/impl/java/org/apache/harmony/crypto/tests/javax/crypto/Cipher_ImplTest.java
     [exec]     [javac]  (at line 286)
     [exec]     [javac] 	private class MyProvider1 extends Provider {
     [exec]     [javac] 	              ^^^^^^^^^^^
     [exec]     [javac] The serializable class MyProvider1 does not declare a static final serialVersionUID field of type long
     [exec]     [javac] ----------
     [exec]     [javac] 2. WARNING in /home/hybld/continuum-working-directory/6/classlib/modules/crypto/src/test/impl/java/org/apache/harmony/crypto/tests/javax/crypto/Cipher_ImplTest.java
     [exec]     [javac]  (at line 293)
     [exec]     [javac] 	private class MyProvider2 extends Provider {

...

     [exec]     [javac] 	              ^^^^^^^^^^^
     [exec]     [javac] The serializable class MyProvider2 does not declare a static final serialVersionUID field of type long
     [exec]     [javac] ----------
     [exec]     [javac] ----------
     [exec]     [javac] 3. WARNING in /home/hybld/continuum-working-directory/6/classlib/modules/crypto/src/test/impl/java/org/apache/harmony/crypto/tests/javax/crypto/ExemptionMechanism_ImplTest.java
     [exec]     [javac]  (at line 89)

...

     [exec]     [javac] 	byte[] emptyA = new byte[0];
     [exec]     [javac] 	       ^^^^^^
     [exec]     [javac] The local variable emptyA is never read
     [exec]     [javac] ----------
     [exec]     [javac] ----------
     [exec]     [javac] 4. WARNING in /home/hybld/continuum-working-directory/6/classlib/modules/crypto/src/test/impl/java/org/apache/harmony/crypto/tests/javax/crypto/Mac_ImplTest.java
     [exec]     [javac]  (at line 267)

...

     [exec]     [javac] 	public static class tmpKey implements Key {
     [exec]     [javac] 	                    ^^^^^^
     [exec]     [javac] The serializable class tmpKey does not declare a static final serialVersionUID field of type long
     [exec]     [javac] ----------
     [exec]     [javac] 4 problems (4 warnings)

     [exec] run-tests-api:

...

     [exec]     [javac] ----------
     [exec]     [javac] 1. WARNING in /home/hybld/continuum-working-directory/6/classlib/modules/logging/src/test/java/org/apache/harmony/logging/tests/java/util/logging/FileHandlerTest.java
     [exec]     [javac]  (at line 32)
     [exec]     [javac] 	import java.nio.channels.FileChannel;
     [exec]     [javac] 	       ^^^^^^^^^^^^^^^^^^^^^^^^^^^^^
     [exec]     [javac] The import java.nio.channels.FileChannel is never used
     [exec]     [javac] ----------
     [exec]     [javac] ----------
     [exec]     [javac] 2. WARNING in /home/hybld/continuum-working-directory/6/classlib/modules/logging/src/test/java/org/apache/harmony/logging/tests/java/util/logging/LogManagerTest.java
     [exec]     [javac]  (at line 1107)

...

     [exec]     [javac] 	static class MockError extends Error{
     [exec]     [javac] 	             ^^^^^^^^^
     [exec]     [javac] The serializable class MockError does not declare a static final serialVersionUID field of type long
     [exec]     [javac] ----------
     [exec]     [javac] 2 problems (2 warnings)

     [exec] run-tests:

...

     [exec]     [junit] Tests run: 11, Failures: 0, Errors: 0, Time elapsed: 0.094 sec
     [exec]     [junit] Tests run: 5, Failures: 0, Errors: 0, Time elapsed: 0.021 sec
     [exec] Timeout: killed the sub-process
     [exec] Result: 143
     [echo] Tests.failed is set to true

check-class-load-lists:
     [exec] Checking for class load lists in classlists/app
     [exec] Placing reports in classlib/build/classload
     [exec] Comparing jre in classlib/deploy/jdk/jre

...

     [exec] Processing package java.lang.management,:=========================================================================+++++++++++++++
     [exec] Processing package java.lang.ref,:=========================================================================+++++
     [exec] Processing package java.lang.reflect,:=========================================================================+++++++++++++++++++++
     [exec] Processing class ,java:
     [exec] Failed to Japize java: java.lang.RuntimeException: NoClassDefFoundError: java
     [exec] java.lang.RuntimeException: NoClassDefFoundError: java
     [exec] 	at net.wuffies.japi.ClassFile.forName(ClassFile.java:1550)
     [exec] 	at net.wuffies.japi.Japize.getClassWrapper(Japize.java:1375)
     [exec] 	at net.wuffies.japi.Japize.japizeClass(Japize.java:715)
     [exec] 	at net.wuffies.japi.Japize.processClass(Japize.java:483)

...

     [exec] 	at net.wuffies.japi.Japize.doJapize(Japize.java:410)
     [exec] 	at net.wuffies.japi.Japize.main(Japize.java:310)

     [exec] Processing class ,javax:
     [exec] Failed to Japize javax: java.lang.RuntimeException: NoClassDefFoundError: javax
     [exec] java.lang.RuntimeException: NoClassDefFoundError: javax
     [exec] 	at net.wuffies.japi.ClassFile.forName(ClassFile.java:1550)
     [exec] 	at net.wuffies.japi.Japize.getClassWrapper(Japize.java:1375)
     [exec] 	at net.wuffies.japi.Japize.japizeClass(Japize.java:715)
     [exec] 	at net.wuffies.japi.Japize.processClass(Japize.java:483)

...

     [exec] 	at net.wuffies.japi.Japize.doJapize(Japize.java:410)
     [exec] 	at net.wuffies.japi.Japize.main(Japize.java:310)

     [exec] Processing class ,org:
     [exec] Failed to Japize org: java.lang.RuntimeException: NoClassDefFoundError: org
     [exec] java.lang.RuntimeException: NoClassDefFoundError: org
     [exec] 	at net.wuffies.japi.ClassFile.forName(ClassFile.java:1550)
     [exec] 	at net.wuffies.japi.Japize.getClassWrapper(Japize.java:1375)
     [exec] 	at net.wuffies.japi.Japize.japizeClass(Japize.java:715)
     [exec] 	at net.wuffies.japi.Japize.processClass(Japize.java:483)

...

    [mkdir] Created dir: /home/hybld/publish/20061109-1107
     [copy] Copying 3 files to /home/hybld/publish/20061109-1107
    [mkdir] Created dir: /home/hybld/publish/20061109-1107/test

BUILD FAILED
/home/hybld/continuum-working-directory/6/build.xml:310: /home/hybld/continuum-working-directory/6/classlib/build/test_report/html not found.

Total time: 130 minutes 44 seconds

****************************************************************************

...

Mime
View raw message