harmony-commits mailing list archives

Site index · List index
Message view « Date » · « Thread »
Top « Date » · « Thread »
From nom...@hursley.ibm.com
Subject [continuum] BUILD FAILURE: Classlib/linux.ia32 Build/Test
Date Wed, 08 Nov 2006 19:05:31 GMT
Online report : http://people.apache.org/~hindessm/continuum/classlib/linux.ia32/2006/11/08/20061108-190531.failure.log.gz
Build statistics:
  State: Failed
  Previous State: Error
  Started at: Wed, 8 Nov 2006 19:03:30 +0000
  Finished at: Wed, 8 Nov 2006 19:05:30 +0000
  Total time: 1m 59s
  Build Trigger: Schedule
  Exit code: 1
  Building machine hostname: hy2
  Operating system : Linux(unknown)
  Java version : 1.5.0_06(Sun Microsystems Inc.)

Changes
                            classlib/modules/auth/src/test/java/common/org/apache/harmony/auth/tests/javax/security/auth/login/LoginContextTest.java
            classlib/modules/auth/src/main/java/common/javax/security/auth/login/LoginContext.java
            classlib/modules/awt/src/main/java/windows/org/apache/harmony/awt/nativebridge/windows/Win32.java
            classlib/modules/awt/src/main/java/windows/org/apache/harmony/awt/wtk/windows/WinSystemProperties.java
            classlib/modules/awt/src/main/native/win32wrapper/windows/org_apache_harmony_awt_nativebridge_windows_Win32.cpp
            classlib/modules/awt/src/main/native/win32wrapper/windows/org_apache_harmony_awt_nativebridge_windows_Win32.h
            classlib/modules/security/src/main/java/common/org/apache/harmony/security/pkcs7/SignedData.java
            classlib/modules/security/src/main/java/common/org/apache/harmony/security/pkcs7/ContentInfo.java
            classlib/modules/luni/src/test/java/org/apache/harmony/luni/tests/util/NYITest.java
            classlib/modules/luni/src/main/java/org/apache/harmony/luni/internal/net/www/protocol/http/HttpURLConnection.java
            classlib/modules/luni/src/main/java/org/apache/harmony/luni/util/NotImplementedException.java
            classlib/modules/luni/src/main/native/launcher/shared/main.c

****************************************************************************
Output:
****************************************************************************
Buildfile: build.xml

build:
   [delete] Deleting directory /home/hybld/continuum-working-directory/6/classlib/deploy
     [echo] Classlib revision is 472591
     [echo] Post process: true
     [echo] JAPI: true
     [echo] Building with reference jdk/javac
     [exec] Buildfile: build.xml

     [exec] -init-hdk-for-clean:
     [exec]     [mkdir] Created dir: /home/hybld/continuum-working-directory/6/classlib/deploy/build/ant
     [exec]      [copy] Copying 1 file to /home/hybld/continuum-working-directory/6/classlib/deploy/build/ant

     [exec] clean-java:

     [exec] -modules-clean-bin:

     [exec] clean:
     [exec]    [delete] Deleting 30 files from /home/hybld/continuum-working-directory/6/classlib/build/classes
     [exec]    [delete] Deleting 15 files from /home/hybld/continuum-working-directory/6/classlib/modules/accessibility/bin/test

     [exec] clean:
     [exec]    [delete] Deleting 13 files from /home/hybld/continuum-working-directory/6/classlib/build/classes

     [exec] clean:
     [exec]    [delete] Deleting 35 files from /home/hybld/continuum-working-directory/6/classlib/build/classes
     [exec]    [delete] Deleting 1 files from /home/hybld/continuum-working-directory/6/classlib/modules/applet/bin/test

     [exec] clean:
     [exec]    [delete] Deleting 65 files from /home/hybld/continuum-working-directory/6/classlib/build/classes
     [exec]    [delete] Deleting 45 files from /home/hybld/continuum-working-directory/6/classlib/modules/archive/bin/test

     [exec] clean-native-includes:
     [exec]    [delete] /home/hybld/continuum-working-directory/6/classlib/deploy/include
not found.

     [exec] clean:
     [exec]    [delete] Deleting 110 files from /home/hybld/continuum-working-directory/6/classlib/build/classes
     [exec]    [delete] Deleting 224 files from /home/hybld/continuum-working-directory/6/classlib/modules/auth/bin/test

     [exec] clean:
     [exec]    [delete] Deleting 898 files from /home/hybld/continuum-working-directory/6/classlib/build/classes
     [exec]    [delete] Deleting 582 files from /home/hybld/continuum-working-directory/6/classlib/modules/awt/bin/test

     [exec] clean:
     [exec]    [delete] Deleting 107 files from /home/hybld/continuum-working-directory/6/classlib/build/classes
     [exec]    [delete] Deleting 234 files from /home/hybld/continuum-working-directory/6/classlib/modules/beans/bin/test

     [exec] clean:
     [exec]    [delete] Deleting 125 files from /home/hybld/continuum-working-directory/6/classlib/build/classes
     [exec]    [delete] /home/hybld/continuum-working-directory/6/classlib/modules/concurrent/bin/test
not found.

     [exec] clean:
     [exec]    [delete] Deleting 49 files from /home/hybld/continuum-working-directory/6/classlib/build/classes
     [exec]    [delete] Deleting 91 files from /home/hybld/continuum-working-directory/6/classlib/modules/crypto/bin/test

     [exec] clean:
     [exec]    [delete] Deleting 59 files from /home/hybld/continuum-working-directory/6/classlib/build/classes

     [exec] clean:
     [exec]    [delete] Deleting 9 files from /home/hybld/continuum-working-directory/6/classlib/build/classes
     [exec]    [delete] Deleting 20 files from /home/hybld/continuum-working-directory/6/classlib/modules/instrument/bin/test

     [exec] clean:
     [exec]    [delete] Deleting 154 files from /home/hybld/continuum-working-directory/6/classlib/build/classes
     [exec]    [delete] Deleting 163 files from /home/hybld/continuum-working-directory/6/classlib/modules/jndi/bin/test

     [exec] clean:
     [exec]    [delete] Deleting 15 files from /home/hybld/continuum-working-directory/6/classlib/build/classes
     [exec]    [delete] Deleting 2 files from /home/hybld/continuum-working-directory/6/classlib/modules/lang-management/bin/test

     [exec] clean:
     [exec]    [delete] Deleting 34 files from /home/hybld/continuum-working-directory/6/classlib/build/classes
     [exec]    [delete] Deleting 99 files from /home/hybld/continuum-working-directory/6/classlib/modules/logging/bin/test

     [exec] clean:
     [exec]    [delete] Deleting 961 files from /home/hybld/continuum-working-directory/6/classlib/build/classes
     [exec]    [delete] Deleting 872 files from /home/hybld/continuum-working-directory/6/classlib/modules/luni/bin/test

     [exec] clean-native-includes:
     [exec]    [delete] /home/hybld/continuum-working-directory/6/classlib/deploy/include
not found.
     [exec]    [delete] /home/hybld/continuum-working-directory/6/classlib/deploy/jdk/include
not found.

     [exec] clean:
     [exec]    [delete] Deleting 29 files from /home/hybld/continuum-working-directory/6/classlib/build/classes

     [exec] clean:
     [exec]    [delete] Deleting 14 files from /home/hybld/continuum-working-directory/6/classlib/build/classes
     [exec]    [delete] Deleting 25 files from /home/hybld/continuum-working-directory/6/classlib/modules/math/bin/test

     [exec] clean:
     [exec]    [delete] Deleting 14 files from /home/hybld/continuum-working-directory/6/classlib/build/classes

     [exec] clean:
     [exec]    [delete] Deleting 146 files from /home/hybld/continuum-working-directory/6/classlib/build/classes
     [exec]    [delete] Deleted 5 directories from /home/hybld/continuum-working-directory/6/classlib/build/classes
     [exec]    [delete] Deleting 156 files from /home/hybld/continuum-working-directory/6/classlib/modules/nio/bin/test
     [exec]    [delete] Deleted 19 directories from /home/hybld/continuum-working-directory/6/classlib/modules/nio/bin/test

     [exec] clean:
     [exec]    [delete] Deleting 20 files from /home/hybld/continuum-working-directory/6/classlib/build/classes
     [exec]    [delete] Deleting 77 files from /home/hybld/continuum-working-directory/6/classlib/modules/nio_char/bin/test

     [exec] clean:

     [exec] clean-native-includes:
     [exec]    [delete] /home/hybld/continuum-working-directory/6/classlib/deploy/include
not found.

     [exec] clean:
     [exec]    [delete] Deleting 32 files from /home/hybld/continuum-working-directory/6/classlib/build/classes
     [exec]    [delete] Deleting 34 files from /home/hybld/continuum-working-directory/6/classlib/modules/prefs/bin/test

     [exec] clean:
     [exec]    [delete] Deleting 205 files from /home/hybld/continuum-working-directory/6/classlib/build/classes
     [exec]    [delete] Deleting 60 files from /home/hybld/continuum-working-directory/6/classlib/modules/print/bin/test

     [exec] clean:
     [exec]    [delete] Deleting 156 files from /home/hybld/continuum-working-directory/6/classlib/build/classes
     [exec]    [delete] Deleting 12 files from /home/hybld/continuum-working-directory/6/classlib/modules/regex/bin/test

     [exec] clean:
     [exec]    [delete] Deleting 230 files from /home/hybld/continuum-working-directory/6/classlib/build/classes
     [exec]    [delete] Deleting 47 files from /home/hybld/continuum-working-directory/6/classlib/modules/rmi/bin/test

     [exec] clean:
     [exec]    [delete] Deleting 410 files from /home/hybld/continuum-working-directory/6/classlib/build/classes
     [exec]    [delete] Deleting 601 files from /home/hybld/continuum-working-directory/6/classlib/modules/security/bin/test

     [exec] clean:
     [exec]    [delete] Deleting 2 files from /home/hybld/continuum-working-directory/6/classlib/build/classes

     [exec] clean:
     [exec]    [delete] Deleting 72 files from /home/hybld/continuum-working-directory/6/classlib/build/classes
     [exec]    [delete] Deleting 34 files from /home/hybld/continuum-working-directory/6/classlib/modules/sound/bin/test

     [exec] clean:
     [exec]    [delete] Deleting 69 files from /home/hybld/continuum-working-directory/6/classlib/build/classes
     [exec]    [delete] Deleting 42 files from /home/hybld/continuum-working-directory/6/classlib/modules/sql/bin/test

     [exec] clean:
     [exec]    [delete] Deleting 5 files from /home/hybld/continuum-working-directory/6/classlib/build/classes

     [exec] clean:
     [exec]    [delete] Deleting 1591 files from /home/hybld/continuum-working-directory/6/classlib/build/classes
     [exec]    [delete] Deleting 1494 files from /home/hybld/continuum-working-directory/6/classlib/modules/swing/bin/test

     [exec] clean:

...

     [exec] -clean-bin-catch-all:
     [exec]    [delete] Deleting 1 files from /home/hybld/continuum-working-directory/6/classlib/build/classes
     [exec]    [delete] Deleted 299 directories from /home/hybld/continuum-working-directory/6/classlib/build/classes

     [exec] BUILD FAILED
     [exec] /home/hybld/continuum-working-directory/6/classlib/build.xml:123: The following
error occurred while executing this line:
     [exec] /home/hybld/continuum-working-directory/6/classlib/make/build-java.xml:96: ...

     [exec] Built files still exist after module clean targets have run.  This
     [exec] probably means that one or more patternsets are incomplete.  The
     [exec] remaining files are:

...

     [exec] /home/hybld/continuum-working-directory/6/classlib/build/classes/org/apache/harmony/luni/util/NotYetImplementedException.class

     [exec] Total time: 1 minute 53 seconds

BUILD FAILED
/home/hybld/continuum-working-directory/6/build.xml:114: exec returned: 1

Total time: 1 minute 58 seconds

****************************************************************************

...

Mime
View raw message