harmony-commits mailing list archives

Site index · List index
Message view « Date » · « Thread »
Top « Date » · « Thread »
From nom...@hursley.ibm.com
Subject [continuum] BUILD FAILURE: Classlib/linux.ia32 Build/Test
Date Fri, 03 Nov 2006 06:08:40 GMT
Online report : http://people.apache.org/~hindessm/continuum/classlib/linux.ia32/2006/11/03/20061103-060840.failure.log.gz
Build statistics:
  State: Failed
  Previous State: Failed
  Started at: Fri, 3 Nov 2006 06:06:42 +0000
  Finished at: Fri, 3 Nov 2006 06:08:38 +0000
  Total time: 1m 56s
  Build Trigger: Schedule
  Exit code: 1
  Building machine hostname: hy2
  Operating system : Linux(unknown)
  Java version : 1.5.0_06(Sun Microsystems Inc.)

Changes
                            classlib/modules/beans/src/test/resources/serialization/java/beans/beancontext/BeanContextServiceRevokedEvent.ser
            classlib/modules/sql/src/test/java/org/apache/harmony/sql/tests/java/sql/ConnectionTest.java
            classlib/modules/sql/src/test/java/org/apache/harmony/sql/tests/java/sql/BatchUpdateExceptionTest.java
            classlib/modules/sql/src/test/java/org/apache/harmony/sql/tests/java/sql/StatementTest.java
            classlib/modules/sql/src/test/java/org/apache/harmony/sql/tests/java/sql/TypesTest.java
            classlib/modules/sql/src/test/java/org/apache/harmony/sql/tests/java/sql/DateTest.java
            classlib/modules/sql/src/test/java/org/apache/harmony/sql/tests/java/sql/TestHelper_Driver4.java
            classlib/modules/sql/src/test/java/org/apache/harmony/sql/tests/java/sql/ParameterMetaDataTest.java
            classlib/modules/sql/src/test/java/org/apache/harmony/sql/tests/java/sql/TestHelper_DriverManager.java
            classlib/modules/sql/src/test/java/org/apache/harmony/sql/tests/java/sql/SQLWarningTest.java
            classlib/modules/sql/src/test/java/org/apache/harmony/sql/tests/java/sql/TimeTest.java
            classlib/modules/sql/src/test/java/org/apache/harmony/sql/tests/java/sql/TimestampTest.java
            classlib/modules/sql/src/test/java/org/apache/harmony/sql/tests/java/sql/DatabaseMetaDataTest.java
            classlib/modules/sql/src/test/java/org/apache/harmony/sql/tests/java/sql/TestHelper_Driver1.java
            classlib/modules/sql/src/test/java/org/apache/harmony/sql/tests/java/sql/SQLExceptionTest.java
            classlib/modules/sql/src/test/java/org/apache/harmony/sql/tests/java/sql/DataTruncationTest.java
            classlib/modules/sql/src/test/java/org/apache/harmony/sql/tests/java/sql/DriverManagerTest.java
            classlib/modules/sql/src/test/java/org/apache/harmony/sql/tests/java/sql/ResultSetTest.java
            classlib/modules/sql/src/test/java/org/apache/harmony/sql/tests/java/sql/TestHelper_ClassLoader.java
            classlib/modules/sql/src/test/java/org/apache/harmony/sql/tests/java/sql/ResultSetMetaDataTest.java
            classlib/modules/sql/src/test/java/org/apache/harmony/sql/tests/javax/sql/ConnectionEventTest.java
            classlib/modules/sql/src/test/java/org/apache/harmony/sql/tests/javax/sql/RowSetEventTest.java
            classlib/modules/sql/src/test/java/org/apache/harmony/sql/tests/javax/transaction/TransactionRequiredExceptionTest.java
            classlib/modules/sql/src/test/java/org/apache/harmony/sql/tests/javax/transaction/TransactionRolledbackExceptionTest.java
            classlib/modules/sql/src/test/java/org/apache/harmony/sql/tests/javax/transaction/xa/XAResourceTest.java
            classlib/modules/sql/src/test/java/org/apache/harmony/sql/tests/javax/transaction/xa/XidTest.java
            classlib/modules/sql/src/test/java/org/apache/harmony/sql/tests/javax/transaction/xa/XAExceptionTest.java
            classlib/modules/sql/src/test/java/org/apache/harmony/sql/tests/javax/transaction/InvalidTransactionExceptionTest.java
            classlib/modules/sql/src/main/java/java/sql/Timestamp.java
            classlib/modules/sql/src/main/java/java/sql/Date.java
            classlib/modules/sql/src/main/java/java/sql/CallableStatement.java
            classlib/modules/sql/src/main/java/java/sql/DriverManager.java
            classlib/modules/sql/src/main/java/java/sql/PreparedStatement.java
            classlib/modules/sql/src/main/java/java/sql/ResultSet.java
            classlib/modules/sql/src/main/java/java/sql/Time.java
            classlib/modules/luni/src/test/java/tests/api/java/io/PrintStreamTest.java

****************************************************************************
Output:
****************************************************************************
Buildfile: build.xml

build:
   [delete] Deleting directory /home/hybld/continuum-working-directory/6/classlib/deploy
     [echo] Classlib revision is 470679
     [echo] Post process: true
     [echo] JAPI: true
     [echo] Building with reference jdk/javac
     [exec] Buildfile: build.xml

     [exec] -init-hdk-for-clean:
     [exec]     [mkdir] Created dir: /home/hybld/continuum-working-directory/6/classlib/deploy/build/ant
     [exec]      [copy] Copying 1 file to /home/hybld/continuum-working-directory/6/classlib/deploy/build/ant

     [exec] clean-java:

     [exec] -modules-clean-bin:

     [exec] clean:
     [exec]    [delete] Deleting 30 files from /home/hybld/continuum-working-directory/6/classlib/build/classes
     [exec]    [delete] Deleting 15 files from /home/hybld/continuum-working-directory/6/classlib/modules/accessibility/bin/test

     [exec] clean:
     [exec]    [delete] Deleting 13 files from /home/hybld/continuum-working-directory/6/classlib/build/classes

     [exec] clean:
     [exec]    [delete] Deleting 35 files from /home/hybld/continuum-working-directory/6/classlib/build/classes
     [exec]    [delete] Deleting 1 files from /home/hybld/continuum-working-directory/6/classlib/modules/applet/bin/test

     [exec] clean:
     [exec]    [delete] Deleting 65 files from /home/hybld/continuum-working-directory/6/classlib/build/classes
     [exec]    [delete] Deleting 45 files from /home/hybld/continuum-working-directory/6/classlib/modules/archive/bin/test

     [exec] clean-native-includes:
     [exec]    [delete] /home/hybld/continuum-working-directory/6/classlib/deploy/include
not found.

     [exec] clean:
     [exec]    [delete] Deleting 109 files from /home/hybld/continuum-working-directory/6/classlib/build/classes
     [exec]    [delete] Deleting 224 files from /home/hybld/continuum-working-directory/6/classlib/modules/auth/bin/test

     [exec] clean:
     [exec]    [delete] Deleting 898 files from /home/hybld/continuum-working-directory/6/classlib/build/classes
     [exec]    [delete] Deleting 580 files from /home/hybld/continuum-working-directory/6/classlib/modules/awt/bin/test

     [exec] clean:
     [exec]    [delete] Deleting 107 files from /home/hybld/continuum-working-directory/6/classlib/build/classes
     [exec]    [delete] Deleting 234 files from /home/hybld/continuum-working-directory/6/classlib/modules/beans/bin/test

     [exec] clean:
     [exec]    [delete] Deleting 125 files from /home/hybld/continuum-working-directory/6/classlib/build/classes
     [exec]    [delete] /home/hybld/continuum-working-directory/6/classlib/modules/concurrent/bin/test
not found.

     [exec] clean:
     [exec]    [delete] Deleting 49 files from /home/hybld/continuum-working-directory/6/classlib/build/classes
     [exec]    [delete] Deleting 91 files from /home/hybld/continuum-working-directory/6/classlib/modules/crypto/bin/test

     [exec] clean:
     [exec]    [delete] Deleting 59 files from /home/hybld/continuum-working-directory/6/classlib/build/classes

     [exec] clean:
     [exec]    [delete] Deleting 9 files from /home/hybld/continuum-working-directory/6/classlib/build/classes
     [exec]    [delete] Deleting 20 files from /home/hybld/continuum-working-directory/6/classlib/modules/instrument/bin/test

     [exec] clean:
     [exec]    [delete] Deleting 154 files from /home/hybld/continuum-working-directory/6/classlib/build/classes
     [exec]    [delete] Deleting 163 files from /home/hybld/continuum-working-directory/6/classlib/modules/jndi/bin/test

     [exec] clean:
     [exec]    [delete] Deleting 15 files from /home/hybld/continuum-working-directory/6/classlib/build/classes
     [exec]    [delete] Deleting 2 files from /home/hybld/continuum-working-directory/6/classlib/modules/lang-management/bin/test

     [exec] clean:
     [exec]    [delete] Deleting 34 files from /home/hybld/continuum-working-directory/6/classlib/build/classes
     [exec]    [delete] Deleting 99 files from /home/hybld/continuum-working-directory/6/classlib/modules/logging/bin/test

     [exec] clean:
     [exec]    [delete] Deleting 962 files from /home/hybld/continuum-working-directory/6/classlib/build/classes
     [exec]    [delete] Deleting 866 files from /home/hybld/continuum-working-directory/6/classlib/modules/luni/bin/test

     [exec] clean-native-includes:
     [exec]    [delete] /home/hybld/continuum-working-directory/6/classlib/deploy/include
not found.
     [exec]    [delete] /home/hybld/continuum-working-directory/6/classlib/deploy/jdk/include
not found.

     [exec] clean:
     [exec]    [delete] Deleting 29 files from /home/hybld/continuum-working-directory/6/classlib/build/classes

     [exec] clean:
     [exec]    [delete] Deleting 14 files from /home/hybld/continuum-working-directory/6/classlib/build/classes
     [exec]    [delete] Deleting 25 files from /home/hybld/continuum-working-directory/6/classlib/modules/math/bin/test

     [exec] clean:
     [exec]    [delete] Deleting 14 files from /home/hybld/continuum-working-directory/6/classlib/build/classes

     [exec] clean:
     [exec]    [delete] Deleting 144 files from /home/hybld/continuum-working-directory/6/classlib/build/classes
     [exec]    [delete] Deleted 5 directories from /home/hybld/continuum-working-directory/6/classlib/build/classes
     [exec]    [delete] Deleting 156 files from /home/hybld/continuum-working-directory/6/classlib/modules/nio/bin/test
     [exec]    [delete] Deleted 19 directories from /home/hybld/continuum-working-directory/6/classlib/modules/nio/bin/test

     [exec] clean:
     [exec]    [delete] Deleting 20 files from /home/hybld/continuum-working-directory/6/classlib/build/classes
     [exec]    [delete] Deleting 77 files from /home/hybld/continuum-working-directory/6/classlib/modules/nio_char/bin/test

     [exec] clean:

     [exec] clean-native-includes:
     [exec]    [delete] /home/hybld/continuum-working-directory/6/classlib/deploy/include
not found.

...

     [exec] -clean-bin-catch-all:
     [exec]    [delete] Deleting 1 files from /home/hybld/continuum-working-directory/6/classlib/build/classes
     [exec]    [delete] Deleted 298 directories from /home/hybld/continuum-working-directory/6/classlib/build/classes

     [exec] BUILD FAILED
     [exec] /home/hybld/continuum-working-directory/6/classlib/build.xml:123: The following
error occurred while executing this line:
     [exec] /home/hybld/continuum-working-directory/6/classlib/make/build-java.xml:96: ...

     [exec] Built files still exist after module clean targets have run.  This
     [exec] probably means that one or more patternsets are incomplete.  The
     [exec] remaining files are:

...

     [exec] /home/hybld/continuum-working-directory/6/classlib/build/classes/org/apache/harmony/sql/internal/common/ClassUtils.class

     [exec] Total time: 1 minute 51 seconds

BUILD FAILED
/home/hybld/continuum-working-directory/6/build.xml:114: exec returned: 1

Total time: 1 minute 55 seconds

****************************************************************************

...

Mime
View raw message