harmony-commits mailing list archives

Site index · List index
Message view « Date » · « Thread »
Top « Date » · « Thread »
From "Elena Semukhina (JIRA)" <j...@apache.org>
Subject [jira] Commented: (HARMONY-1752) Classlib luni test tests.api.java.net.InetAddressTest crashes test run
Date Fri, 13 Oct 2006 05:50:38 GMT
    [ http://issues.apache.org/jira/browse/HARMONY-1752?page=comments#action_12441920 ] 
            
Elena Semukhina commented on HARMONY-1752:
------------------------------------------

I'm still able to reproduce the failure. I run tests on both Widows 2003 server and remote
Windows XP. I tried them with the latest drlvm r463560 and with H-1816, 1823 applied. Below
is the output; from the bottom lines it follows that crash happened on tests.api.java.util.ArraysTest:

....
    [junit] Tests run: 34, Failures: 0, Errors: 0, Time elapsed: 19.578 sec
    [junit] Tests run: 12, Failures: 0, Errors: 0, Time elapsed: 0.016 sec
    [junit] Tests run: 20, Failures: 0, Errors: 0, Time elapsed: 15.047 sec
    [junit] Tests run: 16, Failures: 3, Errors: 0, Time elapsed: 4.094 sec
    [junit] TEST tests.api.java.net.InetAddressTest FAILED
    [junit] Tests run: 7, Failures: 0, Errors: 0, Time elapsed: 0.016 sec
    [junit] Tests run: 2, Failures: 0, Errors: 0, Time elapsed: 0 sec
    [junit] Tests run: 2, Failures: 0, Errors: 0, Time elapsed: 0.015 sec
    [junit] Tests run: 9, Failures: 0, Errors: 0, Time elapsed: 0.203 sec
    [junit] Tests run: 2, Failures: 0, Errors: 0, Time elapsed: 0 sec
    [junit] Tests run: 3, Failures: 0, Errors: 0, Time elapsed: 0.016 sec
    [junit] Tests run: 2, Failures: 0, Errors: 0, Time elapsed: 0 sec
    [junit] Tests run: 18, Failures: 0, Errors: 0, Time elapsed: 0.015 sec
    [junit] Tests run: 12, Failures: 0, Errors: 0, Time elapsed: 0 sec
    [junit] Tests run: 4, Failures: 0, Errors: 0, Time elapsed: 0.016 sec
    [junit] Tests run: 25, Failures: 0, Errors: 0, Time elapsed: 13.656 sec
    [junit] Tests run: 2, Failures: 0, Errors: 0, Time elapsed: 0.016 sec
    [junit] Tests run: 6, Failures: 0, Errors: 0, Time elapsed: 0 sec
    [junit] Tests run: 43, Failures: 0, Errors: 0, Time elapsed: 0.156 sec
    [junit] Tests run: 3, Failures: 0, Errors: 0, Time elapsed: 0 sec
    [junit] Tests run: 1, Failures: 0, Errors: 0, Time elapsed: 0.016 sec
    [junit] Tests run: 2, Failures: 0, Errors: 0, Time elapsed: 3.547 sec
    [junit] Tests run: 2, Failures: 0, Errors: 0, Time elapsed: 0.016 sec
    [junit] Tests run: 6, Failures: 0, Errors: 0, Time elapsed: 0.015 sec
    [junit] Tests run: 4, Failures: 0, Errors: 0, Time elapsed: 0.015 sec
    [junit] Tests run: 15, Failures: 0, Errors: 0, Time elapsed: 0.015 sec
    [junit] Tests run: 23, Failures: 0, Errors: 0, Time elapsed: 0.047 sec

    [junit] An unhandled error (4) has occurred.
    [junit] HyGeneric_Signal_Number=00000004
    [junit] ExceptionCode=c0000005
    [junit] ExceptionAddress=08EE3820
    [junit] ContextFlags=0001003f
    [junit] Handler1=00401010
    [junit] Handler2=11105CE0
    [junit] InaccessibleAddress=00000008
    [junit] EDI=0013E7E8
    [junit] ESI=00000000
    [junit] EAX=08EF17B0
    [junit] EBX=00000000
    [junit] ECX=08B552CC
    [junit] EDX=00000002
    [junit] EIP=08EE3820
    [junit] ESP=0013E500
    [junit] EBP=0013E5F4
    [junit] Module=
    [junit] Module_base_address=08E20000
    [junit] Offset_in_DLL=000c3820

    [junit] This application has requested the Runtime to terminate it in an unu
sual way.
    [junit] Please contact the application's support team for more information.
    [junit] SEH handler: shutdown errorSEH handler: too many shutdown errorsSEH
handler: too many shutdown errorsSEH handler: too many shutdown errorsSEH handle
r: too many shutdown errorsSEH handler: too many shutdown errorsSEH handler: too
 many shutdown errorsSEH handler: too many shutdown errorsSEH handler: too many
shutdown errorsSEH handler: too many shutdown errorsSEH handler: too many shutdo
wn errorsSEH handler: too many shutdown errorsSEH handler: too many shutdown err
orsSEH handler: too many shutdown errorsSEH handler: too many shutdown errorsSEH
 handler: too many shutdown errorsSEH handler: too many shutdown errorsSEH handl
er: too many shutdown errorsSEH handler: too many shutdown errorsSEH handler: to
o many shutdown errorsSEH handler: too many shutdown errorsSEH handler: too many
 shutdown errorsSEH handler: too many shutdown errorsSEH handler: too many shutd
own errorsSEH handler: too many shutdown errorsSEH handler: too many shutdown er
rorsSEH handler: too many shutdown errorsSEH handler: too many shutdown errorsSE
H handler: too many shutdown errorsSEH handler: too many shutdown errorsSEH hand
ler: too many shutdown errorsSEH handler: too many shutdown errorsSEH handler: t
oo many shutdown errorsSEH handler: too many shutdown errorsSEH handler: too man
y shutdown errorsSEH handler: too many shutdown errorsSEH handler: too many shut
down errorsSEH handler: too many shutdown errorsSEH handler: too many shutdown e
rrorsSEH handler: too many shutdown errorsSEH handler: too many shutdown errorsS
EH handler: too many shutdown errors
    [junit] Tests FAILED

touch-failures-file:

touch-errors-file:

test:

gen-report:
[junitreport] [Fatal Error] :-1:-1: Premature end of file.
[junitreport] The file C:\users\esemukhi\svn\classlib\trunk\build\test_report\TE
ST-tests.api.java.util.ArraysTest.xml is not a valid XML document. It is possibl
y corrupted.
[junitreport] Transform time: 6078ms
     [echo] The test report is in C:\users\esemukhi\svn\classlib\trunk\build\tes
t_report\html\index.html

check-test-result:

BUILD FAILED

> Classlib luni test tests.api.java.net.InetAddressTest crashes test run
> ----------------------------------------------------------------------
>
>                 Key: HARMONY-1752
>                 URL: http://issues.apache.org/jira/browse/HARMONY-1752
>             Project: Harmony
>          Issue Type: Bug
>          Components: DRLVM
>         Environment: Windows 2003, Windows XP
>            Reporter: Elena Semukhina
>         Assigned To: Paulex Yang
>            Priority: Critical
>
> Two test cases from this test, test_isReachableI() and test_isReachableLjava_net_NetworkInterfaceII()
influence in an obscure way the subsequent test packages run. If these tests are commented
out, luni module succeeds, otherwise tests.api.java.util.ArraysTest  which runs later crashes.
> I cannot give some more details, just observe a cause-effect relation.

-- 
This message is automatically generated by JIRA.
-
If you think it was sent incorrectly contact one of the administrators: http://issues.apache.org/jira/secure/Administrators.jspa
-
For more information on JIRA, see: http://www.atlassian.com/software/jira

        

Mime
View raw message