harmony-commits mailing list archives

Site index · List index
Message view « Date » · « Thread »
Top « Date » · « Thread »
From nom...@hursley.ibm.com
Subject [continuum] BUILD FAILURE: Classlib/linux.ia32 Build/Test
Date Tue, 17 Oct 2006 03:01:54 GMT
Online report : http://people.apache.org/~hindessm/continuum/classlib/linux.ia32/2006/10/17/20061017-030154.failure.log.gz
Build statistics:
  State: Failed
  Previous State: Failed
  Started at: Tue, 17 Oct 2006 04:01:36 +0100
  Finished at: Tue, 17 Oct 2006 04:01:53 +0100
  Total time: 16s
  Build Trigger: Schedule
  Exit code: 1
  Building machine hostname: hy2
  Operating system : Linux(unknown)
  Java version : 1.5.0_06(Sun Microsystems Inc.)

Changes
                            classlib/support/src/test/java/tests/support/Support_PermissionCollection.java
            classlib/support/src/test/java/tests/support/Support_DecimalFormat.java
            classlib/support/src/test/java/tests/support/resource/Support_Resources.java
            classlib/support/src/test/java/tests/support/Support_ProviderJCE.java
            classlib/support/src/test/java/tests/support/Support_URLConnector.java
            classlib/support/src/test/java/tests/support/Support_PortManager.java
            classlib/support/src/test/java/tests/support/Support_HttpServerSocket.java
            classlib/support/src/test/java/tests/support/Support_Exec.java
            classlib/support/src/test/java/tests/support/Support_TestResource.java
            classlib/support/src/test/java/tests/support/Support_Format.java
            classlib/support/src/test/java/tests/support/Support_StringReader.java
            classlib/support/src/test/java/tests/support/Support_TimeZone.java
            classlib/support/src/test/java/tests/support/Support_CollectionTest.java
            classlib/support/src/test/java/tests/support/Support_ProviderTrust.java
            classlib/support/src/test/java/tests/support/Support_AvailTest.java
            classlib/support/src/test/java/tests/support/Support_UnmodifiableMapTest.java
            classlib/support/src/test/java/tests/support/Support_MessageFormat.java
            classlib/support/src/test/java/tests/support/Support_MapTest2.java
            classlib/support/src/test/java/tests/support/Support_ProviderRSA.java
            classlib/support/src/test/java/tests/support/Support_HttpTests.java
            classlib/support/src/test/java/tests/support/Support_StringWriter.java
            classlib/support/src/test/java/tests/support/Support_DummyPKCS12Keystore.java
            classlib/support/src/test/java/tests/support/Support_TestResource_fr_FR.java
            classlib/support/src/test/java/tests/support/Support_HttpServer.java
            classlib/support/src/test/java/tests/support/Support_Configuration.java
            classlib/support/src/test/java/tests/support/Support_Proxy_SubException.java
            classlib/support/src/test/java/tests/support/Support_Proxy_ParentException.java
            classlib/support/src/test/java/tests/support/Support_TestResource_en.java
            classlib/support/src/test/java/tests/support/Support_UnmodifiableCollectionTest.java
            classlib/support/src/test/java/tests/support/Support_ListTest.java
            classlib/support/src/test/java/tests/support/Support_TestResource_fr_FR_VAR.java
            classlib/support/src/test/java/tests/support/Support_TestResource_fr.java
            classlib/support/src/test/java/tests/support/Support_TestResource_en_US.java
            classlib/support/src/test/java/tests/support/Support_HttpSocket.java
            classlib/support/src/test/java/tests/support/Support_BitSet.java
            classlib/support/src/test/java/tests/support/Support_GetLocal.java
            classlib/support/src/test/java/tests/support/Support_TestProvider.java
            classlib/support/src/test/java/tests/support/Support_SetTest.java
            classlib/support/src/test/java/tests/support/Support_SimpleDateFormat.java
            classlib/support/src/test/java/tests/util/CallVerificationStack.java
            classlib/support/src/test/java/tests/util/SerializationTester.java
            classlib/support/src/test/java/tests/util/SomeTests.java
            classlib/support/src/test/java/org/apache/harmony/testframework/serialization/SerializationTest.java
            classlib/support/src/test/java/javax/swing/SwingTestCase.java
            classlib/support/src/test/java/javax/swing/BasicSwingTestCase.java
        
****************************************************************************
Output:
****************************************************************************
Buildfile: build.xml

build:
   [delete] Deleting directory /home/hybld/continuum-working-directory/6/classlib/deploy
     [echo] Classlib revision is 464779
     [echo] Post process: true
     [echo] JAPI: true
     [echo] Building with reference jdk/javac
     [exec] Buildfile: build.xml

     [exec] clean-java:

     [exec] -copy-kernel-patternsets:
     [exec]     [mkdir] Created dir: /home/hybld/continuum-working-directory/6/classlib/deploy/build/patternsets
     [exec]      [copy] Copying 1 file to /home/hybld/continuum-working-directory/6/classlib/deploy/build/patternsets
     [exec]      [copy] Copying 1 file to /home/hybld/continuum-working-directory/6/classlib/deploy/build/patternsets

     [exec] -modules-clean-bin:

     [exec] clean:
     [exec]    [delete] /home/hybld/continuum-working-directory/6/classlib/build/classes not
found.

     [exec] clean:
     [exec]    [delete] /home/hybld/continuum-working-directory/6/classlib/build/classes not
found.

     [exec] clean:
     [exec]    [delete] /home/hybld/continuum-working-directory/6/classlib/build/classes not
found.

     [exec] clean:
     [exec]    [delete] /home/hybld/continuum-working-directory/6/classlib/build/classes not
found.

     [exec] clean-native-includes:
     [exec]    [delete] /home/hybld/continuum-working-directory/6/classlib/deploy/include
not found.

     [exec] clean:
     [exec]    [delete] /home/hybld/continuum-working-directory/6/classlib/build/classes not
found.

     [exec] clean:
     [exec]    [delete] /home/hybld/continuum-working-directory/6/classlib/build/classes not
found.

     [exec] clean:
     [exec]    [delete] /home/hybld/continuum-working-directory/6/classlib/build/classes not
found.

     [exec] clean:
     [exec]    [delete] /home/hybld/continuum-working-directory/6/classlib/build/classes not
found.
     [exec]    [delete] /home/hybld/continuum-working-directory/6/classlib/modules/concurrent/bin/test
not found.

     [exec] clean:
     [exec]    [delete] /home/hybld/continuum-working-directory/6/classlib/build/classes not
found.

     [exec] clean:
     [exec]    [delete] /home/hybld/continuum-working-directory/6/classlib/build/classes not
found.

     [exec] clean:
     [exec]    [delete] /home/hybld/continuum-working-directory/6/classlib/build/classes not
found.

     [exec] clean:
     [exec]    [delete] /home/hybld/continuum-working-directory/6/classlib/build/classes not
found.

     [exec] clean:
     [exec]    [delete] /home/hybld/continuum-working-directory/6/classlib/build/classes not
found.

     [exec] clean:
     [exec]    [delete] /home/hybld/continuum-working-directory/6/classlib/build/classes not
found.

     [exec] clean:
     [exec]    [delete] /home/hybld/continuum-working-directory/6/classlib/build/classes not
found.

     [exec] clean-native-includes:
     [exec]    [delete] /home/hybld/continuum-working-directory/6/classlib/deploy/include
not found.
     [exec]    [delete] /home/hybld/continuum-working-directory/6/classlib/deploy/jdk/include
not found.

     [exec] clean:
     [exec]    [delete] /home/hybld/continuum-working-directory/6/classlib/build/classes not
found.

     [exec] clean:
     [exec]    [delete] /home/hybld/continuum-working-directory/6/classlib/build/classes not
found.

     [exec] clean:
     [exec]    [delete] /home/hybld/continuum-working-directory/6/classlib/build/classes not
found.

     [exec] clean:
     [exec]    [delete] /home/hybld/continuum-working-directory/6/classlib/build/classes not
found.
     [exec]    [delete] /home/hybld/continuum-working-directory/6/classlib/modules/nio/bin/test
not found.

     [exec] clean:
     [exec]    [delete] /home/hybld/continuum-working-directory/6/classlib/build/classes not
found.

     [exec] clean:
     [exec]    [delete] /home/hybld/continuum-working-directory/6/classlib/build/classes not
found.

     [exec] clean:
     [exec]    [delete] /home/hybld/continuum-working-directory/6/classlib/build/classes not
found.

     [exec] clean:
     [exec]    [delete] /home/hybld/continuum-working-directory/6/classlib/build/classes not
found.

     [exec] clean:
     [exec]    [delete] /home/hybld/continuum-working-directory/6/classlib/build/classes not
found.

     [exec] clean:
     [exec]    [delete] /home/hybld/continuum-working-directory/6/classlib/build/classes not
found.

     [exec] clean:
     [exec]    [delete] /home/hybld/continuum-working-directory/6/classlib/build/classes not
found.

     [exec] clean:
     [exec]    [delete] /home/hybld/continuum-working-directory/6/classlib/build/classes not
found.

     [exec] clean:
     [exec]    [delete] /home/hybld/continuum-working-directory/6/classlib/build/classes not
found.

     [exec] clean:
     [exec]    [delete] /home/hybld/continuum-working-directory/6/classlib/build/classes not
found.

     [exec] clean:
     [exec]    [delete] /home/hybld/continuum-working-directory/6/classlib/build/classes not
found.

     [exec] clean:
     [exec]    [delete] /home/hybld/continuum-working-directory/6/classlib/build/classes not
found.

     [exec] clean:
     [exec]    [delete] /home/hybld/continuum-working-directory/6/classlib/build/classes not
found.

     [exec] clean:
     [exec]    [delete] /home/hybld/continuum-working-directory/6/classlib/build/classes not
found.

     [exec] -clean-kernel-patternsets:
     [exec]    [delete] Deleting directory /home/hybld/continuum-working-directory/6/classlib/deploy/build/patternsets

     [exec] -clean-bin-catch-all-test:

     [exec] -clean-bin-catch-all:

     [exec] -clean-bin:

     [exec] -clean-layout:
     [exec]    [delete] /home/hybld/continuum-working-directory/6/classlib/deploy/jdk not
found.

     [exec] clean:

     [exec] clean-native:

     [exec] copy-makefile-includes:
     [exec]     [mkdir] Created dir: /home/hybld/continuum-working-directory/6/classlib/deploy/build/make

...

     [exec] check:

     [exec] -compile:

     [exec] BUILD FAILED
     [exec] /home/hybld/continuum-working-directory/6/classlib/build.xml:108: The following
error occurred while executing this line:
     [exec] /home/hybld/continuum-working-directory/6/classlib/make/build-java.xml:128: The
Eclipse compiler class for Ant could not be found. Please place the ECJ JAR in ANT_HOME/lib.
The JAR can copied from CLASSLIB_TRUNK/depends/jars/ecj_3.2 folder after the fetch-depends
target has been run.

     [exec] Total time: 11 seconds

BUILD FAILED
/home/hybld/continuum-working-directory/6/build.xml:118: exec returned: 1

Total time: 14 seconds

****************************************************************************

...

Mime
View raw message