harmony-commits mailing list archives

Site index · List index
Message view « Date » · « Thread »
Top « Date » · « Thread »
From nom...@hursley.ibm.com
Subject [continuum] BUILD FAILURE: Classlib/linux.ia32 Build/Test
Date Tue, 17 Oct 2006 02:01:54 GMT
Online report : http://people.apache.org/~hindessm/continuum/classlib/linux.ia32/2006/10/17/20061017-020154.failure.log.gz
Build statistics:
  State: Failed
  Previous State: Failed
  Started at: Tue, 17 Oct 2006 03:01:37 +0100
  Finished at: Tue, 17 Oct 2006 03:01:53 +0100
  Total time: 16s
  Build Trigger: Schedule
  Exit code: 1
  Building machine hostname: hy2
  Operating system : Linux(unknown)
  Java version : 1.5.0_06(Sun Microsystems Inc.)

Changes
                            classlib/modules/auth/src/test/java/common/org/apache/harmony/auth/tests/module/Krb5LoginModuleTest.java
            classlib/modules/auth/src/test/java/common/org/apache/harmony/auth/tests/javax/security/auth/login/LoginContext2Test.java
            classlib/modules/auth/src/test/java/common/org/apache/harmony/auth/tests/javax/security/auth/login/ConfigurationTest.java
            classlib/modules/auth/src/test/java/common/org/apache/harmony/auth/tests/javax/security/auth/login/AppConfigurationEntryTest.java
            classlib/modules/auth/src/test/java/common/org/apache/harmony/auth/tests/javax/security/auth/login/LoginContextTest.java
            classlib/modules/auth/src/test/java/common/org/apache/harmony/auth/tests/javax/security/auth/login/serialization/CredentialNotFoundExceptionTest.java
            classlib/modules/auth/src/test/java/common/org/apache/harmony/auth/tests/javax/security/auth/login/serialization/LoginExceptionTest.java
            classlib/modules/auth/src/test/java/common/org/apache/harmony/auth/tests/javax/security/auth/login/serialization/AccountNotFoundExceptionTest.java
            classlib/modules/auth/src/test/java/common/org/apache/harmony/auth/tests/javax/security/auth/login/serialization/CredentialExceptionTest.java
            classlib/modules/auth/src/test/java/common/org/apache/harmony/auth/tests/javax/security/auth/login/serialization/CredentialExpiredExceptionTest.java
            classlib/modules/auth/src/test/java/common/org/apache/harmony/auth/tests/javax/security/auth/login/serialization/AccountExceptionTest.java
            classlib/modules/auth/src/test/java/common/org/apache/harmony/auth/tests/javax/security/auth/login/serialization/AccountExpiredExceptionTest.java
            classlib/modules/auth/src/test/java/common/org/apache/harmony/auth/tests/javax/security/auth/login/serialization/FailedLoginExceptionTest.java
            classlib/modules/auth/src/test/java/common/org/apache/harmony/auth/tests/javax/security/auth/login/serialization/AccountLockedExceptionTest.java
            classlib/modules/auth/src/test/java/common/org/apache/harmony/auth/tests/javax/security/auth/login/LoginContext1Test.java
            classlib/modules/auth/src/test/java/common/org/apache/harmony/auth/tests/javax/security/auth/callback/serialization/PasswordCallbackTest.java
            classlib/modules/auth/src/test/java/common/org/apache/harmony/auth/tests/javax/security/auth/callback/serialization/LanguageCallbackTest.java
            classlib/modules/auth/src/test/java/common/org/apache/harmony/auth/tests/javax/security/auth/callback/serialization/TextInputCallbackTest.java
            classlib/modules/auth/src/test/java/common/org/apache/harmony/auth/tests/javax/security/auth/callback/serialization/TextOutputCallbackTest.java
            classlib/modules/auth/src/test/java/common/org/apache/harmony/auth/tests/javax/security/auth/callback/serialization/UnsupportedCallbackExceptionTest.java
            classlib/modules/auth/src/test/java/common/org/apache/harmony/auth/tests/javax/security/auth/callback/serialization/ConfirmationCallbackTest.java
            classlib/modules/auth/src/test/java/common/org/apache/harmony/auth/tests/javax/security/auth/callback/serialization/ChoiceCallbackTest.java
            classlib/modules/auth/src/test/java/common/org/apache/harmony/auth/tests/javax/security/auth/callback/serialization/NameCallbackTest.java
            classlib/modules/auth/src/test/java/common/org/apache/harmony/auth/tests/javax/security/auth/kerberos/serialization/KrbDelegationPermissionCollectionTest.java
            classlib/modules/auth/src/test/java/common/org/apache/harmony/auth/tests/javax/security/auth/kerberos/serialization/DelegationPermissionTest.java
            classlib/modules/auth/src/test/java/common/org/apache/harmony/auth/tests/javax/security/auth/kerberos/serialization/KrbServicePermissionCollectionTest.java
            classlib/modules/auth/src/test/java/common/org/apache/harmony/auth/tests/javax/security/auth/kerberos/serialization/ServicePermissionTest.java
            classlib/modules/auth/src/test/java/common/org/apache/harmony/auth/tests/javax/security/auth/x500/serialization/X500PrincipalTest.java
            classlib/modules/auth/src/test/java/common/org/apache/harmony/auth/tests/javax/security/auth/serialization/SubjectTest.java
            classlib/modules/auth/src/test/java/common/org/apache/harmony/auth/tests/javax/security/auth/serialization/RefreshFailedExceptionTest.java
            classlib/modules/auth/src/test/java/common/org/apache/harmony/auth/tests/javax/security/auth/serialization/AuthPermissionTest.java
            classlib/modules/auth/src/test/java/common/org/apache/harmony/auth/tests/javax/security/auth/serialization/DestroyFailedExceptionTest.java
            classlib/modules/auth/src/test/java/common/org/apache/harmony/auth/tests/javax/security/auth/serialization/PrivateCredentialPermissionTest.java
            classlib/modules/auth/src/test/java/common/org/apache/harmony/auth/tests/javax/security/sasl/Sasl1Test.java
            classlib/modules/auth/src/test/java/common/org/apache/harmony/auth/tests/javax/security/sasl/Sasl2Test.java
            classlib/modules/auth/src/test/java/common/org/apache/harmony/auth/tests/javax/security/sasl/Sasl3Test.java
            classlib/modules/auth/src/test/java/common/org/apache/harmony/auth/tests/javax/security/sasl/Sasl4Test.java
            classlib/modules/auth/src/test/java/common/org/apache/harmony/auth/tests/javax/security/sasl/serialization/SaslExceptionTest.java
            classlib/modules/auth/src/test/java/common/org/apache/harmony/auth/tests/javax/security/sasl/serialization/AuthorizeCallbackTest.java
            classlib/modules/auth/src/test/java/common/org/apache/harmony/auth/tests/javax/security/sasl/serialization/RealmChoiceCallbackTest.java
            classlib/modules/auth/src/test/java/common/org/apache/harmony/auth/tests/javax/security/sasl/serialization/RealmCallbackTest.java
            classlib/modules/auth/src/test/java/common/org/apache/harmony/auth/tests/javax/security/sasl/serialization/AuthenticationExceptionTest.java
            classlib/modules/auth/src/test/java/common/org/apache/harmony/auth/tests/support/SpiEngUtils.java
            classlib/modules/auth/src/test/java/common/org/apache/harmony/auth/tests/support/SecurityChecker.java
            classlib/modules/auth/src/test/java/common/org/ietf/jgss/GSSManagerTest.java
            classlib/modules/auth/src/test/java/windows/org/apache/harmony/auth/module/NTLoginModuleTest.java
        
****************************************************************************
Output:
****************************************************************************
Buildfile: build.xml

build:
   [delete] Deleting directory /home/hybld/continuum-working-directory/6/classlib/deploy
     [echo] Classlib revision is 464768
     [echo] Post process: true
     [echo] JAPI: true
     [echo] Building with reference jdk/javac
     [exec] Buildfile: build.xml

     [exec] clean-java:

     [exec] -copy-kernel-patternsets:
     [exec]     [mkdir] Created dir: /home/hybld/continuum-working-directory/6/classlib/deploy/build/patternsets
     [exec]      [copy] Copying 1 file to /home/hybld/continuum-working-directory/6/classlib/deploy/build/patternsets
     [exec]      [copy] Copying 1 file to /home/hybld/continuum-working-directory/6/classlib/deploy/build/patternsets

     [exec] -modules-clean-bin:

     [exec] clean:
     [exec]    [delete] /home/hybld/continuum-working-directory/6/classlib/build/classes not
found.

     [exec] clean:
     [exec]    [delete] /home/hybld/continuum-working-directory/6/classlib/build/classes not
found.

     [exec] clean:
     [exec]    [delete] /home/hybld/continuum-working-directory/6/classlib/build/classes not
found.

     [exec] clean:
     [exec]    [delete] /home/hybld/continuum-working-directory/6/classlib/build/classes not
found.

     [exec] clean-native-includes:
     [exec]    [delete] /home/hybld/continuum-working-directory/6/classlib/deploy/include
not found.

     [exec] clean:
     [exec]    [delete] /home/hybld/continuum-working-directory/6/classlib/build/classes not
found.

     [exec] clean:
     [exec]    [delete] /home/hybld/continuum-working-directory/6/classlib/build/classes not
found.

     [exec] clean:
     [exec]    [delete] /home/hybld/continuum-working-directory/6/classlib/build/classes not
found.

     [exec] clean:
     [exec]    [delete] /home/hybld/continuum-working-directory/6/classlib/build/classes not
found.
     [exec]    [delete] /home/hybld/continuum-working-directory/6/classlib/modules/concurrent/bin/test
not found.

     [exec] clean:
     [exec]    [delete] /home/hybld/continuum-working-directory/6/classlib/build/classes not
found.

     [exec] clean:
     [exec]    [delete] /home/hybld/continuum-working-directory/6/classlib/build/classes not
found.

     [exec] clean:
     [exec]    [delete] /home/hybld/continuum-working-directory/6/classlib/build/classes not
found.

     [exec] clean:
     [exec]    [delete] /home/hybld/continuum-working-directory/6/classlib/build/classes not
found.

     [exec] clean:
     [exec]    [delete] /home/hybld/continuum-working-directory/6/classlib/build/classes not
found.

     [exec] clean:
     [exec]    [delete] /home/hybld/continuum-working-directory/6/classlib/build/classes not
found.

     [exec] clean:
     [exec]    [delete] /home/hybld/continuum-working-directory/6/classlib/build/classes not
found.

     [exec] clean-native-includes:
     [exec]    [delete] /home/hybld/continuum-working-directory/6/classlib/deploy/include
not found.
     [exec]    [delete] /home/hybld/continuum-working-directory/6/classlib/deploy/jdk/include
not found.

...

     [exec] check:

     [exec] -compile:

     [exec] BUILD FAILED
     [exec] /home/hybld/continuum-working-directory/6/classlib/build.xml:108: The following
error occurred while executing this line:
     [exec] /home/hybld/continuum-working-directory/6/classlib/make/build-java.xml:128: The
Eclipse compiler class for Ant could not be found. Please place the ECJ JAR in ANT_HOME/lib.
The JAR can copied from CLASSLIB_TRUNK/depends/jars/ecj_3.2 folder after the fetch-depends
target has been run.

     [exec] Total time: 11 seconds

BUILD FAILED
/home/hybld/continuum-working-directory/6/build.xml:118: exec returned: 1

Total time: 14 seconds

****************************************************************************

...

Mime
View raw message