harmony-commits mailing list archives

Site index · List index
Message view « Date » · « Thread »
Top « Date » · « Thread »
From nom...@hursley.ibm.com
Subject [continuum] BUILD FAILURE: Classlib/linux.ia32 Build/Test
Date Tue, 17 Oct 2006 01:01:50 GMT
Online report : http://people.apache.org/~hindessm/continuum/classlib/linux.ia32/2006/10/17/20061017-010150.failure.log.gz
Build statistics:
  State: Failed
  Previous State: Error
  Started at: Tue, 17 Oct 2006 02:01:33 +0100
  Finished at: Tue, 17 Oct 2006 02:01:49 +0100
  Total time: 15s
  Build Trigger: Schedule
  Exit code: 1
  Building machine hostname: hy2
  Operating system : Linux(unknown)
  Java version : 1.5.0_06(Sun Microsystems Inc.)

Changes
                            classlib/modules/auth/src/test/java/common/org/apache/harmony/auth/login/DefaultConfigParserTest.java
            classlib/modules/auth/src/test/java/common/org/apache/harmony/auth/login/DefaultConfigurationTest.java
            classlib/modules/auth/src/test/java/common/org/apache/harmony/auth/internal/SecurityTest.java
            classlib/modules/auth/src/test/java/common/javax/security/auth/PolicyTest.java
            classlib/modules/auth/src/test/java/common/javax/security/auth/SubjectTest.java
            classlib/modules/auth/src/test/java/common/javax/security/auth/AuthPermissionTest.java
            classlib/modules/auth/src/test/java/common/javax/security/auth/kerberos/DelegationPermissionTest.java
            classlib/modules/auth/src/test/java/common/javax/security/auth/kerberos/KerberosKeyTest.java
            classlib/modules/auth/src/test/java/common/javax/security/auth/kerberos/ServicePermissionTest.java
            classlib/modules/auth/src/test/java/common/javax/security/auth/x500/X500PrivateCredentialTest.java
            classlib/modules/auth/src/test/java/common/javax/security/auth/x500/X500PrincipalTest.java
            classlib/modules/auth/src/test/java/common/javax/security/auth/PrivateCredentialPermissionTest.java
        
****************************************************************************
Output:
****************************************************************************
Buildfile: build.xml

build:
   [delete] Deleting directory /home/hybld/continuum-working-directory/6/classlib/deploy
     [echo] Classlib revision is 464761
     [echo] Post process: true
     [echo] JAPI: true
     [echo] Building with reference jdk/javac
     [exec] Buildfile: build.xml

     [exec] clean-java:

     [exec] -copy-kernel-patternsets:
     [exec]     [mkdir] Created dir: /home/hybld/continuum-working-directory/6/classlib/deploy/build/patternsets
     [exec]      [copy] Copying 1 file to /home/hybld/continuum-working-directory/6/classlib/deploy/build/patternsets
     [exec]      [copy] Copying 1 file to /home/hybld/continuum-working-directory/6/classlib/deploy/build/patternsets

     [exec] -modules-clean-bin:

     [exec] clean:
     [exec]    [delete] /home/hybld/continuum-working-directory/6/classlib/build/classes not
found.

     [exec] clean:
     [exec]    [delete] /home/hybld/continuum-working-directory/6/classlib/build/classes not
found.

     [exec] clean:
     [exec]    [delete] /home/hybld/continuum-working-directory/6/classlib/build/classes not
found.

     [exec] clean:
     [exec]    [delete] /home/hybld/continuum-working-directory/6/classlib/build/classes not
found.

     [exec] clean-native-includes:
     [exec]    [delete] /home/hybld/continuum-working-directory/6/classlib/deploy/include
not found.

     [exec] clean:
     [exec]    [delete] /home/hybld/continuum-working-directory/6/classlib/build/classes not
found.

     [exec] clean:
     [exec]    [delete] /home/hybld/continuum-working-directory/6/classlib/build/classes not
found.

     [exec] clean:
     [exec]    [delete] /home/hybld/continuum-working-directory/6/classlib/build/classes not
found.

     [exec] clean:
     [exec]    [delete] /home/hybld/continuum-working-directory/6/classlib/build/classes not
found.
     [exec]    [delete] /home/hybld/continuum-working-directory/6/classlib/modules/concurrent/bin/test
not found.

     [exec] clean:
     [exec]    [delete] /home/hybld/continuum-working-directory/6/classlib/build/classes not
found.

     [exec] clean:
     [exec]    [delete] /home/hybld/continuum-working-directory/6/classlib/build/classes not
found.

     [exec] clean:
     [exec]    [delete] /home/hybld/continuum-working-directory/6/classlib/build/classes not
found.

     [exec] clean:
     [exec]    [delete] /home/hybld/continuum-working-directory/6/classlib/build/classes not
found.

     [exec] clean:
     [exec]    [delete] /home/hybld/continuum-working-directory/6/classlib/build/classes not
found.

     [exec] clean:
     [exec]    [delete] /home/hybld/continuum-working-directory/6/classlib/build/classes not
found.

     [exec] clean:
     [exec]    [delete] /home/hybld/continuum-working-directory/6/classlib/build/classes not
found.

     [exec] clean-native-includes:
     [exec]    [delete] /home/hybld/continuum-working-directory/6/classlib/deploy/include
not found.
     [exec]    [delete] /home/hybld/continuum-working-directory/6/classlib/deploy/jdk/include
not found.

     [exec] clean:
     [exec]    [delete] /home/hybld/continuum-working-directory/6/classlib/build/classes not
found.

     [exec] clean:
     [exec]    [delete] /home/hybld/continuum-working-directory/6/classlib/build/classes not
found.

     [exec] clean:
     [exec]    [delete] /home/hybld/continuum-working-directory/6/classlib/build/classes not
found.

     [exec] clean:
     [exec]    [delete] /home/hybld/continuum-working-directory/6/classlib/build/classes not
found.
     [exec]    [delete] /home/hybld/continuum-working-directory/6/classlib/modules/nio/bin/test
not found.

     [exec] clean:
     [exec]    [delete] /home/hybld/continuum-working-directory/6/classlib/build/classes not
found.

     [exec] clean:
     [exec]    [delete] /home/hybld/continuum-working-directory/6/classlib/build/classes not
found.

     [exec] clean:
     [exec]    [delete] /home/hybld/continuum-working-directory/6/classlib/build/classes not
found.

     [exec] clean:
     [exec]    [delete] /home/hybld/continuum-working-directory/6/classlib/build/classes not
found.

     [exec] clean:
     [exec]    [delete] /home/hybld/continuum-working-directory/6/classlib/build/classes not
found.

     [exec] clean:
     [exec]    [delete] /home/hybld/continuum-working-directory/6/classlib/build/classes not
found.

     [exec] clean:
     [exec]    [delete] /home/hybld/continuum-working-directory/6/classlib/build/classes not
found.

     [exec] clean:
     [exec]    [delete] /home/hybld/continuum-working-directory/6/classlib/build/classes not
found.

     [exec] clean:
     [exec]    [delete] /home/hybld/continuum-working-directory/6/classlib/build/classes not
found.

     [exec] clean:
     [exec]    [delete] /home/hybld/continuum-working-directory/6/classlib/build/classes not
found.

     [exec] clean:
     [exec]    [delete] /home/hybld/continuum-working-directory/6/classlib/build/classes not
found.

     [exec] clean:
     [exec]    [delete] /home/hybld/continuum-working-directory/6/classlib/build/classes not
found.

     [exec] clean:
     [exec]    [delete] /home/hybld/continuum-working-directory/6/classlib/build/classes not
found.

     [exec] clean:
     [exec]    [delete] /home/hybld/continuum-working-directory/6/classlib/build/classes not
found.

     [exec] -clean-kernel-patternsets:
     [exec]    [delete] Deleting directory /home/hybld/continuum-working-directory/6/classlib/deploy/build/patternsets

     [exec] -clean-bin-catch-all-test:

     [exec] -clean-bin-catch-all:

     [exec] -clean-bin:

     [exec] -clean-layout:
     [exec]    [delete] /home/hybld/continuum-working-directory/6/classlib/deploy/jdk not
found.

     [exec] clean:

     [exec] clean-native:

     [exec] copy-makefile-includes:
     [exec]     [mkdir] Created dir: /home/hybld/continuum-working-directory/6/classlib/deploy/build/make
     [exec]      [copy] Copying 4 files to /home/hybld/continuum-working-directory/6/classlib/deploy/build/make

     [exec] -make-clean:

     [exec] clean-native:
     [exec]      [exec] rm -f ../shared/auth_copyright.o authnix.o ../libhyauth.so  

     [exec] clean-native:
     [exec]      [exec] rm -f ../shared/zcpool.o ../shared/zipalloc.o ../shared/zipcache.o
../shared/zipsup.o   /home/hybld/continuum-working-directory/6/classlib/deploy/lib/libhyzip.a
     [exec]      [exec] rm -f ../shared/zlib_copyright.o ../../zlib_dist/adler32.o ../../zlib_dist/compress.o
../../zlib_dist/crc32.o ../../zlib_dist/deflate.o ../../zlib_dist/infback.o ../../zlib_dist/inffast.o
../../zlib_dist/inflate.o ../../zlib_dist/inftrees.o ../../zlib_dist/trees.o ../../zlib_dist/uncompr.o
../../zlib_dist/zutil.o ../libhyzlib.so  
     [exec]      [exec] rm -f ../shared/archive_copyright.o ../shared/jclcrc32.o ../shared/zip.o
../shared/adler32.o ../shared/inflater.o ../shared/jarfile.o ../shared/deflater.o ../shared/archiveglob.o
../libhyarchive.so  

     [exec] clean-native:
     [exec]      [exec] rm -f ../shared/text_copyright.o ../shared/BidiWrapper.o ../libhytext.so
 

     [exec] clean-native:

     [exec] clean-native:
     [exec]      [exec] rm -f ../shared/hysig_copyright.o hysiglinux.o hysigunix.o ../libhysig.so
 
     [exec]      [exec] rm -f ../shared/libglob.o ../shared/iohelp.o ../shared/exceptions.o
../shared/strhelp.o ../shared/utf8encode.o ../shared/utf8decode.o   /home/hybld/continuum-working-directory/6/classlib/deploy/lib/libhycommon.a
     [exec]      [exec] rm -f ../shared/pool.o ../shared/pool_cap.o   /home/hybld/continuum-working-directory/6/classlib/deploy/lib/libhypool.a
     [exec]      [exec] rm -f ../shared/thread_copyright.o x86/thrhelp.o x86/thrspinlock.o
hythread.o ../shared/hythreadinspect.o linuxonexit.o priority.o rasthrsup.o ../shared/rwmutex.o
thrcreate.o thrdsup.o ../shared/thrprof.o ../libhythr.so  
     [exec]      [exec] rm -f ../shared/port_copyright.o hycpu.o ../shared/hyerror.o hyerrorhelpers.o
../shared/hyexit.o hyfile.o hyfiletext.o ../shared/hygp.o hyipcmutex.o hymem.o hymmap.o ../shared/hynls.o
hynlshelpers.o hyosdump.o ../shared/hyport.o ../shared/hyportcontrol.o hyportptb.o hysharedhelper.o
hyshmem.o hyshsem.o hysignal.o hysl.o hysock.o ../shared/hystr.o ../shared/hystrftime.o ../shared/hystsl.o
hysysinfo.o hytime.o ../shared/hytlshelpers.o hytty.o hyvmem.o ../libhyprt.so  /home/hybld/continuum-working-directory/6/classlib/deploy/lib/libhyprt.a

...

     [exec] check:

     [exec] -compile:

     [exec] BUILD FAILED
     [exec] /home/hybld/continuum-working-directory/6/classlib/build.xml:108: The following
error occurred while executing this line:
     [exec] /home/hybld/continuum-working-directory/6/classlib/make/build-java.xml:128: The
Eclipse compiler class for Ant could not be found. Please place the ECJ JAR in ANT_HOME/lib.
The JAR can copied from CLASSLIB_TRUNK/depends/jars/ecj_3.2 folder after the fetch-depends
target has been run.

     [exec] Total time: 11 seconds

BUILD FAILED
/home/hybld/continuum-working-directory/6/build.xml:118: exec returned: 1

Total time: 14 seconds

****************************************************************************

...

Mime
View raw message