harmony-commits mailing list archives

Site index · List index
Message view « Date » · « Thread »
Top « Date » · « Thread »
From Apache Harmony Build <nom...@hursley.ibm.com>
Subject [continuum] BUILD FAILURE: Classlib/linux.ia32 Build/Test
Date Mon, 25 Sep 2006 08:02:12 GMT
Online report : http://ibmonly.hursley.ibm.com/continuum/linux.ia32/servlet/continuum/target/ProjectBuild.vm/view/ProjectBuild/id/6/buildId/5763
Build statistics:
  State: Failed
  Previous State: Ok
  Started at: Mon, 25 Sep 2006 09:01:37 +0100
  Finished at: Mon, 25 Sep 2006 09:02:10 +0100
  Total time: 33s
  Build Trigger: Schedule
  Exit code: 1
  Building machine hostname: hy2
  Operating system : Linux(unknown)
  Java version : 1.5.0_06(Sun Microsystems Inc.)

Changes
                            classlib/make/depends.xml
            classlib/make/depends.properties
        
****************************************************************************
Output:
****************************************************************************
Buildfile: build.xml

build:
   [delete] Deleting directory /home/hybld/continuum-working-directory/6/classlib/deploy
     [echo] Classlib revision is 449596
     [echo] Post process: true
     [echo] JAPI: true
     [echo] Building with reference jdk/javac
     [exec] Buildfile: build.xml

     [exec] clean-java:

     [exec] clean-bin:

     [exec] call-modules-all:

     [exec] clean:
     [exec]    [delete] Excludesfile /home/hybld/continuum-working-directory/6/classlib/deploy/build/patternsets/luni-kernel.txt
not found.
     [exec]    [delete] Deleting 15 files from /home/hybld/continuum-working-directory/6/classlib/modules/accessibility/bin/test

     [exec] clean:
     [exec]    [delete] Excludesfile /home/hybld/continuum-working-directory/6/classlib/deploy/build/patternsets/luni-kernel.txt
not found.

     [exec] clean:
     [exec]    [delete] Excludesfile /home/hybld/continuum-working-directory/6/classlib/deploy/build/patternsets/luni-kernel.txt
not found.
     [exec]    [delete] Deleting 1 files from /home/hybld/continuum-working-directory/6/classlib/modules/applet/bin/test

     [exec] clean:
     [exec]    [delete] Excludesfile /home/hybld/continuum-working-directory/6/classlib/deploy/build/patternsets/luni-kernel.txt
not found.
     [exec]    [delete] Deleting 41 files from /home/hybld/continuum-working-directory/6/classlib/modules/archive/bin/test

     [exec] clean-native-includes:
     [exec]    [delete] /home/hybld/continuum-working-directory/6/classlib/deploy/include
not found.

     [exec] clean:
     [exec]    [delete] Excludesfile /home/hybld/continuum-working-directory/6/classlib/deploy/build/patternsets/luni-kernel.txt
not found.
     [exec]    [delete] Deleting 214 files from /home/hybld/continuum-working-directory/6/classlib/modules/auth/bin/test

     [exec] clean:
     [exec]    [delete] Excludesfile /home/hybld/continuum-working-directory/6/classlib/deploy/build/patternsets/luni-kernel.txt
not found.
     [exec]    [delete] Deleting 569 files from /home/hybld/continuum-working-directory/6/classlib/modules/awt/bin/test

     [exec] clean:
     [exec]    [delete] Excludesfile /home/hybld/continuum-working-directory/6/classlib/deploy/build/patternsets/luni-kernel.txt
not found.
     [exec]    [delete] Deleting 233 files from /home/hybld/continuum-working-directory/6/classlib/modules/beans/bin/test

     [exec] clean:
     [exec]    [delete] Excludesfile /home/hybld/continuum-working-directory/6/classlib/deploy/build/patternsets/luni-kernel.txt
not found.
     [exec]    [delete] /home/hybld/continuum-working-directory/6/classlib/modules/concurrent/bin/test
not found.

     [exec] clean:
     [exec]    [delete] Excludesfile /home/hybld/continuum-working-directory/6/classlib/deploy/build/patternsets/luni-kernel.txt
not found.
     [exec]    [delete] Deleting 88 files from /home/hybld/continuum-working-directory/6/classlib/modules/crypto/bin/test

     [exec] clean:
     [exec]    [delete] Excludesfile /home/hybld/continuum-working-directory/6/classlib/deploy/build/patternsets/luni-kernel.txt
not found.
     [exec]    [delete] Deleting 20 files from /home/hybld/continuum-working-directory/6/classlib/modules/instrument/bin/test

     [exec] clean:
     [exec]    [delete] Excludesfile /home/hybld/continuum-working-directory/6/classlib/deploy/build/patternsets/luni-kernel.txt
not found.
     [exec]    [delete] Deleting 162 files from /home/hybld/continuum-working-directory/6/classlib/modules/jndi/bin/test

     [exec] clean:
     [exec]    [delete] Excludesfile /home/hybld/continuum-working-directory/6/classlib/deploy/build/patternsets/luni-kernel.txt
not found.
     [exec]    [delete] Deleting 2 files from /home/hybld/continuum-working-directory/6/classlib/modules/lang-management/bin/test

     [exec] clean:
     [exec]    [delete] Excludesfile /home/hybld/continuum-working-directory/6/classlib/deploy/build/patternsets/luni-kernel.txt
not found.
     [exec]    [delete] Deleting 95 files from /home/hybld/continuum-working-directory/6/classlib/modules/logging/bin/test

     [exec] clean:

     [exec] clean:
     [exec]    [delete] Excludesfile /home/hybld/continuum-working-directory/6/classlib/deploy/build/patternsets/luni-kernel.txt
not found.
     [exec]    [delete] Deleting 719 files from /home/hybld/continuum-working-directory/6/classlib/modules/luni/bin/test

     [exec] clean-native-includes:
     [exec]    [delete] /home/hybld/continuum-working-directory/6/classlib/deploy/include
not found.
     [exec]    [delete] /home/hybld/continuum-working-directory/6/classlib/deploy/jdk/include
not found.

     [exec] clean:
     [exec]    [delete] Excludesfile /home/hybld/continuum-working-directory/6/classlib/deploy/build/patternsets/luni-kernel.txt
not found.
     [exec]    [delete] Deleting 24 files from /home/hybld/continuum-working-directory/6/classlib/modules/math/bin/test

     [exec] clean:
     [exec]    [delete] Excludesfile /home/hybld/continuum-working-directory/6/classlib/deploy/build/patternsets/luni-kernel.txt
not found.

     [exec] clean:
     [exec]    [delete] Excludesfile /home/hybld/continuum-working-directory/6/classlib/deploy/build/patternsets/luni-kernel.txt
not found.
     [exec]    [delete] Deleting 160 files from /home/hybld/continuum-working-directory/6/classlib/modules/nio/bin/test
     [exec]    [delete] Deleted 19 directories from /home/hybld/continuum-working-directory/6/classlib/modules/nio/bin/test

     [exec] clean:
     [exec]    [delete] Excludesfile /home/hybld/continuum-working-directory/6/classlib/deploy/build/patternsets/luni-kernel.txt
not found.
     [exec]    [delete] Deleting 77 files from /home/hybld/continuum-working-directory/6/classlib/modules/nio_char/bin/test

     [exec] clean:
     [exec]    [delete] Excludesfile /home/hybld/continuum-working-directory/6/classlib/deploy/build/patternsets/luni-kernel.txt
not found.
     [exec]    [delete] Deleting 34 files from /home/hybld/continuum-working-directory/6/classlib/modules/prefs/bin/test

     [exec] clean:
     [exec]    [delete] Excludesfile /home/hybld/continuum-working-directory/6/classlib/deploy/build/patternsets/luni-kernel.txt
not found.
     [exec]    [delete] Deleting 12 files from /home/hybld/continuum-working-directory/6/classlib/modules/regex/bin/test

     [exec] clean:
     [exec]    [delete] Excludesfile /home/hybld/continuum-working-directory/6/classlib/deploy/build/patternsets/luni-kernel.txt
not found.
     [exec]    [delete] Deleting 39 files from /home/hybld/continuum-working-directory/6/classlib/modules/rmi/bin/test

     [exec] clean:

     [exec] clean:
     [exec]    [delete] Excludesfile /home/hybld/continuum-working-directory/6/classlib/deploy/build/patternsets/luni-kernel.txt
not found.
     [exec]    [delete] Deleting 516 files from /home/hybld/continuum-working-directory/6/classlib/modules/security/bin/test

     [exec] clean:
     [exec]    [delete] Excludesfile /home/hybld/continuum-working-directory/6/classlib/deploy/build/patternsets/luni-kernel.txt
not found.
     [exec]    [delete] Deleting 34 files from /home/hybld/continuum-working-directory/6/classlib/modules/sound/bin/test

     [exec] clean:
     [exec]    [delete] Excludesfile /home/hybld/continuum-working-directory/6/classlib/deploy/build/patternsets/luni-kernel.txt
not found.
     [exec]    [delete] Deleting 76 files from /home/hybld/continuum-working-directory/6/classlib/modules/sql/bin/test

     [exec] clean:
     [exec]    [delete] Excludesfile /home/hybld/continuum-working-directory/6/classlib/deploy/build/patternsets/luni-kernel.txt
not found.

     [exec] clean:
     [exec]    [delete] Excludesfile /home/hybld/continuum-working-directory/6/classlib/deploy/build/patternsets/luni-kernel.txt
not found.
     [exec]    [delete] Deleting 1521 files from /home/hybld/continuum-working-directory/6/classlib/modules/swing/bin/test

     [exec] clean:
     [exec]    [delete] Excludesfile /home/hybld/continuum-working-directory/6/classlib/deploy/build/patternsets/luni-kernel.txt
not found.
     [exec]    [delete] Deleting 33 files from /home/hybld/continuum-working-directory/6/classlib/modules/text/bin/test

     [exec] clean:
     [exec]    [delete] Excludesfile /home/hybld/continuum-working-directory/6/classlib/deploy/build/patternsets/luni-kernel.txt
not found.
     [exec]    [delete] Deleting 1 files from /home/hybld/continuum-working-directory/6/classlib/modules/tools/bin/test

     [exec] clean:
     [exec]    [delete] Excludesfile /home/hybld/continuum-working-directory/6/classlib/deploy/build/patternsets/luni-kernel.txt
not found.
     [exec]    [delete] Deleting 52 files from /home/hybld/continuum-working-directory/6/classlib/modules/x-net/bin/test

     [exec] call-modules-one:

     [exec] clean-kernel-patternsets:
     [exec]    [delete] Deleting 5509 files from /home/hybld/continuum-working-directory/6/classlib/build/classes
     [exec]    [delete] Deleted 276 directories from /home/hybld/continuum-working-directory/6/classlib/build/classes

     [exec] clean-layout:
     [exec]    [delete] /home/hybld/continuum-working-directory/6/classlib/deploy/jdk not
found.

     [exec] clean:

     [exec] clean-native:

     [exec] copy-makefile-includes:
     [exec]     [mkdir] Created dir: /home/hybld/continuum-working-directory/6/classlib/deploy/build/make
     [exec]      [copy] Copying 4 files to /home/hybld/continuum-working-directory/6/classlib/deploy/build/make

     [exec] -make-clean:

     [exec] clean-native:
     [exec]      [exec] rm -f ../shared/auth_copyright.o authnix.o ../libhyauth.so  

     [exec] clean-native:
     [exec]      [exec] rm -f ../shared/zcpool.o ../shared/zipalloc.o ../shared/zipcache.o
../shared/zipsup.o   /home/hybld/continuum-working-directory/6/classlib/deploy/lib/libhyzip.a
     [exec]      [exec] rm -f ../shared/zlib_copyright.o ../../zlib_dist/adler32.o ../../zlib_dist/compress.o
../../zlib_dist/crc32.o ../../zlib_dist/deflate.o ../../zlib_dist/infback.o ../../zlib_dist/inffast.o
../../zlib_dist/inflate.o ../../zlib_dist/inftrees.o ../../zlib_dist/trees.o ../../zlib_dist/uncompr.o
../../zlib_dist/zutil.o ../libhyzlib.so  
     [exec]      [exec] rm -f ../shared/archive_copyright.o ../shared/jclcrc32.o ../shared/zip.o
../shared/adler32.o ../shared/inflater.o ../shared/jarfile.o ../shared/deflater.o ../shared/archiveglob.o
../libhyarchive.so  

     [exec] clean-native:
     [exec]      [exec] rm -f ../shared/text_copyright.o ../shared/BidiWrapper.o ../libhytext.so
 

     [exec] clean-native:

     [exec] clean-native:
     [exec]      [exec] rm -f ../shared/hysig_copyright.o hysiglinux.o hysigunix.o ../libhysig.so
 
     [exec]      [exec] rm -f ../shared/libglob.o ../shared/iohelp.o ../shared/exceptions.o
../shared/strhelp.o ../shared/utf8encode.o ../shared/utf8decode.o   /home/hybld/continuum-working-directory/6/classlib/deploy/lib/libhycommon.a
     [exec]      [exec] rm -f ../shared/pool.o ../shared/pool_cap.o   /home/hybld/continuum-working-directory/6/classlib/deploy/lib/libhypool.a
     [exec]      [exec] rm -f ../shared/thread_copyright.o x86/thrhelp.o x86/thrspinlock.o
hythread.o ../shared/hythreadinspect.o linuxonexit.o priority.o rasthrsup.o ../shared/rwmutex.o
thrcreate.o thrdsup.o ../shared/thrprof.o ../libhythr.so  
     [exec]      [exec] rm -f ../shared/port_copyright.o hycpu.o ../shared/hyerror.o hyerrorhelpers.o
../shared/hyexit.o hyfile.o hyfiletext.o ../shared/hygp.o hyipcmutex.o hymem.o hymmap.o ../shared/hynls.o
hynlshelpers.o hyosdump.o ../shared/hyport.o ../shared/hyportcontrol.o hyportptb.o hysharedhelper.o
hyshmem.o hyshsem.o hysignal.o hysl.o hysock.o ../shared/hystr.o ../shared/hystrftime.o ../shared/hystsl.o
hysysinfo.o hytime.o ../shared/hytlshelpers.o hytty.o hyvmem.o ../libhyprt.so  /home/hybld/continuum-working-directory/6/classlib/deploy/lib/libhyprt.a
     [exec]      [exec] rm -f ../../fdlibm_dist/e_acos.o ../../fdlibm_dist/e_acosh.o ../../fdlibm_dist/e_asin.o
../../fdlibm_dist/e_atan2.o ../../fdlibm_dist/e_atanh.o ../../fdlibm_dist/e_cosh.o ../../fdlibm_dist/e_exp.o
../../fdlibm_dist/e_fmod.o ../../fdlibm_dist/e_gamma.o ../../fdlibm_dist/e_gamma_r.o ../../fdlibm_dist/e_hypot.o
../../fdlibm_dist/e_j0.o ../../fdlibm_dist/e_j1.o ../../fdlibm_dist/e_jn.o ../../fdlibm_dist/e_lgamma.o
../../fdlibm_dist/e_lgamma_r.o ../../fdlibm_dist/e_log.o ../../fdlibm_dist/e_log10.o ../../fdlibm_dist/e_pow.o
../../fdlibm_dist/e_rem_pio2.o ../../fdlibm_dist/e_remainder.o ../../fdlibm_dist/e_scalb.o
../../fdlibm_dist/e_sinh.o ../../fdlibm_dist/e_sqrt.o ../../fdlibm_dist/k_cos.o ../../fdlibm_dist/k_rem_pio2.o
../../fdlibm_dist/k_sin.o ../../fdlibm_dist/k_standard.o ../../fdlibm_dist/k_tan.o ../../fdlibm_dist/s_asinh.o
../../fdlibm_dist/s_atan.o ../../fdlibm_dist/s_cbrt.o ../../fdlibm_dist/s_ceil.o ../../fdlibm_dist/s_copysign.o
../../fdlibm_dist/s_cos.o ../../fdlibm_dist/s_erf.o ../../fdlibm_dist/s_expm1.o ../../fdlibm_dist/s_fabs.o
../../fdlibm_dist/s_finite.o ../../fdlibm_dist/s_floor.o ../../fdlibm_dist/s_frexp.o ../../fdlibm_dist/s_ilogb.o
../../fdlibm_dist/s_isnan.o ../../fdlibm_dist/s_ldexp.o ../shared/s_lib_version.o ../../fdlibm_dist/s_log1p.o
../../fdlibm_dist/s_logb.o ../../fdlibm_dist/s_matherr.o ../../fdlibm_dist/s_modf.o ../../fdlibm_dist/s_nextafter.o
../../fdlibm_dist/s_rint.o ../../fdlibm_dist/s_scalbn.o ../../fdlibm_dist/s_signgam.o ../../fdlibm_dist/s_significand.o
../../fdlibm_dist/s_sin.o ../../fdlibm_dist/s_tan.o ../../fdlibm_dist/s_tanh.o ../../fdlibm_dist/w_acos.o
../../fdlibm_dist/w_acosh.o ../../fdlibm_dist/w_asin.o ../../fdlibm_dist/w_atan2.o ../../fdlibm_dist/w_atanh.o
../../fdlibm_dist/w_cosh.o ../../fdlibm_dist/w_exp.o ../../fdlibm_dist/w_fmod.o ../../fdlibm_dist/w_gamma.o
../../fdlibm_dist/w_gamma_r.o ../../fdlibm_dist/w_hypot.o ../../fdlibm_dist/w_j0.o ../../fdlibm_dist/w_j1.o
../../fdlibm_dist/w_jn.o ../../fdlibm_dist/w_lgamma.o ../../fdlibm_dist/w_lgamma_r.o ../../fdlibm_dist/w_log.o
../../fdlibm_dist/w_log10.o ../../fdlibm_dist/w_pow.o ../../fdlibm_dist/w_remainder.o ../../fdlibm_dist/w_scalb.o
../../fdlibm_dist/w_sinh.o ../../fdlibm_dist/w_sqrt.o   /home/hybld/continuum-working-directory/6/classlib/deploy/lib/libhyfdlibm.a
     [exec]      [exec] rm -f ../shared/vmi_copyright.o ../shared/vmi.o ../libvmi.so  
     [exec]      [exec] rm -f ../shared/luni_copyright.o ../shared/file.o procimpl.o ../shared/oos.o
../shared/nethelp.o ../shared/floatbits.o ../shared/ois.o helpers.o ../shared/math.o ../shared/luniglob.o
../shared/proxy.o ../shared/cbigint.o ../shared/dblparse.o ../shared/fltparse.o ../shared/netif.o
../shared/process.o ../shared/bigint.o ../shared/osc.o ../shared/socket.o ../shared/inetadds.o
../shared/filedesc.o ../shared/timezone.o ../shared/OSFileSystem.o OSFileSystemLinux32.o OSMemory.o
OSMemoryLinux32.o ../shared/OSNetworkSystem.o OSNetworkSystemLinux.o hyenv.o ../libhyluni.so
 
     [exec]      [exec] rm -f ../shared/vmls.o   /home/hybld/continuum-working-directory/6/classlib/deploy/lib/libhyvmls.a
     [exec]      [exec] rm -f ../shared/main.o ../shared/cmain.o ../shared/launcher_copyright.o
../shared/strbuf.o ../shared/libhlp.o    ../java 

     [exec] clean-native:
     [exec]      [exec] rm -f ../shared/DirectBufferUtil.o ../shared/AddressUtil.o  ../libhynio.so
 

     [exec] clean-native:
     [exec]      [exec] rm -f ../shared/org_apache_harmony_misc_accessors_ArrayAccessorImpl.o
../shared/org_apache_harmony_misc_accessors_Malloc.o ../shared/org_apache_harmony_misc_accessors_MemoryAccessorNativeImpl.o
../shared/org_apache_harmony_misc_accessors_ObjectAccessorImpl.o ../shared/org_apache_harmony_misc_accessors_StringAccessorImpl.o
../libaccessors.so  

     [exec] -clean-native-linux:
     [exec]      [exec] rm -f org_apache_harmony_awt_nativebridge_linux_ErrorHandler.o org_apache_harmony_awt_nativebridge_linux_GLX.o
org_apache_harmony_awt_nativebridge_linux_X11.o org_apache_harmony_awt_nativebridge_linux_Xft.o
../libX11Wrapper.so  
     [exec]      [exec] rm -f LinuxNativeFont.o ../liblinuxfont.so  

     [exec] -clean-native-windows:

     [exec] clean-native:
     [exec]      [exec] rm -f ../shared//cmmerror.o ../shared//cmmio.o ../shared//cmmxforms.o
../shared//NativeCMM.o ../shared//NativeImageFormat.o liblcms.a ../liblcmm.so  
     [exec]      [exec] rm -f ../shared//JpegDecoder.o libjpeg.a ../libjpegdecoder.so  
     [exec]      [exec] rm -f ../shared//blitter.o ../shared//gifdecoder.o ../shared//LUTTables.o
../shared//pngdecoder.o ../shared//SurfaceDataStructure.o libpng.a ../libgl.so  

     [exec] clean-native:

     [exec] clean-native:
     [exec]      [exec] rm -f ../shared/instrument.o ../shared/inst_agt.o  ../libhyinstrument.so
 

     [exec] clean-makefile-includes:
     [exec]    [delete] Deleting directory /home/hybld/continuum-working-directory/6/classlib/deploy/build/make

     [exec] make-clean:

     [exec] clean-includes:

     [exec] clean-native-includes:
     [exec]    [delete] /home/hybld/continuum-working-directory/6/classlib/deploy/include
not found.

     [exec] clean-native-includes:
     [exec]    [delete] /home/hybld/continuum-working-directory/6/classlib/deploy/include
not found.
     [exec]    [delete] /home/hybld/continuum-working-directory/6/classlib/deploy/jdk/include
not found.

     [exec] clean-overlay-oss:

     [exec] clean-overlay-oss:
     [exec]    [delete] Deleting directory /home/hybld/continuum-working-directory/6/classlib/modules/luni/src/main/native/fdlibm_dist

     [exec] clean-overlay-oss:
     [exec]    [delete] Deleting directory /home/hybld/continuum-working-directory/6/classlib/modules/archive/src/main/native/zlib_dist

     [exec] clean-overlay-oss:
     [exec]    [delete] Deleting directory /home/hybld/continuum-working-directory/6/classlib/modules/text/src/main/native/icu4c

     [exec] clean-layout:
     [exec]    [delete] /home/hybld/continuum-working-directory/6/classlib/deploy/jdk not
found.

     [exec] clean:

     [exec] clean:

     [exec] build-java:
     [exec]      [echo] 
     [exec]      [echo] ========================================
     [exec]      [echo] Building Java component archives...
     [exec]      [echo] ========================================
     [exec]      [echo]         

     [exec] copy-kernel-patternsets:
     [exec]     [mkdir] Created dir: /home/hybld/continuum-working-directory/6/classlib/deploy/build/patternsets
     [exec]      [copy] Copying 1 file to /home/hybld/continuum-working-directory/6/classlib/deploy/build/patternsets
     [exec]      [copy] Copying 1 file to /home/hybld/continuum-working-directory/6/classlib/deploy/build/patternsets

     [exec] prepare-depends:

     [exec] check:
     [exec]      [echo] Checking for depends/jars/yoko/yoko.jar
     [exec]      [echo] Checking for depends/jars/xalan-j_2.7.0/xalan.jar
     [exec]      [echo] Checking for depends/jars/xerces_2.8.0/resolver.jar
     [exec]      [echo] Checking for depends/jars/xerces_2.8.0/xercesImpl.jar
     [exec]      [echo] Checking for depends/jars/xerces_2.8.0/xml-apis.jar
     [exec]      [echo] Checking for depends/jars/junit_3.8.2/junit.jar
     [exec]      [echo] Checking for depends/jars/bcprov-jdk14-133/signed.bcprov.jar
     [exec]      [echo] Checking for depends/jars/icu4j_3.4.4/icu4j_3_4_4.jar
     [exec]      [echo] Checking for depends/jars/mx4j_3.0.1/mx4j.jar
     [exec]      [echo] Checking for depends/jars/mx4j_3.0.1/mx4j-remote.jar
     [exec]      [echo] Checking for depends/jars/ecj_3.2/ecj_3.2.jar
     [exec]      [echo] Checking for depends/jars/jetty/jetty-6.0.0.jar

     [exec] BUILD FAILED
     [exec] /home/hybld/continuum-working-directory/6/classlib/build.xml:106: The following
error occurred while executing this line:
     [exec] /home/hybld/continuum-working-directory/6/classlib/make/build-java.xml:216: The
following error occurred while executing this line:
     [exec] /home/hybld/continuum-working-directory/6/classlib/make/depends.xml:55: The following
error occurred while executing this line:
     [exec] /home/hybld/continuum-working-directory/6/classlib/make/depends.xml:180: ...

     [exec] Missing dependency.  The jar from:

     [exec]   http://www.ibiblio.org/maven2/jetty/jetty/6.0.0/jetty-6.0.0.jar

     [exec] should be downloaded to:

     [exec]   depends/jars/jetty/jetty-6.0.0.jar

     [exec] Run "ant fetch-depends" to automatically fetch dependencies.
     [exec] Note: Some of Harmony's dependencies are licensed under terms other
     [exec] than the Apache License v2.

     [exec] Total time: 27 seconds

BUILD FAILED
/home/hybld/continuum-working-directory/6/build.xml:118: exec returned: 1

Total time: 32 seconds

****************************************************************************



Mime
View raw message